Tools and Tasks tests for Python 3.13
Build: #201 failed Child of CASASPECS-MASTERBUILDCASALITH-304
Build result summary
Details
- Completed
- Queue duration
- < 1 second
- Duration
- 11 minutes
- Labels
- None
- Revisions
-
- CASA6
-
188b64ce030a360ced17720a68d5af3bbcffaf87
- OPEN-CASA-PKG
-
e5285e68467f01199807a1f1a978aec8a4781be7
- Total tests
- 4
- Fixed in
- #202 (Child of CASASPECS-MASTERBUILDCASALITH-305)
Tests
- 4 New failures
- 0 Existing failures
- 0 Fixed
Responsible
-
Hendrik Muller
Automatically assigned
-
Josh Marvil
Automatically assigned
-
Pedro Salas
Automatically assigned
Code commits
| Author | Commit | Commit date | |
|---|---|---|---|
|
|
Hendrik Muller |
188b64ce030a360ced17720a68d5af3bbcffaf87
|
|
|
|
Pedro Salas |
8ca181ea8b5daf488359c49d744599e4302dfbd7
|
|
|
|
Josh Marvil |
34d567c5c93cd1dae16b774940f3d95bae3e5ef3
|
|
|
|
Pedro Salas <salas.mz@gmail.com> |
4bd0cbff4d3f2555e1a79f5cbcb9fff118faebe2
m |
|
|
|
Pedro Salas <salas.mz@gmail.com> |
17ec87ce27d53622ff803ee2b4fb28f03cd0187b
m |
|
Tests
| Status | Test | View job | Duration | |
|---|---|---|---|---|
| Collapse |
pytest
internal
|
Test Tasks Many Linux 2.28 Rocky 8.10 Py3.13 | < 1 sec | |
internal error
Traceback (most recent call last):
File "/home/casatest/venv/lib/python3.13/site-packages/_pytest/main.py", line 333, in wrap_session
session.exitstatus = doit(config, session) or 0
~~~~^^^^^^^^^^^^^^^^^
File "/home/casatest/venv/lib/python3.13/site-packages/_pytest/main.py", line 387, in _main
config.hook.pytest_runtestloop(session=session)
~~~~~~~~~~~~~~~~~~~~~~~~~~~~~~^^^^^^^^^^^^^^^^^
(71 more lines...)
|
||||
| Collapse |
pytest
internal
|
Test Tasks ARM macOS15 Py3.13 | < 1 sec | |
internal error
Traceback (most recent call last):
File "/Users/casaci/bamboohome/xml-data/build-dir/CASASPECS-MASTERTESTPY313-TTARMM15PY313/casa6testenv/lib/python3.13/site-packages/_pytest/main.py", line 333, in wrap_session
session.exitstatus = doit(config, session) or 0
~~~~^^^^^^^^^^^^^^^^^
File "/Users/casaci/bamboohome/xml-data/build-dir/CASASPECS-MASTERTESTPY313-TTARMM15PY313/casa6testenv/lib/python3.13/site-packages/_pytest/main.py", line 387, in _main
config.hook.pytest_runtestloop(session=session)
~~~~~~~~~~~~~~~~~~~~~~~~~~~~~~^^^^^^^^^^^^^^^^^
(71 more lines...)
|
||||
| Collapse |
pytest
internal
|
Test Tools ARM macOS15 Py3.13 | < 1 sec | |
internal error
Traceback (most recent call last):
File "/Users/casaci/bamboohome/xml-data/build-dir/CASASPECS-MASTERTESTPY313-TTOARM15PY313/casa6testenv/lib/python3.13/site-packages/_pytest/main.py", line 333, in wrap_session
session.exitstatus = doit(config, session) or 0
~~~~^^^^^^^^^^^^^^^^^
File "/Users/casaci/bamboohome/xml-data/build-dir/CASASPECS-MASTERTESTPY313-TTOARM15PY313/casa6testenv/lib/python3.13/site-packages/_pytest/main.py", line 387, in _main
config.hook.pytest_runtestloop(session=session)
~~~~~~~~~~~~~~~~~~~~~~~~~~~~~~^^^^^^^^^^^^^^^^^
(71 more lines...)
|
||||
| Collapse |
pytest
internal
|
Test Tools Many Linux 2.28 Rocky 8.10 Py3.13 | < 1 sec | |
internal error
Traceback (most recent call last):
File "/home/casatest/venv/lib/python3.13/site-packages/_pytest/main.py", line 333, in wrap_session
session.exitstatus = doit(config, session) or 0
~~~~^^^^^^^^^^^^^^^^^
File "/home/casatest/venv/lib/python3.13/site-packages/_pytest/main.py", line 387, in _main
config.hook.pytest_runtestloop(session=session)
~~~~~~~~~~~~~~~~~~~~~~~~~~~~~~^^^^^^^^^^^^^^^^^
(71 more lines...)
|
||||
Jira issues
| Issue | Description | Status | |
|---|---|---|---|
| Unknown Issue Type | CAS-14719 | Could not obtain issue details from Jira | |
| Unknown Issue Type | CAS-14782 | Could not obtain issue details from Jira | |
| Unknown Issue Type | CAS-14893 | Could not obtain issue details from Jira | |