Tools and Tasks tests for Python 3.13
Build: #201 failed
Job: Test Tasks Many Linux 2.28 Rocky 8.10 Py3.13 failed
Job result summary
- Completed
- Duration
- 2 minutes
- Agent
- casaci-4.cv.nrao.edu test agent5
- Revision
-
188b64ce030a360ced17720a68d5af3bbcffaf87
- Total tests
- 1
- Fixed in
- #202 (Child of CASASPECS-MASTERBUILDCASALITH-305)
Tests
- 1 test in total
- 1 test failed
- 1 failure is new
- < 1 second taken in total.
| Status | Test | Duration | |
|---|---|---|---|
| Collapse |
pytest
internal
|
< 1 sec | |
internal error
Traceback (most recent call last):
File "/home/casatest/venv/lib/python3.13/site-packages/_pytest/main.py", line 333, in wrap_session
session.exitstatus = doit(config, session) or 0
~~~~^^^^^^^^^^^^^^^^^
File "/home/casatest/venv/lib/python3.13/site-packages/_pytest/main.py", line 387, in _main
config.hook.pytest_runtestloop(session=session)
~~~~~~~~~~~~~~~~~~~~~~~~~~~~~~^^^^^^^^^^^^^^^^^
(71 more lines...)
|
|||
Error summary
The build generated some errors. See the full build log for more details.
Error response from daemon: No such container: wheel-container-test-153550853
Error response from daemon: No such container: wheel-container-test-153550853
% Total % Received % Xferd Average Speed Time Time Time Current
Dload Upload Total Spent Left Speed
0 0 0 0 0 0 0 0 --:--:-- --:--:-- --:--:-- 0
100 6002k 100 6002k 0 0 99.3M 0 --:--:-- --:--:-- --:--:-- 99.3M
[485497] Failed to execute script 'atlutil' due to unhandled exception!
Traceback (most recent call last):
File "atlutil.py", line 200, in <module>
File "atlutil.py", line 165, in has_fix_version
KeyError: 'fields'
Already on 'master'
Error response from daemon: No such container: wheel-container-test-153550853
% Total % Received % Xferd Average Speed Time Time Time Current
Dload Upload Total Spent Left Speed
0 0 0 0 0 0 0 0 --:--:-- --:--:-- --:--:-- 0
100 6002k 100 6002k 0 0 99.3M 0 --:--:-- --:--:-- --:--:-- 99.3M
[485497] Failed to execute script 'atlutil' due to unhandled exception!
Traceback (most recent call last):
File "atlutil.py", line 200, in <module>
File "atlutil.py", line 165, in has_fix_version
KeyError: 'fields'
Already on 'master'