Tools and Tasks tests for Python 3.13
Build: #201 failed
Job: Test Tasks ARM macOS15 Py3.13 failed
Job result summary
- Completed
- Duration
- 5 minutes
- Agent
- cbt-macos15-test-m4-1
- Revision
-
188b64ce030a360ced17720a68d5af3bbcffaf87
- Total tests
- 1
- Fixed in
- #202 (Child of CASASPECS-MASTERBUILDCASALITH-305)
Tests
- 1 test in total
- 1 test failed
- 1 failure is new
- < 1 second taken in total.
| Status | Test | Duration | |
|---|---|---|---|
| Collapse |
pytest
internal
|
< 1 sec | |
internal error
Traceback (most recent call last):
File "/Users/casaci/bamboohome/xml-data/build-dir/CASASPECS-MASTERTESTPY313-TTARMM15PY313/casa6testenv/lib/python3.13/site-packages/_pytest/main.py", line 333, in wrap_session
session.exitstatus = doit(config, session) or 0
~~~~^^^^^^^^^^^^^^^^^
File "/Users/casaci/bamboohome/xml-data/build-dir/CASASPECS-MASTERTESTPY313-TTARMM15PY313/casa6testenv/lib/python3.13/site-packages/_pytest/main.py", line 387, in _main
config.hook.pytest_runtestloop(session=session)
~~~~~~~~~~~~~~~~~~~~~~~~~~~~~~^^^^^^^^^^^^^^^^^
(71 more lines...)
|
|||
Error summary
The build generated some errors. See the full build log for more details.
% Total % Received % Xferd Average Speed Time Time Time Current
Dload Upload Total Spent Left Speed
0 0 0 0 0 0 0 0 --:--:-- --:--:-- --:--:-- 0
100 6554k 100 6554k 0 0 71.2M 0 --:--:-- --:--:-- --:--:-- 71.9M
arch: posix_spawnp: ./atlutil: Bad CPU type in executable
% Total % Received % Xferd Average Speed Time Time Time Current
Dload Upload Total Spent Left Speed
0 0 0 0 0 0 0 0 --:--:-- --:--:-- --:--:-- 0
100 201 100 201 0 0 8281 0 --:--:-- --:--:-- --:--:-- 8375
% Total % Received % Xferd Average Speed Time Time Time Current
Dload Upload Total Spent Left Speed
0 0 0 0 0 0 0 0 --:--:-- --:--:-- --:--:-- 0
100 511 100 511 0 0 22281 0 --:--:-- --:--:-- --:--:-- 23227
Already on 'master'
Traceback (most recent call last):
File "/Users/casaci/bamboohome/xml-data/build-dir/CASASPECS-MASTERTESTPY313-TTARMM15PY313/casa6/casatestutils/runtest.py", line 1526, in <module>
run(
~~~^
testnames,
^^^^^^^^^^
...<4 lines>...
test_paths if args.test_paths is not None else [],
^^^^^^^^^^^^^^^^^^^^^^^^^^^^^^^^^^^^^^^^^^^^^^^^^^
)
^
File "/Users/casaci/bamboohome/xml-data/build-dir/CASASPECS-MASTERTESTPY313-TTARMM15PY313/casa6/casatestutils/runtest.py", line 1170, in run
setup_and_run(cmd, workdir, workpath, dirname, DRY_RUN, pytest_args )
~~~~~~~~~~~~~^^^^^^^^^^^^^^^^^^^^^^^^^^^^^^^^^^^^^^^^^^^^^^^^^^^^^^^^
File "/Users/casaci/bamboohome/xml-data/build-dir/CASASPECS-MASTERTESTPY313-TTARMM15PY313/casa6/casatestutils/runtest.py", line 1016, in setup_and_run
update_xml(xmlfile, result, name=os.getcwd().split("/")[-1])
~~~~~~~~~~^^^^^^^^^^^^^^^^^^^^^^^^^^^^^^^^^^^^^^^^^^^^^^^^^^
File "/Users/casaci/bamboohome/xml-data/build-dir/CASASPECS-MASTERTESTPY313-TTARMM15PY313/casa6/casatestutils/runtest.py", line 581, in update_xml
testclass = element.attrib["classname"].split(".")[1]
~~~~~~~~~~~~~~~~~~~~~~~~~~~~~~~~~~~~~~^^^
IndexError: list index out of range
a nosedir
a nosedir/test_task_imsubimage
a nosedir/xml
a nosedir/xml/test_task_imsubimage
a nosedir/xml/test_task_imsubimage/nose.xml
a nosedir/test_task_imsubimage/conftest.py
a nosedir/test_task_imsubimage/casa-20261028-001210.log
a nosedir/test_task_imsubimage/pytest.ini
a nosedir/test_task_imsubimage/test_task_imsubimage.py
Dload Upload Total Spent Left Speed
0 0 0 0 0 0 0 0 --:--:-- --:--:-- --:--:-- 0
100 6554k 100 6554k 0 0 71.2M 0 --:--:-- --:--:-- --:--:-- 71.9M
arch: posix_spawnp: ./atlutil: Bad CPU type in executable
% Total % Received % Xferd Average Speed Time Time Time Current
Dload Upload Total Spent Left Speed
0 0 0 0 0 0 0 0 --:--:-- --:--:-- --:--:-- 0
100 201 100 201 0 0 8281 0 --:--:-- --:--:-- --:--:-- 8375
% Total % Received % Xferd Average Speed Time Time Time Current
Dload Upload Total Spent Left Speed
0 0 0 0 0 0 0 0 --:--:-- --:--:-- --:--:-- 0
100 511 100 511 0 0 22281 0 --:--:-- --:--:-- --:--:-- 23227
Already on 'master'
Traceback (most recent call last):
File "/Users/casaci/bamboohome/xml-data/build-dir/CASASPECS-MASTERTESTPY313-TTARMM15PY313/casa6/casatestutils/runtest.py", line 1526, in <module>
run(
~~~^
testnames,
^^^^^^^^^^
...<4 lines>...
test_paths if args.test_paths is not None else [],
^^^^^^^^^^^^^^^^^^^^^^^^^^^^^^^^^^^^^^^^^^^^^^^^^^
)
^
File "/Users/casaci/bamboohome/xml-data/build-dir/CASASPECS-MASTERTESTPY313-TTARMM15PY313/casa6/casatestutils/runtest.py", line 1170, in run
setup_and_run(cmd, workdir, workpath, dirname, DRY_RUN, pytest_args )
~~~~~~~~~~~~~^^^^^^^^^^^^^^^^^^^^^^^^^^^^^^^^^^^^^^^^^^^^^^^^^^^^^^^^
File "/Users/casaci/bamboohome/xml-data/build-dir/CASASPECS-MASTERTESTPY313-TTARMM15PY313/casa6/casatestutils/runtest.py", line 1016, in setup_and_run
update_xml(xmlfile, result, name=os.getcwd().split("/")[-1])
~~~~~~~~~~^^^^^^^^^^^^^^^^^^^^^^^^^^^^^^^^^^^^^^^^^^^^^^^^^^
File "/Users/casaci/bamboohome/xml-data/build-dir/CASASPECS-MASTERTESTPY313-TTARMM15PY313/casa6/casatestutils/runtest.py", line 581, in update_xml
testclass = element.attrib["classname"].split(".")[1]
~~~~~~~~~~~~~~~~~~~~~~~~~~~~~~~~~~~~~~^^^
IndexError: list index out of range
a nosedir
a nosedir/test_task_imsubimage
a nosedir/xml
a nosedir/xml/test_task_imsubimage
a nosedir/xml/test_task_imsubimage/nose.xml
a nosedir/test_task_imsubimage/conftest.py
a nosedir/test_task_imsubimage/casa-20261028-001210.log
a nosedir/test_task_imsubimage/pytest.ini
a nosedir/test_task_imsubimage/test_task_imsubimage.py