Tools and Tasks tests for Python 3.13

Build: #201 failed Child of CASASPECS-MASTERBUILDCASALITH-304

Test results

  • 4 tests in total
  • 4 tests failed
  • 4 failures are new
  • < 1 second taken in total.
New test failures 4
Status Test View job Duration
Collapse Failed pytest internal
Test Tasks Many Linux 2.28 Rocky 8.10 Py3.13 < 1 sec
internal error
Traceback (most recent call last):
  File "/home/casatest/venv/lib/python3.13/site-packages/_pytest/main.py", line 333, in wrap_session
    session.exitstatus = doit(config, session) or 0
                         ~~~~^^^^^^^^^^^^^^^^^
  File "/home/casatest/venv/lib/python3.13/site-packages/_pytest/main.py", line 387, in _main
    config.hook.pytest_runtestloop(session=session)
    ~~~~~~~~~~~~~~~~~~~~~~~~~~~~~~^^^^^^^^^^^^^^^^^
(71 more lines...)
Collapse Failed pytest internal
Test Tasks ARM macOS15 Py3.13 < 1 sec
internal error
Traceback (most recent call last):
  File "/Users/casaci/bamboohome/xml-data/build-dir/CASASPECS-MASTERTESTPY313-TTARMM15PY313/casa6testenv/lib/python3.13/site-packages/_pytest/main.py", line 333, in wrap_session
    session.exitstatus = doit(config, session) or 0
                         ~~~~^^^^^^^^^^^^^^^^^
  File "/Users/casaci/bamboohome/xml-data/build-dir/CASASPECS-MASTERTESTPY313-TTARMM15PY313/casa6testenv/lib/python3.13/site-packages/_pytest/main.py", line 387, in _main
    config.hook.pytest_runtestloop(session=session)
    ~~~~~~~~~~~~~~~~~~~~~~~~~~~~~~^^^^^^^^^^^^^^^^^
(71 more lines...)
Collapse Failed pytest internal
Test Tools ARM macOS15 Py3.13 < 1 sec
internal error
Traceback (most recent call last):
  File "/Users/casaci/bamboohome/xml-data/build-dir/CASASPECS-MASTERTESTPY313-TTOARM15PY313/casa6testenv/lib/python3.13/site-packages/_pytest/main.py", line 333, in wrap_session
    session.exitstatus = doit(config, session) or 0
                         ~~~~^^^^^^^^^^^^^^^^^
  File "/Users/casaci/bamboohome/xml-data/build-dir/CASASPECS-MASTERTESTPY313-TTOARM15PY313/casa6testenv/lib/python3.13/site-packages/_pytest/main.py", line 387, in _main
    config.hook.pytest_runtestloop(session=session)
    ~~~~~~~~~~~~~~~~~~~~~~~~~~~~~~^^^^^^^^^^^^^^^^^
(71 more lines...)
Collapse Failed pytest internal
Test Tools Many Linux 2.28 Rocky 8.10 Py3.13 < 1 sec
internal error
Traceback (most recent call last):
  File "/home/casatest/venv/lib/python3.13/site-packages/_pytest/main.py", line 333, in wrap_session
    session.exitstatus = doit(config, session) or 0
                         ~~~~^^^^^^^^^^^^^^^^^
  File "/home/casatest/venv/lib/python3.13/site-packages/_pytest/main.py", line 387, in _main
    config.hook.pytest_runtestloop(session=session)
    ~~~~~~~~~~~~~~~~~~~~~~~~~~~~~~^^^^^^^^^^^^^^^^^
(71 more lines...)