Tools and Tasks tests for Python 3.13

Build: #201 failed

Job: Test Tools Many Linux 2.28 Rocky 8.10 Py3.13 failed

Job result summary

Completed
Duration
3 minutes
Agent
casaci-4.cv.nrao.edu test agent2
Revision
188b64ce030a360ced17720a68d5af3bbcffaf87
Total tests
1
Fixed in
#202 (Child of CASASPECS-MASTERBUILDCASALITH-305)

Tests

  • 1 test in total
  • 1 test failed
  • 1 failure is new
  • < 1 second taken in total.
New test failures 1
Status Test Duration
Collapse Failed pytest internal
< 1 sec
internal error
Traceback (most recent call last):
  File "/home/casatest/venv/lib/python3.13/site-packages/_pytest/main.py", line 333, in wrap_session
    session.exitstatus = doit(config, session) or 0
                         ~~~~^^^^^^^^^^^^^^^^^
  File "/home/casatest/venv/lib/python3.13/site-packages/_pytest/main.py", line 387, in _main
    config.hook.pytest_runtestloop(session=session)
    ~~~~~~~~~~~~~~~~~~~~~~~~~~~~~~^^^^^^^^^^^^^^^^^
(71 more lines...)

Error summary

The build generated some errors. See the full build log for more details.

Error response from daemon: No such container: wheel-container-test-153550850
Error response from daemon: No such container: wheel-container-test-153550850
  % Total    % Received % Xferd  Average Speed   Time    Time     Time  Current
                                 Dload  Upload   Total   Spent    Left  Speed

  0     0    0     0    0     0      0      0 --:--:-- --:--:-- --:--:--     0
100 6002k  100 6002k    0     0  66.6M      0 --:--:-- --:--:-- --:--:-- 66.6M
[467610] Failed to execute script 'atlutil' due to unhandled exception!
Traceback (most recent call last):
  File "atlutil.py", line 200, in <module>
  File "atlutil.py", line 165, in has_fix_version
KeyError: 'fields'
Already on 'master'
  % Total    % Received % Xferd  Average Speed   Time    Time     Time  Current
                                 Dload  Upload   Total   Spent    Left  Speed

  0     0    0     0    0     0      0      0 --:--:-- --:--:-- --:--:--     0
100   669    0   669    0     0  44600      0 --:--:-- --:--:-- --:--:-- 44600
Traceback (most recent call last):
  File "/home/casatest/casa6/casatestutils/runtest.py", line 1526, in <module>
    run(
    ~~~^
        testnames,
        ^^^^^^^^^^
    ...<4 lines>...
        test_paths if args.test_paths is not None else [],
        ^^^^^^^^^^^^^^^^^^^^^^^^^^^^^^^^^^^^^^^^^^^^^^^^^^
    )
    ^
  File "/home/casatest/casa6/casatestutils/runtest.py", line 1135, in run
    setup_and_run(cmd, workdir, workpath, dirname, DRY_RUN , pytest_args)
    ~~~~~~~~~~~~~^^^^^^^^^^^^^^^^^^^^^^^^^^^^^^^^^^^^^^^^^^^^^^^^^^^^^^^^
  File "/home/casatest/casa6/casatestutils/runtest.py", line 1016, in setup_and_run
    update_xml(xmlfile, result, name=os.getcwd().split("/")[-1])
    ~~~~~~~~~~^^^^^^^^^^^^^^^^^^^^^^^^^^^^^^^^^^^^^^^^^^^^^^^^^^
  File "/home/casatest/casa6/casatestutils/runtest.py", line 581, in update_xml
    testclass = element.attrib["classname"].split(".")[1]
                ~~~~~~~~~~~~~~~~~~~~~~~~~~~~~~~~~~~~~~^^^
IndexError: list index out of range
tar: nosedir: Cannot stat: No such file or directory
tar: Exiting with failure status due to previous errors