Tools and Tasks tests for Python 3.13
Build: #201 failed
Job: Test Tools ARM macOS15 Py3.13 failed
Job result summary
- Completed
- Duration
- 6 minutes
- Agent
- cbt-macos15-test-m4-1
- Revision
-
188b64ce030a360ced17720a68d5af3bbcffaf87
- Total tests
- 1
- Fixed in
- #202 (Child of CASASPECS-MASTERBUILDCASALITH-305)
Tests
- 1 test in total
- 1 test failed
- 1 failure is new
- < 1 second taken in total.
| Status | Test | Duration | |
|---|---|---|---|
| Collapse |
pytest
internal
|
< 1 sec | |
internal error
Traceback (most recent call last):
File "/Users/casaci/bamboohome/xml-data/build-dir/CASASPECS-MASTERTESTPY313-TTOARM15PY313/casa6testenv/lib/python3.13/site-packages/_pytest/main.py", line 333, in wrap_session
session.exitstatus = doit(config, session) or 0
~~~~^^^^^^^^^^^^^^^^^
File "/Users/casaci/bamboohome/xml-data/build-dir/CASASPECS-MASTERTESTPY313-TTOARM15PY313/casa6testenv/lib/python3.13/site-packages/_pytest/main.py", line 387, in _main
config.hook.pytest_runtestloop(session=session)
~~~~~~~~~~~~~~~~~~~~~~~~~~~~~~^^^^^^^^^^^^^^^^^
(71 more lines...)
|
|||
Error summary
The build generated some errors. See the full build log for more details.
error: Your local changes to the following files would be overwritten by merge:
nrao/VLA/CalModels/3C138_K.im/table.dat
nrao/VLA/CalModels/3C138_K.im/table.lock
Please commit your changes or stash them before you merge.
Aborting
% Total % Received % Xferd Average Speed Time Time Time Current
Dload Upload Total Spent Left Speed
0 0 0 0 0 0 0 0 --:--:-- --:--:-- --:--:-- 0
100 6554k 100 6554k 0 0 62.6M 0 --:--:-- --:--:-- --:--:-- 62.7M
arch: posix_spawnp: ./atlutil: Bad CPU type in executable
Already on 'master'
% Total % Received % Xferd Average Speed Time Time Time Current
Dload Upload Total Spent Left Speed
0 0 0 0 0 0 0 0 --:--:-- --:--:-- --:--:-- 0
100 669 0 669 0 0 34216 0 --:--:-- --:--:-- --:--:-- 35210
Traceback (most recent call last):
File "/Users/casaci/bamboohome/xml-data/build-dir/CASASPECS-MASTERTESTPY313-TTOARM15PY313/casa6/casatestutils/runtest.py", line 1526, in <module>
run(
~~~^
testnames,
^^^^^^^^^^
...<4 lines>...
test_paths if args.test_paths is not None else [],
^^^^^^^^^^^^^^^^^^^^^^^^^^^^^^^^^^^^^^^^^^^^^^^^^^
)
^
File "/Users/casaci/bamboohome/xml-data/build-dir/CASASPECS-MASTERTESTPY313-TTOARM15PY313/casa6/casatestutils/runtest.py", line 1135, in run
setup_and_run(cmd, workdir, workpath, dirname, DRY_RUN , pytest_args)
~~~~~~~~~~~~~^^^^^^^^^^^^^^^^^^^^^^^^^^^^^^^^^^^^^^^^^^^^^^^^^^^^^^^^
File "/Users/casaci/bamboohome/xml-data/build-dir/CASASPECS-MASTERTESTPY313-TTOARM15PY313/casa6/casatestutils/runtest.py", line 1016, in setup_and_run
update_xml(xmlfile, result, name=os.getcwd().split("/")[-1])
~~~~~~~~~~^^^^^^^^^^^^^^^^^^^^^^^^^^^^^^^^^^^^^^^^^^^^^^^^^^
File "/Users/casaci/bamboohome/xml-data/build-dir/CASASPECS-MASTERTESTPY313-TTOARM15PY313/casa6/casatestutils/runtest.py", line 581, in update_xml
testclass = element.attrib["classname"].split(".")[1]
~~~~~~~~~~~~~~~~~~~~~~~~~~~~~~~~~~~~~~^^^
IndexError: list index out of range
a nosedir
a nosedir/xml
a nosedir/test_tool_calanalysis
a nosedir/test_tool_calanalysis/conftest.py
a nosedir/test_tool_calanalysis/pytest.ini
a nosedir/test_tool_calanalysis/test_tool_calanalysis.py
a nosedir/test_tool_calanalysis/casa-20261028-000627.log
a nosedir/xml/test_tool_calanalysis
a nosedir/xml/test_tool_calanalysis/nose.xml
nrao/VLA/CalModels/3C138_K.im/table.dat
nrao/VLA/CalModels/3C138_K.im/table.lock
Please commit your changes or stash them before you merge.
Aborting
% Total % Received % Xferd Average Speed Time Time Time Current
Dload Upload Total Spent Left Speed
0 0 0 0 0 0 0 0 --:--:-- --:--:-- --:--:-- 0
100 6554k 100 6554k 0 0 62.6M 0 --:--:-- --:--:-- --:--:-- 62.7M
arch: posix_spawnp: ./atlutil: Bad CPU type in executable
Already on 'master'
% Total % Received % Xferd Average Speed Time Time Time Current
Dload Upload Total Spent Left Speed
0 0 0 0 0 0 0 0 --:--:-- --:--:-- --:--:-- 0
100 669 0 669 0 0 34216 0 --:--:-- --:--:-- --:--:-- 35210
Traceback (most recent call last):
File "/Users/casaci/bamboohome/xml-data/build-dir/CASASPECS-MASTERTESTPY313-TTOARM15PY313/casa6/casatestutils/runtest.py", line 1526, in <module>
run(
~~~^
testnames,
^^^^^^^^^^
...<4 lines>...
test_paths if args.test_paths is not None else [],
^^^^^^^^^^^^^^^^^^^^^^^^^^^^^^^^^^^^^^^^^^^^^^^^^^
)
^
File "/Users/casaci/bamboohome/xml-data/build-dir/CASASPECS-MASTERTESTPY313-TTOARM15PY313/casa6/casatestutils/runtest.py", line 1135, in run
setup_and_run(cmd, workdir, workpath, dirname, DRY_RUN , pytest_args)
~~~~~~~~~~~~~^^^^^^^^^^^^^^^^^^^^^^^^^^^^^^^^^^^^^^^^^^^^^^^^^^^^^^^^
File "/Users/casaci/bamboohome/xml-data/build-dir/CASASPECS-MASTERTESTPY313-TTOARM15PY313/casa6/casatestutils/runtest.py", line 1016, in setup_and_run
update_xml(xmlfile, result, name=os.getcwd().split("/")[-1])
~~~~~~~~~~^^^^^^^^^^^^^^^^^^^^^^^^^^^^^^^^^^^^^^^^^^^^^^^^^^
File "/Users/casaci/bamboohome/xml-data/build-dir/CASASPECS-MASTERTESTPY313-TTOARM15PY313/casa6/casatestutils/runtest.py", line 581, in update_xml
testclass = element.attrib["classname"].split(".")[1]
~~~~~~~~~~~~~~~~~~~~~~~~~~~~~~~~~~~~~~^^^
IndexError: list index out of range
a nosedir
a nosedir/xml
a nosedir/test_tool_calanalysis
a nosedir/test_tool_calanalysis/conftest.py
a nosedir/test_tool_calanalysis/pytest.ini
a nosedir/test_tool_calanalysis/test_tool_calanalysis.py
a nosedir/test_tool_calanalysis/casa-20261028-000627.log
a nosedir/xml/test_tool_calanalysis
a nosedir/xml/test_tool_calanalysis/nose.xml