Build: #3 failed
Job: Test Tasks macOS 15 Py3.12 failed
Build log
The build generated 509 lines of output. Download or view full build log.
| 29-Sep-2026 19:29:05 | Build CASASPECS - Dev Test 3.12 - CAS-14849 - Test Tasks macOS 15 Py3.12 #3 (CASASPECS-DEVTESTPY312147-TTARM15PY312-3) is being prepared for building on agent cbt-macos15-test-4, bamboo version: 9.6.26 |
| 29-Sep-2026 19:29:05 | Remote agent on host cbt-macos15-test-4 |
| 29-Sep-2026 19:29:05 | Build working directory is /Users/casaci/bamboohome/xml-data/build-dir/CASASPECS-DEVTESTPY312147-TTARM15PY312 |
| 29-Sep-2026 19:29:05 | Executing build CASASPECS - Dev Test 3.12 - CAS-14849 - Test Tasks macOS 15 Py3.12 #3 (CASASPECS-DEVTESTPY312147-TTARM15PY312-3) |
| 29-Sep-2026 19:29:05 | Starting task 'Source Code Checkout' of type 'com.atlassian.bamboo.plugins.vcs:task.vcs.checkout' |
| 29-Sep-2026 19:29:05 | Build always requires a clean checkout |
| 29-Sep-2026 19:29:05 | Cleaning build directory '/Users/casaci/bamboohome/xml-data/build-dir/CASASPECS-DEVTESTPY312147-TTARM15PY312' |
| 29-Sep-2026 19:29:05 | Checking out into /Users/casaci/bamboohome/xml-data/build-dir/CASASPECS-DEVTESTPY312147-TTARM15PY312 |
| 29-Sep-2026 19:29:05 | Updating source code to revision: 2622d8cd816c2e6e3517837f8b7d521faf3e561d |
| 29-Sep-2026 19:29:06 | Fetching 'refs/heads/CAS-14849' from 'ssh://git@open-bitbucket.nrao.edu:7999/casa/casa6.git'. |
| 29-Sep-2026 19:29:06 | Warning: Permanently added '[127.0.0.1]:49161' (RSA) to the list of known hosts. |
| 29-Sep-2026 19:29:08 | Checking out revision 2622d8cd816c2e6e3517837f8b7d521faf3e561d. |
| 29-Sep-2026 19:29:08 | Creating local git repository in '/Users/casaci/bamboohome/xml-data/build-dir/CASASPECS-DEVTESTPY312147-TTARM15PY312/.git'. |
| 29-Sep-2026 19:29:08 | Cloning into '/Users/casaci/bamboohome/xml-data/build-dir/CASASPECS-DEVTESTPY312147-TTARM15PY312'... |
| 29-Sep-2026 19:29:08 | done. |
| 29-Sep-2026 19:29:10 | Switched to a new branch 'CAS-14849' |
| 29-Sep-2026 19:29:10 | branch 'CAS-14849' set up to track 'origin/CAS-14849'. |
| 29-Sep-2026 19:29:10 | Submodule 'casatools/casacore' (https://github.com/casacore/casacore.git) registered for path 'casatools/casacore' |
| 29-Sep-2026 19:29:10 | Submodule 'casatools/grpc-source' (https://github.com/grpc/grpc) registered for path 'casatools/grpc-source' |
| 29-Sep-2026 19:29:10 | Cloning into '/Users/casaci/bamboohome/xml-data/build-dir/CASASPECS-DEVTESTPY312147-TTARM15PY312/casatools/casacore'... |
| 29-Sep-2026 19:29:17 | Cloning into '/Users/casaci/bamboohome/xml-data/build-dir/CASASPECS-DEVTESTPY312147-TTARM15PY312/casatools/grpc-source'... |
| 29-Sep-2026 19:29:41 | Submodule path 'casatools/casacore': checked out 'aaf72eb7edd5a5fecefa78ca04713233b7b6ffd6' |
| 29-Sep-2026 19:29:42 | Submodule path 'casatools/grpc-source': checked out 'cca868ac8f3641df4003a82b7fc54c921e14f765' |
| 29-Sep-2026 19:29:42 | Submodule 'third_party/abseil-cpp' (https://github.com/abseil/abseil-cpp) registered for path 'casatools/grpc-source/third_party/abseil-cpp' |
| 29-Sep-2026 19:29:42 | Submodule 'third_party/benchmark' (https://github.com/google/benchmark) registered for path 'casatools/grpc-source/third_party/benchmark' |
| 29-Sep-2026 19:29:42 | Submodule 'third_party/bloaty' (https://github.com/google/bloaty.git) registered for path 'casatools/grpc-source/third_party/bloaty' |
| 29-Sep-2026 19:29:42 | Submodule 'third_party/boringssl' (https://github.com/google/boringssl.git) registered for path 'casatools/grpc-source/third_party/boringssl' |
| 29-Sep-2026 19:29:42 | Submodule 'third_party/boringssl-with-bazel' (https://github.com/google/boringssl.git) registered for path 'casatools/grpc-source/third_party/boringssl-with-bazel' |
| 29-Sep-2026 19:29:42 | Submodule 'third_party/cares/cares' (https://github.com/c-ares/c-ares.git) registered for path 'casatools/grpc-source/third_party/cares/cares' |
| 29-Sep-2026 19:29:42 | Submodule 'third_party/gflags' (https://github.com/gflags/gflags.git) registered for path 'casatools/grpc-source/third_party/gflags' |
| 29-Sep-2026 19:29:42 | Submodule 'third_party/googletest' (https://github.com/google/googletest.git) registered for path 'casatools/grpc-source/third_party/googletest' |
| 29-Sep-2026 19:29:42 | Submodule 'third_party/protobuf' (https://github.com/google/protobuf.git) registered for path 'casatools/grpc-source/third_party/protobuf' |
| 29-Sep-2026 19:29:42 | Submodule 'third_party/zlib' (https://github.com/madler/zlib) registered for path 'casatools/grpc-source/third_party/zlib' |
| 29-Sep-2026 19:29:42 | Cloning into '/Users/casaci/bamboohome/xml-data/build-dir/CASASPECS-DEVTESTPY312147-TTARM15PY312/casatools/grpc-source/third_party/abseil-cpp'... |
| 29-Sep-2026 19:29:43 | Cloning into '/Users/casaci/bamboohome/xml-data/build-dir/CASASPECS-DEVTESTPY312147-TTARM15PY312/casatools/grpc-source/third_party/benchmark'... |
| 29-Sep-2026 19:29:44 | Cloning into '/Users/casaci/bamboohome/xml-data/build-dir/CASASPECS-DEVTESTPY312147-TTARM15PY312/casatools/grpc-source/third_party/bloaty'... |
| 29-Sep-2026 19:29:45 | Cloning into '/Users/casaci/bamboohome/xml-data/build-dir/CASASPECS-DEVTESTPY312147-TTARM15PY312/casatools/grpc-source/third_party/boringssl'... |
| 29-Sep-2026 19:29:55 | Cloning into '/Users/casaci/bamboohome/xml-data/build-dir/CASASPECS-DEVTESTPY312147-TTARM15PY312/casatools/grpc-source/third_party/boringssl-with-bazel'... |
| 29-Sep-2026 19:30:13 | Cloning into '/Users/casaci/bamboohome/xml-data/build-dir/CASASPECS-DEVTESTPY312147-TTARM15PY312/casatools/grpc-source/third_party/cares/cares'... |
| 29-Sep-2026 19:30:15 | Cloning into '/Users/casaci/bamboohome/xml-data/build-dir/CASASPECS-DEVTESTPY312147-TTARM15PY312/casatools/grpc-source/third_party/gflags'... |
| 29-Sep-2026 19:30:15 | Cloning into '/Users/casaci/bamboohome/xml-data/build-dir/CASASPECS-DEVTESTPY312147-TTARM15PY312/casatools/grpc-source/third_party/googletest'... |
| 29-Sep-2026 19:30:16 | Cloning into '/Users/casaci/bamboohome/xml-data/build-dir/CASASPECS-DEVTESTPY312147-TTARM15PY312/casatools/grpc-source/third_party/protobuf'... |
| 29-Sep-2026 19:30:25 | Cloning into '/Users/casaci/bamboohome/xml-data/build-dir/CASASPECS-DEVTESTPY312147-TTARM15PY312/casatools/grpc-source/third_party/zlib'... |
| 29-Sep-2026 19:30:25 | Submodule path 'casatools/grpc-source/third_party/abseil-cpp': checked out 'cc4bed2d74f7c8717e31f9579214ab52a9c9c610' |
| 29-Sep-2026 19:30:25 | Submodule path 'casatools/grpc-source/third_party/benchmark': checked out '5b7683f49e1e9223cf9927b24f6fd3d6bd82e3f8' |
| 29-Sep-2026 19:30:25 | Submodule path 'casatools/grpc-source/third_party/bloaty': checked out '73594cde8c9a52a102c4341c244c833aa61b9c06' |
| 29-Sep-2026 19:30:25 | Submodule 'third_party/googletest' (https://github.com/google/googletest.git) registered for path 'casatools/grpc-source/third_party/bloaty/third_party/googletest' |
| 29-Sep-2026 19:30:25 | Submodule 'third_party/libFuzzer' (https://chromium.googlesource.com/chromium/llvm-project/llvm/lib/Fuzzer) registered for path 'casatools/grpc-source/third_party/bloaty/third_party/libFuzzer' |
| 29-Sep-2026 19:30:25 | Submodule 'third_party/re2' (https://github.com/google/re2) registered for path 'casatools/grpc-source/third_party/bloaty/third_party/re2' |
| 29-Sep-2026 19:30:25 | Cloning into '/Users/casaci/bamboohome/xml-data/build-dir/CASASPECS-DEVTESTPY312147-TTARM15PY312/casatools/grpc-source/third_party/bloaty/third_party/googletest'... |
| 29-Sep-2026 19:30:26 | Cloning into '/Users/casaci/bamboohome/xml-data/build-dir/CASASPECS-DEVTESTPY312147-TTARM15PY312/casatools/grpc-source/third_party/bloaty/third_party/libFuzzer'... |
| 29-Sep-2026 19:30:27 | Cloning into '/Users/casaci/bamboohome/xml-data/build-dir/CASASPECS-DEVTESTPY312147-TTARM15PY312/casatools/grpc-source/third_party/bloaty/third_party/re2'... |
| 29-Sep-2026 19:30:27 | Submodule path 'casatools/grpc-source/third_party/bloaty/third_party/googletest': checked out 'a2b8a8e07628e5fd60644b6dd99c1b5e7d7f1f47' |
| 29-Sep-2026 19:30:27 | Submodule path 'casatools/grpc-source/third_party/bloaty/third_party/libFuzzer': checked out '1b543d6e5073b56be214394890c9193979a3d7e1' |
| 29-Sep-2026 19:30:27 | Submodule path 'casatools/grpc-source/third_party/bloaty/third_party/re2': checked out 'c964d9b07816f9b52ca692e23b8b3dba33beec54' |
| 29-Sep-2026 19:30:28 | Submodule path 'casatools/grpc-source/third_party/boringssl': checked out 'be2ee342d3781ddb954f91f8a7e660c6f59e87e5' |
| 29-Sep-2026 19:30:28 | Submodule path 'casatools/grpc-source/third_party/boringssl-with-bazel': checked out '886e7d75368e3f4fab3f4d0d3584e4abfc557755' |
| 29-Sep-2026 19:30:28 | Submodule path 'casatools/grpc-source/third_party/cares/cares': checked out '3be1924221e1326df520f8498d704a5c4c8d0cce' |
| 29-Sep-2026 19:30:28 | Submodule path 'casatools/grpc-source/third_party/gflags': checked out '30dbc81fb5ffdc98ea9b14b1918bfe4e8779b26e' |
| 29-Sep-2026 19:30:28 | Submodule 'doc' (https://github.com/gflags/gflags.git) registered for path 'casatools/grpc-source/third_party/gflags/doc' |
| 29-Sep-2026 19:30:28 | Cloning into '/Users/casaci/bamboohome/xml-data/build-dir/CASASPECS-DEVTESTPY312147-TTARM15PY312/casatools/grpc-source/third_party/gflags/doc'... |
| 29-Sep-2026 19:30:29 | Submodule path 'casatools/grpc-source/third_party/gflags/doc': checked out '971dd2a4fadac9cdab174c523c22df79efd63aa5' |
| 29-Sep-2026 19:30:29 | Submodule path 'casatools/grpc-source/third_party/googletest': checked out 'ec44c6c1675c25b9827aacd08c02433cccde7780' |
| 29-Sep-2026 19:30:29 | Submodule path 'casatools/grpc-source/third_party/protobuf': checked out '2761122b810fe8861004ae785cc3ab39f384d342' |
| 29-Sep-2026 19:30:29 | Submodule 'third_party/benchmark' (https://github.com/google/benchmark.git) registered for path 'casatools/grpc-source/third_party/protobuf/third_party/benchmark' |
| 29-Sep-2026 19:30:29 | Cloning into '/Users/casaci/bamboohome/xml-data/build-dir/CASASPECS-DEVTESTPY312147-TTARM15PY312/casatools/grpc-source/third_party/protobuf/third_party/benchmark'... |
| 29-Sep-2026 19:30:30 | Submodule path 'casatools/grpc-source/third_party/protobuf/third_party/benchmark': checked out '360e66c1c4777c99402cf8cd535aa510fee16573' |
| 29-Sep-2026 19:30:30 | Submodule path 'casatools/grpc-source/third_party/zlib': checked out 'cacf7f1d4e3d44d871b605da3b647f07d718623f' |
| 29-Sep-2026 19:30:30 | Updated source code to revision: 2622d8cd816c2e6e3517837f8b7d521faf3e561d |
| 29-Sep-2026 19:30:30 | Finished task 'Source Code Checkout' with result: Success |
| 29-Sep-2026 19:30:30 | Running pre-build action: Build Log Labeller Pre Build Action |
| 29-Sep-2026 19:30:30 | Running pre-build action: VCS Version Collector |
| 29-Sep-2026 19:30:30 | Build CASASPECS - Dev Test 3.12 - CAS-14849 - Test Tasks macOS 15 Py3.12 #3 (CASASPECS-DEVTESTPY312147-TTARM15PY312-3) started building on agent 'cbt-macos15-test-4' (Remote agent on host cbt-macos15-test-4) |
| 29-Sep-2026 19:30:30 | Starting task 'Update data' of type 'com.atlassian.bamboo.plugins.scripttask:task.builder.script' |
| 29-Sep-2026 19:30:30 | Beginning to execute external process for build 'CASASPECS - Dev Test 3.12 - CAS-14849 - Test Tasks macOS 15 Py3.12 #3 (CASASPECS-DEVTESTPY312147-TTARM15PY312-3)' ... running command line: /Users/casaci/bamboohome/temp/CASASPECS-DEVTESTPY312147-TTARM15PY312-3-ScriptBuildTask-437394559245660710.sh ... in: /Users/casaci/bamboohome/xml-data/build-dir/CASASPECS-DEVTESTPY312147-TTARM15PY312 |
| 29-Sep-2026 19:30:30 | Already up to date. |
| 29-Sep-2026 19:30:30 | Updating ce38223d..116a1059 |
| 29-Sep-2026 19:30:31 | error: Your local changes to the following files would be overwritten by merge: |
| 29-Sep-2026 19:30:31 | nrao/VLA/CalModels/3C138_K.im/table.dat |
| 29-Sep-2026 19:30:31 | nrao/VLA/CalModels/3C138_K.im/table.lock |
| 29-Sep-2026 19:30:31 | Please commit your changes or stash them before you merge. |
| 29-Sep-2026 19:30:31 | Aborting |
| 29-Sep-2026 19:30:31 | Done |
| 29-Sep-2026 19:30:31 | Finished task 'Update data' with result: Success |
| 29-Sep-2026 19:30:31 | Starting task 'Create wheel directory' of type 'com.atlassian.bamboo.plugins.scripttask:task.builder.script' |
| 29-Sep-2026 19:30:31 | Beginning to execute external process for build 'CASASPECS - Dev Test 3.12 - CAS-14849 - Test Tasks macOS 15 Py3.12 #3 (CASASPECS-DEVTESTPY312147-TTARM15PY312-3)' ... running command line: /Users/casaci/bamboohome/temp/CASASPECS-DEVTESTPY312147-TTARM15PY312-3-ScriptBuildTask-864989643198082705.sh ... in: /Users/casaci/bamboohome/xml-data/build-dir/CASASPECS-DEVTESTPY312147-TTARM15PY312 |
| 29-Sep-2026 19:30:31 | Finished task 'Create wheel directory' with result: Success |
| 29-Sep-2026 19:30:31 | Starting task 'Get macOS 15 wheels' of type 'com.atlassian.bamboo.plugins.bamboo-artifact-downloader-plugin:artifactdownloadertask' |
| 29-Sep-2026 19:30:31 | Preparing to download plan result CASASPECS-DBC257-3 artifact: Non required shared artifact Http Compression On : [macOS 15 py3.12 tasks wheel], patterns: [casatasks*.whl] anchored at: [wheels] |
| 29-Sep-2026 19:30:31 | Retrieving artifact macOS 15 py3.12 tasks wheel for CASASPECS-DBC257-3 using Bamboo server artifact handler |
| 29-Sep-2026 19:30:31 | Artifact [macOS 15 py3.12 tasks wheel] downloaded successfully in 90.63 ms to wheeldirectory/ |
| 29-Sep-2026 19:30:31 | Preparing to download plan result CASASPECS-DBC257-3 artifact: Non required shared artifact Http Compression On : [macOS 15 casatestutils 3.12], patterns: [casatestutils*.whl] anchored at: [wheels] |
| 29-Sep-2026 19:30:31 | Retrieving artifact macOS 15 casatestutils 3.12 for CASASPECS-DBC257-3 using Bamboo server artifact handler |
| 29-Sep-2026 19:30:31 | Artifact [macOS 15 casatestutils 3.12] downloaded successfully in 32.88 ms to wheeldirectory/ |
| 29-Sep-2026 19:30:31 | Preparing to download plan result CASASPECS-DBC257-3 artifact: Non required shared artifact Http Compression On : [macOS 15 py3.12 tools wheel], patterns: [casatools*.whl] anchored at: [wheels] |
| 29-Sep-2026 19:30:31 | Retrieving artifact macOS 15 py3.12 tools wheel for CASASPECS-DBC257-3 using Bamboo server artifact handler |
| 29-Sep-2026 19:30:34 | Artifact [macOS 15 py3.12 tools wheel] downloaded successfully in 3.627 s to wheeldirectory/ |
| 29-Sep-2026 19:30:34 | Finished task 'Get macOS 15 wheels' with result: Success |
| 29-Sep-2026 19:30:34 | Substituting variable: ${bamboo.repository.branch.name} with CAS-14849 |
| 29-Sep-2026 19:30:34 | Substituting variable: ${bamboo.planRepository.branchName} with CAS-14849 |
| 29-Sep-2026 19:30:34 | Starting task 'Test wheel' of type 'com.atlassian.bamboo.plugins.scripttask:task.builder.script' |
| 29-Sep-2026 19:30:34 | Beginning to execute external process for build 'CASASPECS - Dev Test 3.12 - CAS-14849 - Test Tasks macOS 15 Py3.12 #3 (CASASPECS-DEVTESTPY312147-TTARM15PY312-3)' ... running command line: /Users/casaci/bamboohome/temp/CASASPECS-DEVTESTPY312147-TTARM15PY312-3-ScriptBuildTask-9237584171403537959.sh ... in: /Users/casaci/bamboohome/xml-data/build-dir/CASASPECS-DEVTESTPY312147-TTARM15PY312 |
| 29-Sep-2026 19:30:34 | branch: CAS-14849 |
| 29-Sep-2026 19:30:34 | branch: CAS-14849 |
| 29-Sep-2026 19:30:34 | Testing wheel |
| 29-Sep-2026 19:30:34 | % Total % Received % Xferd Average Speed Time Time Time Current |
| 29-Sep-2026 19:30:34 | Dload Upload Total Spent Left Speed |
| 29-Sep-2026 19:30:34 | |
| 29-Sep-2026 19:30:34 | 0 0 0 0 0 0 0 0 --:--:-- --:--:-- --:--:-- 0 |
| 29-Sep-2026 19:30:34 | 100 9419k 100 9419k 0 0 65.7M 0 --:--:-- --:--:-- --:--:-- 66.1M |
| 29-Sep-2026 19:30:39 | Ticket fix version: CASA 6.ACTIVE |
| 29-Sep-2026 19:30:39 | No matching version found |
| 29-Sep-2026 19:30:39 | % Total % Received % Xferd Average Speed Time Time Time Current |
| 29-Sep-2026 19:30:39 | Dload Upload Total Spent Left Speed |
| 29-Sep-2026 19:30:39 | |
| 29-Sep-2026 19:30:39 | 0 0 0 0 0 0 0 0 --:--:-- --:--:-- --:--:-- 0 |
| 29-Sep-2026 19:30:39 | 100 201 100 201 0 0 6735 0 --:--:-- --:--:-- --:--:-- 6931 |
| 29-Sep-2026 19:30:39 | % Total % Received % Xferd Average Speed Time Time Time Current |
| 29-Sep-2026 19:30:39 | Dload Upload Total Spent Left Speed |
| 29-Sep-2026 19:30:39 | |
| 29-Sep-2026 19:30:39 | 0 0 0 0 0 0 0 0 --:--:-- --:--:-- --:--:-- 0 |
| 29-Sep-2026 19:30:39 | 100 511 100 511 0 0 23034 0 --:--:-- --:--:-- --:--:-- 23227 |
| 29-Sep-2026 19:30:39 | bamboo_jira_components:'' |
| 29-Sep-2026 19:30:39 | bamboo_testlist:'' |
| 29-Sep-2026 19:30:43 | atlutil components: casaconfig |
| 29-Sep-2026 19:30:43 | Ticket components: casaconfig |
| 29-Sep-2026 19:32:53 | Switched to a new branch 'CAS-14849' |
| 29-Sep-2026 19:32:53 | branch 'CAS-14849' set up to track 'origin/CAS-14849'. |
| 29-Sep-2026 19:32:53 | Updated 0 paths from fb45b40137 |
| 29-Sep-2026 19:32:53 | Updated 0 paths from a0fff8df6c |
| 29-Sep-2026 19:32:54 | Requirement already satisfied: pip in /Users/casaci/bamboohome/xml-data/build-dir/CASASPECS-DEVTESTPY312147-TTARM15PY312/casa6testenv/lib/python3.12/site-packages (24.3.1) |
| 29-Sep-2026 19:32:54 | Collecting pip |
| 29-Sep-2026 19:32:54 | Downloading pip-26.2.1-py3-none-any.whl.metadata (4.6 kB) |
| 29-Sep-2026 19:32:54 | Collecting setuptools |
| 29-Sep-2026 19:32:54 | Downloading setuptools-84.0.0-py3-none-any.whl.metadata (6.6 kB) |
| 29-Sep-2026 19:32:54 | Collecting wheel |
| 29-Sep-2026 19:32:54 | Downloading wheel-0.48.0-py3-none-any.whl.metadata (2.3 kB) |
| 29-Sep-2026 19:32:54 | Collecting packaging>=24.0 (from wheel) |
| 29-Sep-2026 19:32:54 | Downloading packaging-26.3-py3-none-any.whl.metadata (3.5 kB) |
| 29-Sep-2026 19:32:54 | Downloading pip-26.2.1-py3-none-any.whl (1.8 MB) |
| 29-Sep-2026 19:32:54 | ━━━━━━━━━━━━━━━━━━━━━━━━━━━━━━━━━━━━━━━━ 1.8/1.8 MB 86.2 MB/s eta 0:00:00 |
| 29-Sep-2026 19:32:54 | Downloading setuptools-84.0.0-py3-none-any.whl (818 kB) |
| 29-Sep-2026 19:32:54 | ━━━━━━━━━━━━━━━━━━━━━━━━━━━━━━━━━━━━━━━━ 818.2/818.2 kB 74.5 MB/s eta 0:00:00 |
| 29-Sep-2026 19:32:54 | Downloading wheel-0.48.0-py3-none-any.whl (33 kB) |
| 29-Sep-2026 19:32:54 | Downloading packaging-26.3-py3-none-any.whl (129 kB) |
| 29-Sep-2026 19:32:54 | Installing collected packages: setuptools, pip, packaging, wheel |
| 29-Sep-2026 19:32:54 | Attempting uninstall: pip |
| 29-Sep-2026 19:32:54 | Found existing installation: pip 24.3.1 |
| 29-Sep-2026 19:32:54 | Uninstalling pip-24.3.1: |
| 29-Sep-2026 19:32:54 | Successfully uninstalled pip-24.3.1 |
| 29-Sep-2026 19:32:55 | Successfully installed packaging-26.3 pip-26.2.1 setuptools-84.0.0 wheel-0.48.0 |
| 29-Sep-2026 19:32:56 | Looking in indexes: https://pypi.org/simple, https://test.pypi.org/simple |
| 29-Sep-2026 19:32:56 | Collecting casaconfig==1.5.1 |
| 29-Sep-2026 19:32:56 | Downloading casaconfig-1.5.1-py3-none-any.whl.metadata (4.0 kB) |
| 29-Sep-2026 19:32:56 | Collecting certifi>=2023.5.7 (from casaconfig==1.5.1) |
| 29-Sep-2026 19:32:56 | Using cached certifi-2026.7.22-py3-none-any.whl.metadata (2.5 kB) |
| 29-Sep-2026 19:32:56 | Downloading casaconfig-1.5.1-py3-none-any.whl (77 kB) |
| 29-Sep-2026 19:32:56 | Using cached certifi-2026.7.22-py3-none-any.whl (136 kB) |
| 29-Sep-2026 19:32:56 | Installing collected packages: certifi, casaconfig |
| 29-Sep-2026 19:32:56 | |
| 29-Sep-2026 19:32:56 | Successfully installed casaconfig-1.5.1 certifi-2026.7.22 |
| 29-Sep-2026 19:32:56 | Collecting scipy |
| 29-Sep-2026 19:32:56 | Downloading scipy-1.18.1-cp312-cp312-macosx_14_0_arm64.whl.metadata (62 kB) |
| 29-Sep-2026 19:32:56 | Collecting numpy |
| 29-Sep-2026 19:32:56 | Downloading numpy-2.5.3-cp312-cp312-macosx_14_0_arm64.whl.metadata (6.6 kB) |
| 29-Sep-2026 19:32:56 | Downloading scipy-1.18.1-cp312-cp312-macosx_14_0_arm64.whl (20.5 MB) |
| 29-Sep-2026 19:32:57 | ━━━━━━━━━━━━━━━━━━━━━━━━━━━━━━━━━━━━━━━━ 20.5/20.5 MB 95.3 MB/s 0:00:00 |
| 29-Sep-2026 19:32:57 | Downloading numpy-2.5.3-cp312-cp312-macosx_14_0_arm64.whl (5.4 MB) |
| 29-Sep-2026 19:32:57 | ━━━━━━━━━━━━━━━━━━━━━━━━━━━━━━━━━━━━━━━━ 5.4/5.4 MB 93.6 MB/s 0:00:00 |
| 29-Sep-2026 19:32:57 | Installing collected packages: numpy, scipy |
| 29-Sep-2026 19:33:01 | |
| 29-Sep-2026 19:33:01 | Successfully installed numpy-2.5.3 scipy-1.18.1 |
| 29-Sep-2026 19:33:01 | Processing ./casatools-6.7.7.7a14849.dev2-cp312-cp312-macosx_15_0_arm64.whl |
| 29-Sep-2026 19:33:01 | Requirement already satisfied: numpy in /Users/casaci/bamboohome/xml-data/build-dir/CASASPECS-DEVTESTPY312147-TTARM15PY312/casa6testenv/lib/python3.12/site-packages (from casatools==6.7.7.7a14849.dev2) (2.5.3) |
| 29-Sep-2026 19:33:01 | Requirement already satisfied: casaconfig in /Users/casaci/bamboohome/xml-data/build-dir/CASASPECS-DEVTESTPY312147-TTARM15PY312/casa6testenv/lib/python3.12/site-packages (from casatools==6.7.7.7a14849.dev2) (1.5.1) |
| 29-Sep-2026 19:33:01 | Requirement already satisfied: certifi>=2023.5.7 in /Users/casaci/bamboohome/xml-data/build-dir/CASASPECS-DEVTESTPY312147-TTARM15PY312/casa6testenv/lib/python3.12/site-packages (from casaconfig->casatools==6.7.7.7a14849.dev2) (2026.7.22) |
| 29-Sep-2026 19:33:01 | Installing collected packages: casatools |
| 29-Sep-2026 19:33:02 | Successfully installed casatools-6.7.7.7a14849.dev2 |
| 29-Sep-2026 19:33:02 | Processing ./casatasks-6.7.7.7a14849.dev2-py3-none-any.whl |
| 29-Sep-2026 19:33:02 | Requirement already satisfied: casatools==6.7.7.7a14849.dev2 in /Users/casaci/bamboohome/xml-data/build-dir/CASASPECS-DEVTESTPY312147-TTARM15PY312/casa6testenv/lib/python3.12/site-packages (from casatasks==6.7.7.7a14849.dev2) (6.7.7.7a14849.dev2) |
| 29-Sep-2026 19:33:02 | Collecting matplotlib (from casatasks==6.7.7.7a14849.dev2) |
| 29-Sep-2026 19:33:02 | Using cached matplotlib-3.11.2-cp312-cp312-macosx_11_0_arm64.whl.metadata (80 kB) |
| 29-Sep-2026 19:33:02 | Requirement already satisfied: scipy in /Users/casaci/bamboohome/xml-data/build-dir/CASASPECS-DEVTESTPY312147-TTARM15PY312/casa6testenv/lib/python3.12/site-packages (from casatasks==6.7.7.7a14849.dev2) (1.18.1) |
| 29-Sep-2026 19:33:02 | Requirement already satisfied: certifi in /Users/casaci/bamboohome/xml-data/build-dir/CASASPECS-DEVTESTPY312147-TTARM15PY312/casa6testenv/lib/python3.12/site-packages (from casatasks==6.7.7.7a14849.dev2) (2026.7.22) |
| 29-Sep-2026 19:33:02 | Collecting pyerfa (from casatasks==6.7.7.7a14849.dev2) |
| 29-Sep-2026 19:33:02 | Using cached pyerfa-2.0.1.5-cp39-abi3-macosx_11_0_arm64.whl.metadata (5.7 kB) |
| 29-Sep-2026 19:33:02 | Requirement already satisfied: numpy in /Users/casaci/bamboohome/xml-data/build-dir/CASASPECS-DEVTESTPY312147-TTARM15PY312/casa6testenv/lib/python3.12/site-packages (from casatools==6.7.7.7a14849.dev2->casatasks==6.7.7.7a14849.dev2) (2.5.3) |
| 29-Sep-2026 19:33:02 | Requirement already satisfied: casaconfig in /Users/casaci/bamboohome/xml-data/build-dir/CASASPECS-DEVTESTPY312147-TTARM15PY312/casa6testenv/lib/python3.12/site-packages (from casatools==6.7.7.7a14849.dev2->casatasks==6.7.7.7a14849.dev2) (1.5.1) |
| 29-Sep-2026 19:33:02 | Collecting contourpy>=1.0.1 (from matplotlib->casatasks==6.7.7.7a14849.dev2) |
| 29-Sep-2026 19:33:02 | Using cached contourpy-1.4.0-cp312-cp312-macosx_11_0_arm64.whl.metadata (3.8 kB) |
| 29-Sep-2026 19:33:02 | Collecting cycler>=0.10 (from matplotlib->casatasks==6.7.7.7a14849.dev2) |
| 29-Sep-2026 19:33:02 | Using cached cycler-0.12.1-py3-none-any.whl.metadata (3.8 kB) |
| 29-Sep-2026 19:33:02 | Collecting fonttools>=4.28.2 (from matplotlib->casatasks==6.7.7.7a14849.dev2) |
| 29-Sep-2026 19:33:02 | Using cached fonttools-4.66.1-cp312-cp312-macosx_10_13_universal2.whl.metadata (130 kB) |
| 29-Sep-2026 19:33:02 | Collecting kiwisolver>=1.3.1 (from matplotlib->casatasks==6.7.7.7a14849.dev2) |
| 29-Sep-2026 19:33:02 | Using cached kiwisolver-1.5.1-cp312-cp312-macosx_11_0_arm64.whl.metadata (5.2 kB) |
| 29-Sep-2026 19:33:02 | Requirement already satisfied: packaging>=20.0 in /Users/casaci/bamboohome/xml-data/build-dir/CASASPECS-DEVTESTPY312147-TTARM15PY312/casa6testenv/lib/python3.12/site-packages (from matplotlib->casatasks==6.7.7.7a14849.dev2) (26.3) |
| 29-Sep-2026 19:33:02 | Collecting pillow>=9 (from matplotlib->casatasks==6.7.7.7a14849.dev2) |
| 29-Sep-2026 19:33:02 | Using cached pillow-12.3.0-cp312-cp312-macosx_11_0_arm64.whl.metadata (9.1 kB) |
| 29-Sep-2026 19:33:02 | Collecting pyparsing>=3 (from matplotlib->casatasks==6.7.7.7a14849.dev2) |
| 29-Sep-2026 19:33:02 | Using cached pyparsing-3.3.3-py3-none-any.whl.metadata (5.9 kB) |
| 29-Sep-2026 19:33:02 | Collecting python-dateutil>=2.7 (from matplotlib->casatasks==6.7.7.7a14849.dev2) |
| 29-Sep-2026 19:33:02 | Using cached python_dateutil-2.9.0.post0-py2.py3-none-any.whl.metadata (8.4 kB) |
| 29-Sep-2026 19:33:03 | Collecting six>=1.5 (from python-dateutil>=2.7->matplotlib->casatasks==6.7.7.7a14849.dev2) |
| 29-Sep-2026 19:33:03 | Using cached six-1.17.0-py2.py3-none-any.whl.metadata (1.7 kB) |
| 29-Sep-2026 19:33:03 | Using cached matplotlib-3.11.2-cp312-cp312-macosx_11_0_arm64.whl (9.3 MB) |
| 29-Sep-2026 19:33:03 | Using cached contourpy-1.4.0-cp312-cp312-macosx_11_0_arm64.whl (284 kB) |
| 29-Sep-2026 19:33:03 | Using cached cycler-0.12.1-py3-none-any.whl (8.3 kB) |
| 29-Sep-2026 19:33:03 | Using cached fonttools-4.66.1-cp312-cp312-macosx_10_13_universal2.whl (3.1 MB) |
| 29-Sep-2026 19:33:03 | Using cached kiwisolver-1.5.1-cp312-cp312-macosx_11_0_arm64.whl (64 kB) |
| 29-Sep-2026 19:33:03 | Using cached pillow-12.3.0-cp312-cp312-macosx_11_0_arm64.whl (4.8 MB) |
| 29-Sep-2026 19:33:03 | Using cached pyparsing-3.3.3-py3-none-any.whl (126 kB) |
| 29-Sep-2026 19:33:03 | Using cached python_dateutil-2.9.0.post0-py2.py3-none-any.whl (229 kB) |
| 29-Sep-2026 19:33:03 | Using cached six-1.17.0-py2.py3-none-any.whl (11 kB) |
| 29-Sep-2026 19:33:03 | Using cached pyerfa-2.0.1.5-cp39-abi3-macosx_11_0_arm64.whl (329 kB) |
| 29-Sep-2026 19:33:03 | Installing collected packages: six, pyparsing, pyerfa, pillow, kiwisolver, fonttools, cycler, contourpy, python-dateutil, matplotlib, casatasks |
| 29-Sep-2026 19:33:05 | |
| 29-Sep-2026 19:33:05 | Successfully installed casatasks-6.7.7.7a14849.dev2 contourpy-1.4.0 cycler-0.12.1 fonttools-4.66.1 kiwisolver-1.5.1 matplotlib-3.11.2 pillow-12.3.0 pyerfa-2.0.1.5 pyparsing-3.3.3 python-dateutil-2.9.0.post0 six-1.17.0 |
| 29-Sep-2026 19:33:05 | Processing ./casatestutils-6.7.7.7a14849.dev2-py3-none-any.whl |
| 29-Sep-2026 19:33:05 | Collecting pytest>=6.0 (from casatestutils==6.7.7.7a14849.dev2) |
| 29-Sep-2026 19:33:05 | Using cached pytest-9.1.1-py3-none-any.whl.metadata (7.6 kB) |
| 29-Sep-2026 19:33:06 | Collecting astropy (from casatestutils==6.7.7.7a14849.dev2) |
| 29-Sep-2026 19:33:06 | Using cached astropy-8.0.1-cp311-abi3-macosx_11_0_arm64.whl.metadata (11 kB) |
| 29-Sep-2026 19:33:06 | Collecting iniconfig>=1.0.1 (from pytest>=6.0->casatestutils==6.7.7.7a14849.dev2) |
| 29-Sep-2026 19:33:06 | Using cached iniconfig-2.3.0-py3-none-any.whl.metadata (2.5 kB) |
| 29-Sep-2026 19:33:06 | Requirement already satisfied: packaging>=22 in /Users/casaci/bamboohome/xml-data/build-dir/CASASPECS-DEVTESTPY312147-TTARM15PY312/casa6testenv/lib/python3.12/site-packages (from pytest>=6.0->casatestutils==6.7.7.7a14849.dev2) (26.3) |
| 29-Sep-2026 19:33:06 | Collecting pluggy<2,>=1.5 (from pytest>=6.0->casatestutils==6.7.7.7a14849.dev2) |
| 29-Sep-2026 19:33:06 | Using cached pluggy-1.6.0-py3-none-any.whl.metadata (4.8 kB) |
| 29-Sep-2026 19:33:06 | Collecting pygments>=2.7.2 (from pytest>=6.0->casatestutils==6.7.7.7a14849.dev2) |
| 29-Sep-2026 19:33:06 | Using cached pygments-2.21.0-py3-none-any.whl.metadata (2.5 kB) |
| 29-Sep-2026 19:33:06 | Collecting astropy-iers-data>=0.2026.6.22.1.23.34 (from astropy->casatestutils==6.7.7.7a14849.dev2) |
| 29-Sep-2026 19:33:06 | Using cached astropy_iers_data-0.2026.9.28.0.59.37-py3-none-any.whl.metadata (3.4 kB) |
| 29-Sep-2026 19:33:06 | Requirement already satisfied: numpy>=2.0 in /Users/casaci/bamboohome/xml-data/build-dir/CASASPECS-DEVTESTPY312147-TTARM15PY312/casa6testenv/lib/python3.12/site-packages (from astropy->casatestutils==6.7.7.7a14849.dev2) (2.5.3) |
| 29-Sep-2026 19:33:06 | Requirement already satisfied: pyerfa>=2.0.1.3 in /Users/casaci/bamboohome/xml-data/build-dir/CASASPECS-DEVTESTPY312147-TTARM15PY312/casa6testenv/lib/python3.12/site-packages (from astropy->casatestutils==6.7.7.7a14849.dev2) (2.0.1.5) |
| 29-Sep-2026 19:33:06 | Collecting PyYAML>=6.0.0 (from astropy->casatestutils==6.7.7.7a14849.dev2) |
| 29-Sep-2026 19:33:06 | Using cached pyyaml-6.0.3-cp312-cp312-macosx_11_0_arm64.whl.metadata (2.4 kB) |
| 29-Sep-2026 19:33:06 | Using cached pytest-9.1.1-py3-none-any.whl (386 kB) |
| 29-Sep-2026 19:33:06 | Using cached pluggy-1.6.0-py3-none-any.whl (20 kB) |
| 29-Sep-2026 19:33:06 | Using cached iniconfig-2.3.0-py3-none-any.whl (7.5 kB) |
| 29-Sep-2026 19:33:06 | Using cached pygments-2.21.0-py3-none-any.whl (1.3 MB) |
| 29-Sep-2026 19:33:06 | Using cached astropy-8.0.1-cp311-abi3-macosx_11_0_arm64.whl (6.6 MB) |
| 29-Sep-2026 19:33:06 | Using cached astropy_iers_data-0.2026.9.28.0.59.37-py3-none-any.whl (2.0 MB) |
| 29-Sep-2026 19:33:06 | Using cached pyyaml-6.0.3-cp312-cp312-macosx_11_0_arm64.whl (173 kB) |
| 29-Sep-2026 19:33:06 | Installing collected packages: PyYAML, pygments, pluggy, iniconfig, astropy-iers-data, pytest, astropy, casatestutils |
| 29-Sep-2026 19:33:08 | |
| 29-Sep-2026 19:33:08 | Successfully installed PyYAML-6.0.3 astropy-8.0.1 astropy-iers-data-0.2026.9.28.0.59.37 casatestutils-6.7.7.7a14849.dev2 iniconfig-2.3.0 pluggy-1.6.0 pygments-2.21.0 pytest-9.1.1 |
| 29-Sep-2026 19:33:09 | Config: |
| 29-Sep-2026 19:33:09 | datapath=["/opt/casa/data/casa-data", "/opt/casa/data/casatestdata"] |
| 29-Sep-2026 19:33:09 | rundata="/opt/casa/data/casa-data" |
| 29-Sep-2026 19:33:09 | measurespath="/opt/casa/data/casa-data" |
| 29-Sep-2026 19:33:09 | data_auto_update=False |
| 29-Sep-2026 19:33:09 | measures_auto_update=False |
| 29-Sep-2026 19:33:14 | Switched to a new branch 'CAS-14849' |
| 29-Sep-2026 19:33:14 | branch 'CAS-14849' set up to track 'origin/CAS-14849'. |
| 29-Sep-2026 19:33:14 | python runtest.py --ignore_list 'test_casampi,test_task_msview,test_task_imview,test_task_plotms' -t ./casaconfig/tests |
| 29-Sep-2026 19:33:14 | ============================= test session starts ============================== |
| 29-Sep-2026 19:33:14 | platform darwin -- Python 3.12.8, pytest-9.1.1, pluggy-1.6.0 -- /Users/casaci/bamboohome/xml-data/build-dir/CASASPECS-DEVTESTPY312147-TTARM15PY312/casa6testenv/bin/python |
| 29-Sep-2026 19:33:14 | cachedir: .pytest_cache |
| 29-Sep-2026 19:33:14 | rootdir: /Users/casaci/bamboohome/xml-data/build-dir/CASASPECS-DEVTESTPY312147-TTARM15PY312/casa6/casatestutils/nosedir/test_casaconfig |
| 29-Sep-2026 19:33:14 | configfile: pytest.ini |
| 29-Sep-2026 19:33:14 | collecting ... collected 13 items |
| 29-Sep-2026 19:33:14 | |
| 29-Sep-2026 19:33:14 | |
| 29-Sep-2026 19:35:22 | test_casaconfig.py::casaconfig_test::test_auto_install_data |
| 29-Sep-2026 19:35:22 | Test auto install of all data to measurespath on casatools startup |
| 29-Sep-2026 19:35:22 | PASSED |
| 29-Sep-2026 19:35:22 | |
| 29-Sep-2026 19:35:22 | test_casaconfig.py::casaconfig_test::test_auto_update_measures |
| 29-Sep-2026 19:35:22 | Test Automatic Measures Updates to measurespath |
| 29-Sep-2026 19:35:22 | pull_data using version casarundata-2026.02.19-1.tar.gz, acquiring the lock ... |
| 29-Sep-2026 19:35:29 | downloading casarundata contents to /Users/casaci/bamboohome/xml-data/build-dir/CASASPECS-DEVTESTPY312147-TTARM15PY312/casa6/casatestutils/nosedir/test_casaconfig/testrundata (336M) ... done |
| 29-Sep-2026 19:37:05 | casarundata installed casarundata-2026.02.19-1.tar.gz at /Users/casaci/bamboohome/xml-data/build-dir/CASASPECS-DEVTESTPY312147-TTARM15PY312/casa6/casatestutils/nosedir/test_casaconfig/testrundata |
| 29-Sep-2026 19:37:05 | PASSED |
| 29-Sep-2026 19:37:05 | |
| 29-Sep-2026 19:37:28 | test_casaconfig.py::casaconfig_test::test_casaconfig_measures_available |
| 29-Sep-2026 19:37:28 | Test That Today or Yesterday measures data is returned |
| 29-Sep-2026 19:37:28 | FAILED |
| 29-Sep-2026 19:37:28 | |
| 29-Sep-2026 19:38:38 | Error: the Observatories table was not found as expected in /Users/casaci/bamboohome/xml-data/build-dir/CASASPECS-DEVTESTPY312147-TTARM15PY312/casa6/casatestutils/nosedir/test_casaconfig/testmeasures |
| 29-Sep-2026 19:38:38 | Either install casarundata first or set use_astron_obs_table and force to be True when using measures_update. |
| 29-Sep-2026 19:38:38 | Note that the Observatories table provided in the measures tarfile is not the same as that maintained by CASA |
| 29-Sep-2026 19:38:38 | test_casaconfig.py::casaconfig_test::test_casaconfig_measures_update |
| 29-Sep-2026 19:38:38 | Test downgrade to upgrade measures data to location |
| 29-Sep-2026 19:38:38 | measures_update ... acquiring the lock ... |
| 29-Sep-2026 19:38:38 | A measures update has been requested by the force argument |
| 29-Sep-2026 19:38:38 | ... finding available measures ... |
| 29-Sep-2026 19:38:38 | ... downloading NRAO_Measures_20260928-140458.ztar from https://go.nrao.edu/iers/ to /Users/casaci/bamboohome/xml-data/build-dir/CASASPECS-DEVTESTPY312147-TTARM15PY312/casa6/casatestutils/nosedir/test_casaconfig/testmeasures ... |
| 29-Sep-2026 19:38:38 | ... measures data updated at /Users/casaci/bamboohome/xml-data/build-dir/CASASPECS-DEVTESTPY312147-TTARM15PY312/casa6/casatestutils/nosedir/test_casaconfig/testmeasures |
| 29-Sep-2026 19:38:38 | FAILED |
| 29-Sep-2026 19:38:38 | |
| 29-Sep-2026 19:38:38 | test_casaconfig.py::casaconfig_test::test_config_import |
| 29-Sep-2026 19:38:38 | Tests of the config import |
| 29-Sep-2026 19:38:38 | PASSED |
| 29-Sep-2026 19:38:38 | |
| 29-Sep-2026 19:38:39 | test_casaconfig.py::casaconfig_test::test_daily_update |
| 29-Sep-2026 19:38:39 | test that updates do not happen if the installed data is less than 1 day old and do happen when they are older |
| 29-Sep-2026 19:38:39 | pull_data using version casarundata-2025.12.12-1.tar.gz, acquiring the lock ... |
| 29-Sep-2026 19:38:46 | downloading casarundata contents to /Users/casaci/bamboohome/xml-data/build-dir/CASASPECS-DEVTESTPY312147-TTARM15PY312/casa6/casatestutils/nosedir/test_casaconfig/testrundata (336M) ... done |
| 29-Sep-2026 19:39:58 | casarundata installed casarundata-2025.12.12-1.tar.gz at /Users/casaci/bamboohome/xml-data/build-dir/CASASPECS-DEVTESTPY312147-TTARM15PY312/casa6/casatestutils/nosedir/test_casaconfig/testrundata |
| 29-Sep-2026 19:39:58 | data_update: version installed or checked less than 1 day(s) ago, nothing updated or checked |
| 29-Sep-2026 19:39:58 | measures_update: version installed or checked less than 1 day(s) ago, nothing updated or checked |
| 29-Sep-2026 19:39:58 | data_update: version installed or checked less than 1 day(s) ago, nothing updated or checked |
| 29-Sep-2026 19:39:58 | measures_update ... acquiring the lock ... |
| 29-Sep-2026 19:39:58 | ... finding available measures ... |
| 29-Sep-2026 19:39:58 | ... downloading NRAO_Measures_20260928-140458.ztar from https://go.nrao.edu/iers/ to /Users/casaci/bamboohome/xml-data/build-dir/CASASPECS-DEVTESTPY312147-TTARM15PY312/casa6/casatestutils/nosedir/test_casaconfig/testrundata ... |
| 29-Sep-2026 19:39:58 | ... measures data updated at /Users/casaci/bamboohome/xml-data/build-dir/CASASPECS-DEVTESTPY312147-TTARM15PY312/casa6/casatestutils/nosedir/test_casaconfig/testrundata |
| 29-Sep-2026 19:39:58 | data_update using version casarundata-2026.02.19-1.tar.gz, acquiring the lock ... |
| 29-Sep-2026 19:39:58 | Removing files using manifest from previous install of casarundata-2025.12.12-1.tar.gz on 2026-09-29 |
| 29-Sep-2026 19:40:06 | downloading casarundata contents to /Users/casaci/bamboohome/xml-data/build-dir/CASASPECS-DEVTESTPY312147-TTARM15PY312/casa6/casatestutils/nosedir/test_casaconfig/testrundata (336M) ... done |
| 29-Sep-2026 19:42:05 | casarundata installed casarundata-2026.02.19-1.tar.gz at /Users/casaci/bamboohome/xml-data/build-dir/CASASPECS-DEVTESTPY312147-TTARM15PY312/casa6/casatestutils/nosedir/test_casaconfig/testrundata |
| 29-Sep-2026 19:42:05 | measures_update ... acquiring the lock ... |
| 29-Sep-2026 19:42:05 | ... finding available measures ... |
| 29-Sep-2026 19:42:05 | ... downloading NRAO_Measures_20260928-140458.ztar from https://go.nrao.edu/iers/ to /Users/casaci/bamboohome/xml-data/build-dir/CASASPECS-DEVTESTPY312147-TTARM15PY312/casa6/casatestutils/nosedir/test_casaconfig/testrundata ... |
| 29-Sep-2026 19:42:05 | ... measures data updated at /Users/casaci/bamboohome/xml-data/build-dir/CASASPECS-DEVTESTPY312147-TTARM15PY312/casa6/casatestutils/nosedir/test_casaconfig/testrundata |
| 29-Sep-2026 19:42:05 | PASSED |
| 29-Sep-2026 19:42:05 | |
| 29-Sep-2026 19:42:06 | test_casaconfig.py::casaconfig_test::test_exceptions_no_data |
| 29-Sep-2026 19:42:06 | test that exceptions that do not require any data happen when expected |
| 29-Sep-2026 19:42:06 | PASSED |
| 29-Sep-2026 19:42:06 | |
| 29-Sep-2026 19:42:06 | test_casaconfig.py::casaconfig_test::test_exceptions_with_data |
| 29-Sep-2026 19:42:06 | test that exceptions that require data happen when expected |
| 29-Sep-2026 19:42:06 | pull_data using version casarundata-2026.02.19-1.tar.gz, acquiring the lock ... |
| 29-Sep-2026 19:42:13 | downloading casarundata contents to /Users/casaci/bamboohome/xml-data/build-dir/CASASPECS-DEVTESTPY312147-TTARM15PY312/casa6/casatestutils/nosedir/test_casaconfig/testrundata (336M) ... done |
| 29-Sep-2026 19:42:38 | lock file is not empty : /Users/casaci/bamboohome/xml-data/build-dir/CASASPECS-DEVTESTPY312147-TTARM15PY312/casa6/casatestutils/nosedir/test_casaconfig/testrundata/data_update.lock |
| 29-Sep-2026 19:42:38 | The lock file at /Users/casaci/bamboohome/xml-data/build-dir/CASASPECS-DEVTESTPY312147-TTARM15PY312/casa6/casatestutils/nosedir/test_casaconfig/testrundata is not empty. |
| 29-Sep-2026 19:42:38 | A previous attempt to update path may have failed or exited prematurely. |
| 29-Sep-2026 19:42:38 | Remove the lock file and set force to True with the desired version (default to most recent). |
| 29-Sep-2026 19:42:38 | It may be best to completely repopulate path using pull_data and measures_update. |
| 29-Sep-2026 19:42:38 | lock file is not empty : /Users/casaci/bamboohome/xml-data/build-dir/CASASPECS-DEVTESTPY312147-TTARM15PY312/casa6/casatestutils/nosedir/test_casaconfig/testrundata/data_update.lock |
| 29-Sep-2026 19:42:38 | data_update: the lock file at /Users/casaci/bamboohome/xml-data/build-dir/CASASPECS-DEVTESTPY312147-TTARM15PY312/casa6/casatestutils/nosedir/test_casaconfig/testrundata is not empty. |
| 29-Sep-2026 19:42:38 | A previous attempt to update path may have failed or exited prematurely. |
| 29-Sep-2026 19:42:38 | Remove the lock file and set force to True with the desired version (default to most recent). |
| 29-Sep-2026 19:42:38 | It may be best to completely re-populate path using pull_data and measures_update. |
| 29-Sep-2026 19:42:38 | casarundata installed casarundata-2026.02.19-1.tar.gz at /Users/casaci/bamboohome/xml-data/build-dir/CASASPECS-DEVTESTPY312147-TTARM15PY312/casa6/casatestutils/nosedir/test_casaconfig/testrundata |
| 29-Sep-2026 19:42:38 | measures_update ... acquiring the lock ... |
| 29-Sep-2026 19:42:38 | data_update using version casarundata-2024.02.09-1.tar.gz, acquiring the lock ... |
| 29-Sep-2026 19:42:38 | PASSED |
| 29-Sep-2026 19:42:38 | |
| 29-Sep-2026 19:42:38 | test_casaconfig.py::casaconfig_test::test_file_exists |
| 29-Sep-2026 19:42:38 | Test Default config.py exists in casaconfig module |
| 29-Sep-2026 19:42:38 | PASSED |
| 29-Sep-2026 19:42:38 | |
| 29-Sep-2026 19:42:41 | test_casaconfig.py::casaconfig_test::test_import_casatools_bad_measurespath |
| 29-Sep-2026 19:42:41 | Test that import casatools will return ImportError with measurespath set to an empty directory that cannot be written to |
| 29-Sep-2026 19:42:41 | PASSED |
| 29-Sep-2026 19:42:41 | |
| 29-Sep-2026 19:46:23 | measures_update can't find specified version ./WSRT_Measures_20260802-160001.ztar at site https://go.nrao.edu/iers/ |
| 29-Sep-2026 19:48:41 | measures_update can't find specified version NRAO_Measures_20260925-140548.ztar at site https://iers.astron.nl/ |
| 29-Sep-2026 19:48:42 | Unable to retrieve list of available measures versions, measures_site value may be an empty list or no files were found at measures_site, check and try again. |
| 29-Sep-2026 19:48:42 | There was a remote error while attempting to update measures at /Users/casaci/bamboohome/xml-data/build-dir/CASASPECS-DEVTESTPY312147-TTARM15PY312/casa6/casatestutils/nosedir/test_casaconfig/testmeasures |
| 29-Sep-2026 19:48:42 | Check the value of measures_site and try again |
| 29-Sep-2026 19:49:06 | test_casaconfig.py::casaconfig_test::test_measures_site |
| 29-Sep-2026 19:49:06 | tests related to measures site |
| 29-Sep-2026 19:49:06 | Warning: the most recent measures tar file at each of the sites was older than config.measures_site_interval |
| 29-Sep-2026 19:49:06 | https://go.nrao.edu/iers/ had the most recent measures tar file, returning that list |
| 29-Sep-2026 19:49:06 | Warning: the most recent measures tar file at each of the sites was older than config.measures_site_interval |
| 29-Sep-2026 19:49:06 | https://go.nrao.edu/iers/ had the most recent measures tar file, returning that list |
| 29-Sep-2026 19:49:06 | measures_update ... acquiring the lock ... |
| 29-Sep-2026 19:49:06 | A measures update has been requested by the force argument |
| 29-Sep-2026 19:49:06 | ... finding available measures ... |
| 29-Sep-2026 19:49:06 | ... downloading NRAO_Measures_20260928-140458.ztar from https://go.nrao.edu/iers/ to /Users/casaci/bamboohome/xml-data/build-dir/CASASPECS-DEVTESTPY312147-TTARM15PY312/casa6/casatestutils/nosedir/test_casaconfig/testmeasures ... |
| 29-Sep-2026 19:49:06 | ... measures data updated at /Users/casaci/bamboohome/xml-data/build-dir/CASASPECS-DEVTESTPY312147-TTARM15PY312/casa6/casatestutils/nosedir/test_casaconfig/testmeasures |
| 29-Sep-2026 19:49:06 | di : {'site': 'https://go.nrao.edu/iers/', 'version': 'NRAO_Measures_20260928-140458.ztar', 'date': '2026-09-29', 'age': 2.3234773565221714e-09} |
| 29-Sep-2026 19:49:06 | measures_update ... acquiring the lock ... |
| 29-Sep-2026 19:49:06 | A measures update has been requested by the force argument |
| 29-Sep-2026 19:49:06 | ... finding available measures ... |
| 29-Sep-2026 19:49:06 | ... downloading ./WSRT_Measures_20260802-160001.ztar from https://iers.astron.nl/ to /Users/casaci/bamboohome/xml-data/build-dir/CASASPECS-DEVTESTPY312147-TTARM15PY312/casa6/casatestutils/nosedir/test_casaconfig/testmeasures ... |
| 29-Sep-2026 19:49:06 | ... measures data updated at /Users/casaci/bamboohome/xml-data/build-dir/CASASPECS-DEVTESTPY312147-TTARM15PY312/casa6/casatestutils/nosedir/test_casaconfig/testmeasures |
| 29-Sep-2026 19:49:06 | measures_update ... acquiring the lock ... |
| 29-Sep-2026 19:49:06 | A measures update has been requested by the force argument |
| 29-Sep-2026 19:49:06 | ... finding available measures ... |
| 29-Sep-2026 19:49:06 | ... downloading ./WSRT_Measures_20260802-160001.ztar from https://iers.astron.nl/ to /Users/casaci/bamboohome/xml-data/build-dir/CASASPECS-DEVTESTPY312147-TTARM15PY312/casa6/casatestutils/nosedir/test_casaconfig/testmeasures ... |
| 29-Sep-2026 19:49:06 | ... measures data updated at /Users/casaci/bamboohome/xml-data/build-dir/CASASPECS-DEVTESTPY312147-TTARM15PY312/casa6/casatestutils/nosedir/test_casaconfig/testmeasures |
| 29-Sep-2026 19:49:06 | measures_update ... acquiring the lock ... |
| 29-Sep-2026 19:49:06 | A measures update has been requested by the force argument |
| 29-Sep-2026 19:49:06 | ... finding available measures ... |
| 29-Sep-2026 19:49:06 | ... downloading ./WSRT_Measures_20260804-160001.ztar from https://iers.astron.nl/ to /Users/casaci/bamboohome/xml-data/build-dir/CASASPECS-DEVTESTPY312147-TTARM15PY312/casa6/casatestutils/nosedir/test_casaconfig/testmeasures ... |
| 29-Sep-2026 19:49:06 | ... measures data updated at /Users/casaci/bamboohome/xml-data/build-dir/CASASPECS-DEVTESTPY312147-TTARM15PY312/casa6/casatestutils/nosedir/test_casaconfig/testmeasures |
| 29-Sep-2026 19:49:06 | measures_update ... acquiring the lock ... |
| 29-Sep-2026 19:49:06 | A measures update has been requested by the force argument |
| 29-Sep-2026 19:49:06 | ... finding available measures ... |
| 29-Sep-2026 19:49:06 | measures_update ... acquiring the lock ... |
| 29-Sep-2026 19:49:06 | A measures update has been requested by the force argument |
| 29-Sep-2026 19:49:06 | ... finding available measures ... |
| 29-Sep-2026 19:49:06 | ... downloading NRAO_Measures_20260925-140548.ztar from https://go.nrao.edu/iers/ to /Users/casaci/bamboohome/xml-data/build-dir/CASASPECS-DEVTESTPY312147-TTARM15PY312/casa6/casatestutils/nosedir/test_casaconfig/testmeasures ... |
| 29-Sep-2026 19:49:06 | ... measures data updated at /Users/casaci/bamboohome/xml-data/build-dir/CASASPECS-DEVTESTPY312147-TTARM15PY312/casa6/casatestutils/nosedir/test_casaconfig/testmeasures |
| 29-Sep-2026 19:49:06 | measures_update ... acquiring the lock ... |
| 29-Sep-2026 19:49:06 | A measures update has been requested by the force argument |
| 29-Sep-2026 19:49:06 | ... finding available measures ... |
| 29-Sep-2026 19:49:06 | ... downloading NRAO_Measures_20260925-140548.ztar from https://go.nrao.edu/iers/ to /Users/casaci/bamboohome/xml-data/build-dir/CASASPECS-DEVTESTPY312147-TTARM15PY312/casa6/casatestutils/nosedir/test_casaconfig/testmeasures ... |
| 29-Sep-2026 19:49:06 | ... measures data updated at /Users/casaci/bamboohome/xml-data/build-dir/CASASPECS-DEVTESTPY312147-TTARM15PY312/casa6/casatestutils/nosedir/test_casaconfig/testmeasures |
| 29-Sep-2026 19:49:06 | measures_update ... acquiring the lock ... |
| 29-Sep-2026 19:49:06 | A measures update has been requested by the force argument |
| 29-Sep-2026 19:49:06 | ... finding available measures ... |
| 29-Sep-2026 19:49:06 | ... downloading NRAO_Measures_20260928-140458.ztar from https://go.nrao.edu/iers/ to /Users/casaci/bamboohome/xml-data/build-dir/CASASPECS-DEVTESTPY312147-TTARM15PY312/casa6/casatestutils/nosedir/test_casaconfig/testmeasures ... |
| 29-Sep-2026 19:49:06 | ... measures data updated at /Users/casaci/bamboohome/xml-data/build-dir/CASASPECS-DEVTESTPY312147-TTARM15PY312/casa6/casatestutils/nosedir/test_casaconfig/testmeasures |
| 29-Sep-2026 19:49:06 | measures_update ... acquiring the lock ... |
| 29-Sep-2026 19:49:06 | A measures update has been requested by the force argument |
| 29-Sep-2026 19:49:06 | ... finding available measures ... |
| 29-Sep-2026 19:49:06 | measures_update ... acquiring the lock ... |
| 29-Sep-2026 19:49:06 | A measures update has been requested by the force argument |
| 29-Sep-2026 19:49:06 | ... finding available measures ... |
| 29-Sep-2026 19:49:06 | PASSED |
| 29-Sep-2026 19:49:06 | |
| 29-Sep-2026 19:49:06 | test_casaconfig.py::casaconfig_test::test_read_measurespath_from_user_config |
| 29-Sep-2026 19:49:06 | Test casaconfig downloads specific measures data to location and casatools reads that data location |
| 29-Sep-2026 19:49:06 | pull_data using version casarundata-2026.02.19-1.tar.gz, acquiring the lock ... |
| 29-Sep-2026 19:49:13 | downloading casarundata contents to /Users/casaci/bamboohome/xml-data/build-dir/CASASPECS-DEVTESTPY312147-TTARM15PY312/casa6/casatestutils/nosedir/test_casaconfig/testrundata (336M) ... done |
| 29-Sep-2026 19:50:27 | casarundata installed casarundata-2026.02.19-1.tar.gz at /Users/casaci/bamboohome/xml-data/build-dir/CASASPECS-DEVTESTPY312147-TTARM15PY312/casa6/casatestutils/nosedir/test_casaconfig/testrundata |
| 29-Sep-2026 19:50:27 | PASSED |
| 29-Sep-2026 19:50:27 | |
| 29-Sep-2026 19:50:27 | test_casaconfig.py::casaconfig_test::test_update_interval |
| 29-Sep-2026 19:50:27 | tests use of config update_interval values |
| 29-Sep-2026 19:50:27 | pull_data using version casarundata-2026.02.19-1.tar.gz, acquiring the lock ... |
| 29-Sep-2026 19:50:34 | downloading casarundata contents to /Users/casaci/bamboohome/xml-data/build-dir/CASASPECS-DEVTESTPY312147-TTARM15PY312/casa6/casatestutils/nosedir/test_casaconfig/testrundata (336M) ... done |
| 29-Sep-2026 19:50:36 | casarundata installed casarundata-2026.02.19-1.tar.gz at /Users/casaci/bamboohome/xml-data/build-dir/CASASPECS-DEVTESTPY312147-TTARM15PY312/casa6/casatestutils/nosedir/test_casaconfig/testrundata |
| 29-Sep-2026 19:50:36 | data_update using version casarundata-2025.12.12-1.tar.gz, acquiring the lock ... |
| 29-Sep-2026 19:50:36 | Removing files using manifest from previous install of casarundata-2026.02.19-1.tar.gz on 2026-09-29 |
| 29-Sep-2026 19:50:43 | downloading casarundata contents to /Users/casaci/bamboohome/xml-data/build-dir/CASASPECS-DEVTESTPY312147-TTARM15PY312/casa6/casatestutils/nosedir/test_casaconfig/testrundata (336M) ... done |
| 29-Sep-2026 19:50:44 | casarundata installed casarundata-2025.12.12-1.tar.gz at /Users/casaci/bamboohome/xml-data/build-dir/CASASPECS-DEVTESTPY312147-TTARM15PY312/casa6/casatestutils/nosedir/test_casaconfig/testrundata |
| 29-Sep-2026 19:50:44 | data_update: version installed or checked less than 1 day(s) ago, nothing updated or checked |
| 29-Sep-2026 19:50:44 | data_update using version casarundata-2026.02.19-1.tar.gz, acquiring the lock ... |
| 29-Sep-2026 19:50:44 | Removing files using manifest from previous install of casarundata-2025.12.12-1.tar.gz on 2026-09-29 |
| 29-Sep-2026 19:50:51 | downloading casarundata contents to /Users/casaci/bamboohome/xml-data/build-dir/CASASPECS-DEVTESTPY312147-TTARM15PY312/casa6/casatestutils/nosedir/test_casaconfig/testrundata (336M) ... done |
| 29-Sep-2026 19:53:13 | casarundata installed casarundata-2026.02.19-1.tar.gz at /Users/casaci/bamboohome/xml-data/build-dir/CASASPECS-DEVTESTPY312147-TTARM15PY312/casa6/casatestutils/nosedir/test_casaconfig/testrundata |
| 29-Sep-2026 19:53:13 | measures_update ... acquiring the lock ... |
| 29-Sep-2026 19:53:13 | A measures update has been requested by the force argument |
| 29-Sep-2026 19:53:13 | ... finding available measures ... |
| 29-Sep-2026 19:53:13 | ... downloading NRAO_Measures_20260927-140501.ztar from https://go.nrao.edu/iers/ to /Users/casaci/bamboohome/xml-data/build-dir/CASASPECS-DEVTESTPY312147-TTARM15PY312/casa6/casatestutils/nosedir/test_casaconfig/testrundata ... |
| 29-Sep-2026 19:53:13 | ... measures data updated at /Users/casaci/bamboohome/xml-data/build-dir/CASASPECS-DEVTESTPY312147-TTARM15PY312/casa6/casatestutils/nosedir/test_casaconfig/testrundata |
| 29-Sep-2026 19:53:13 | measures_update: version installed or checked less than 1 day(s) ago, nothing updated or checked |
| 29-Sep-2026 19:53:13 | measures_update ... acquiring the lock ... |
| 29-Sep-2026 19:53:13 | ... finding available measures ... |
| 29-Sep-2026 19:53:13 | ... downloading NRAO_Measures_20260928-140458.ztar from https://go.nrao.edu/iers/ to /Users/casaci/bamboohome/xml-data/build-dir/CASASPECS-DEVTESTPY312147-TTARM15PY312/casa6/casatestutils/nosedir/test_casaconfig/testrundata ... |
| 29-Sep-2026 19:53:13 | ... measures data updated at /Users/casaci/bamboohome/xml-data/build-dir/CASASPECS-DEVTESTPY312147-TTARM15PY312/casa6/casatestutils/nosedir/test_casaconfig/testrundata |
| 29-Sep-2026 19:53:13 | PASSED |
| 29-Sep-2026 19:53:13 | |
| 29-Sep-2026 19:53:13 | =================================== FAILURES =================================== |
| 29-Sep-2026 19:53:13 | ______________ casaconfig_test.test_casaconfig_measures_available ______________ |
| 29-Sep-2026 19:53:13 | test_casaconfig.py:176: in test_casaconfig_measures_available |
| 29-Sep-2026 19:53:13 | self.assertTrue(any(elem in self.get_meas_avail() for elem in [measuresdata_today, measuresdata_yesterday])) |
| 29-Sep-2026 19:53:13 | E AssertionError: False is not true |
| 29-Sep-2026 19:53:13 | _______________ casaconfig_test.test_casaconfig_measures_update ________________ |
| 29-Sep-2026 19:53:13 | test_casaconfig.py:197: in test_casaconfig_measures_update |
| 29-Sep-2026 19:53:13 | self.assertTrue(newVers == vers) |
| 29-Sep-2026 19:53:13 | E AssertionError: False is not true |
| 29-Sep-2026 19:53:13 | - generated xml file: /Users/casaci/bamboohome/xml-data/build-dir/CASASPECS-DEVTESTPY312147-TTARM15PY312/casa6/casatestutils/nosedir/xml/test_casaconfig/nose.xml - |
| 29-Sep-2026 19:53:13 | =========================== short test summary info ============================ |
| 29-Sep-2026 19:53:13 | FAILED test_casaconfig.py::casaconfig_test::test_casaconfig_measures_available |
| 29-Sep-2026 19:53:13 | FAILED test_casaconfig.py::casaconfig_test::test_casaconfig_measures_update |
| 29-Sep-2026 19:53:13 | ============= 2 failed, 11 passed, 1 warning in 1198.74s (0:19:58) ============= |
| 29-Sep-2026 19:53:13 | Namespace(list=False, verbose=False, dry_run=False, classes=None, file=None, mapfile=None, branch=None, merge_target=None, pkg=None, work_dir=None, ncores=2, test_paths='./casaconfig/tests', test_list=None, test_config=None, test_group=None, pmode=None, bamboo=False, cachedir=None, ignore_list='test_casampi,test_task_msview,test_task_imview,test_task_plotms', run_skipped=False, only_skipped=False) |
| 29-Sep-2026 19:53:13 | |
| 29-Sep-2026 19:53:13 | Operating system: Darwin |
| 29-Sep-2026 19:53:13 | |
| 29-Sep-2026 19:53:13 | Arguments Sent Direct To Pytest : [] |
| 29-Sep-2026 19:53:13 | |
| 29-Sep-2026 19:53:13 | Tests to Ignore: ['test_casampi', 'test_task_msview', 'test_task_imview', 'test_task_plotms'] |
| 29-Sep-2026 19:53:13 | Running 1 Test(s) |
| 29-Sep-2026 19:53:13 | Cleaning: /Users/casaci/bamboohome/xml-data/build-dir/CASASPECS-DEVTESTPY312147-TTARM15PY312/casa6/casatestutils/nosedir/ |
| 29-Sep-2026 19:53:13 | Tests: ['/Users/casaci/bamboohome/xml-data/build-dir/CASASPECS-DEVTESTPY312147-TTARM15PY312/casa6/casatestutils/casaconfig/tests/test_casaconfig.py'] |
| 29-Sep-2026 19:53:13 | |
| 29-Sep-2026 19:53:13 | Setting Working Directory: /Users/casaci/bamboohome/xml-data/build-dir/CASASPECS-DEVTESTPY312147-TTARM15PY312/casa6/casatestutils/nosedir/test_casaconfig/ |
| 29-Sep-2026 19:53:13 | Test Directory: /Users/casaci/bamboohome/xml-data/build-dir/CASASPECS-DEVTESTPY312147-TTARM15PY312/casa6/casatestutils/nosedir/test_casaconfig |
| 29-Sep-2026 19:53:13 | |
| 29-Sep-2026 19:53:13 | Running Command: pytest --junitxml=/Users/casaci/bamboohome/xml-data/build-dir/CASASPECS-DEVTESTPY312147-TTARM15PY312/casa6/casatestutils/nosedir/xml/test_casaconfig/nose.xml -s --disable-pytest-warnings --verbose -ra --tb=short /Users/casaci/bamboohome/xml-data/build-dir/CASASPECS-DEVTESTPY312147-TTARM15PY312/casa6/casatestutils/nosedir/test_casaconfig/ |
| 29-Sep-2026 19:53:13 | a nosedir |
| 29-Sep-2026 19:53:13 | a nosedir/summary_of_failed.log |
| 29-Sep-2026 19:53:13 | a nosedir/xml |
| 29-Sep-2026 19:53:13 | a nosedir/test_casaconfig |
| 29-Sep-2026 19:53:13 | a nosedir/test_casaconfig/test_casaconfig.py |
| 29-Sep-2026 19:53:13 | a nosedir/test_casaconfig/conftest.py |
| 29-Sep-2026 19:53:13 | a nosedir/test_casaconfig/casa-20260929-233339.log |
| 29-Sep-2026 19:53:13 | a nosedir/test_casaconfig/casa-20260929-234241.log |
| 29-Sep-2026 19:53:13 | a nosedir/test_casaconfig/casa-20260929-234937.log |
| 29-Sep-2026 19:53:13 | a nosedir/test_casaconfig/short_summary.log |
| 29-Sep-2026 19:53:13 | a nosedir/test_casaconfig/casa-20260929-233555.log |
| 29-Sep-2026 19:53:13 | a nosedir/test_casaconfig/casa-20260929-233341.log |
| 29-Sep-2026 19:53:13 | a nosedir/xml/test_casaconfig |
| 29-Sep-2026 19:53:13 | a nosedir/xml/test_casaconfig/nose.xml |
| 29-Sep-2026 19:53:13 | Finished task 'Test wheel' with result: Success |
| 29-Sep-2026 19:53:13 | Starting task 'Parse tests' of type 'com.atlassian.bamboo.plugins.testresultparser:task.testresultparser.junit' |
| 29-Sep-2026 19:53:13 | Parsing test results under /Users/casaci/bamboohome/xml-data/build-dir/CASASPECS-DEVTESTPY312147-TTARM15PY312... |
| 29-Sep-2026 19:53:13 | Failing task since 2 failing test cases were found. |
| 29-Sep-2026 19:53:13 | Finished task 'Parse tests' with result: Failed |
| 29-Sep-2026 19:53:13 | Running post build plugin 'Docker Container Cleanup' |
| 29-Sep-2026 19:53:13 | Running post build plugin 'NCover Results Collector' |
| 29-Sep-2026 19:53:13 | Running post build plugin 'Build Results Label Collector' |
| 29-Sep-2026 19:53:13 | Running post build plugin 'Clover Results Collector' |
| 29-Sep-2026 19:53:13 | Running post build plugin 'npm Cache Cleanup' |
| 29-Sep-2026 19:53:13 | Running post build plugin 'Artifact Copier' |
| 29-Sep-2026 19:53:13 | Publishing an artifact: requirements.txt |
| 29-Sep-2026 19:53:13 | Finished publishing of artifact Non required job artifact Http Compression On : [requirements.txt], patterns: [requirements.txt] anchored at: [wheeldirectory/] in 45.97 ms |
| 29-Sep-2026 19:53:13 | Publishing an artifact: Workdir |
| 29-Sep-2026 19:53:13 | Finished publishing of artifact Non required job artifact Http Compression On : [Workdir], patterns: [work*.tar.gz] anchored at: [wheeldirectory/] in 25.62 ms |
| 29-Sep-2026 19:53:13 | Finalising the build... |
| 29-Sep-2026 19:53:13 | Stopping timer. |
| 29-Sep-2026 19:53:13 | Build CASASPECS-DEVTESTPY312147-TTARM15PY312-3 completed. |
| 29-Sep-2026 19:53:13 | Running on server: post build plugin 'Build Hanging Detection Configuration' |
| 29-Sep-2026 19:53:13 | Running on server: post build plugin 'NCover Results Collector' |
| 29-Sep-2026 19:53:13 | Running on server: post build plugin 'Build Labeller' |
| 29-Sep-2026 19:53:13 | Running on server: post build plugin 'Clover Delta Calculator' |
| 29-Sep-2026 19:53:13 | Running on server: post build plugin 'Maven Dependencies Postprocessor' |
| 29-Sep-2026 19:53:13 | All post build plugins have finished |
| 29-Sep-2026 19:53:13 | Generating build results summary... |
| 29-Sep-2026 19:53:13 | Saving build results to disk... |
| 29-Sep-2026 19:53:13 | Store variable context... |
| 29-Sep-2026 19:53:13 | Finished building CASASPECS-DEVTESTPY312147-TTARM15PY312-3. |