Build: #3 failed

Job: Test Tasks macOS 15 Py3.12 failed

Job result summary

Completed
Duration
24 minutes
Agent
cbt-macos15-test-4
Revision
2622d8cd816c2e6e3517837f8b7d521faf3e561d
Total tests
13

Tests

  • 13 tests in total
  • 2 tests failed
  • 2 failures are new
  • 19 minutes taken in total.
New test failures 2
Status Test Duration
Collapse Failed test_casaconfig casaconfig_test.test_casaconfig_measures_available
23 secs
AssertionError: False is not true
test_casaconfig.py:176: in test_casaconfig_measures_available
    self.assertTrue(any(elem in self.get_meas_avail() for elem in [measuresdata_today, measuresdata_yesterday]))
E   AssertionError: False is not true
Collapse Failed test_casaconfig casaconfig_test.test_casaconfig_measures_update
1 min
AssertionError: False is not true
test_casaconfig.py:197: in test_casaconfig_measures_update
    self.assertTrue(newVers == vers)
E   AssertionError: False is not true

Error summary

The build generated some errors. See the full build log for more details.

error: Your local changes to the following files would be overwritten by merge:
        nrao/VLA/CalModels/3C138_K.im/table.dat
        nrao/VLA/CalModels/3C138_K.im/table.lock
Please commit your changes or stash them before you merge.
Aborting
  % Total    % Received % Xferd  Average Speed   Time    Time     Time  Current
                                 Dload  Upload   Total   Spent    Left  Speed

  0     0    0     0    0     0      0      0 --:--:-- --:--:-- --:--:--     0
100 9419k  100 9419k    0     0  65.7M      0 --:--:-- --:--:-- --:--:-- 66.1M
  % Total    % Received % Xferd  Average Speed   Time    Time     Time  Current
                                 Dload  Upload   Total   Spent    Left  Speed

  0     0    0     0    0     0      0      0 --:--:-- --:--:-- --:--:--     0
100   201  100   201    0     0   6735      0 --:--:-- --:--:-- --:--:--  6931
  % Total    % Received % Xferd  Average Speed   Time    Time     Time  Current
                                 Dload  Upload   Total   Spent    Left  Speed

  0     0    0     0    0     0      0      0 --:--:-- --:--:-- --:--:--     0
100   511  100   511    0     0  23034      0 --:--:-- --:--:-- --:--:-- 23227
Switched to a new branch 'CAS-14849'
Updated 0 paths from fb45b40137
Updated 0 paths from a0fff8df6c
Switched to a new branch 'CAS-14849'
Error: the Observatories table was not found as expected in /Users/casaci/bamboohome/xml-data/build-dir/CASASPECS-DEVTESTPY312147-TTARM15PY312/casa6/casatestutils/nosedir/test_casaconfig/testmeasures
Either install casarundata first or set use_astron_obs_table and force to be True when using measures_update.
Note that the Observatories table provided in the measures tarfile is not the same as that maintained by CASA
lock file is not empty : /Users/casaci/bamboohome/xml-data/build-dir/CASASPECS-DEVTESTPY312147-TTARM15PY312/casa6/casatestutils/nosedir/test_casaconfig/testrundata/data_update.lock
The lock file at /Users/casaci/bamboohome/xml-data/build-dir/CASASPECS-DEVTESTPY312147-TTARM15PY312/casa6/casatestutils/nosedir/test_casaconfig/testrundata is not empty.
A previous attempt to update path may have failed or exited prematurely.
Remove the lock file and set force to True with the desired version (default to most recent).
It may be best to completely repopulate path using pull_data and measures_update.
lock file is not empty : /Users/casaci/bamboohome/xml-data/build-dir/CASASPECS-DEVTESTPY312147-TTARM15PY312/casa6/casatestutils/nosedir/test_casaconfig/testrundata/data_update.lock
data_update: the lock file at /Users/casaci/bamboohome/xml-data/build-dir/CASASPECS-DEVTESTPY312147-TTARM15PY312/casa6/casatestutils/nosedir/test_casaconfig/testrundata is not empty.
A previous attempt to update path may have failed or exited prematurely.
Remove the lock file and set force to True with the desired version (default to most recent).
It may be best to completely re-populate path using pull_data and measures_update.
measures_update can't find specified version ./WSRT_Measures_20260802-160001.ztar at site https://go.nrao.edu/iers/
measures_update can't find specified version NRAO_Measures_20260925-140548.ztar at site https://iers.astron.nl/
Unable to retrieve list of available measures versions, measures_site value may be an empty list or no files were found at measures_site, check and try again.
There was a remote error while attempting to update measures at /Users/casaci/bamboohome/xml-data/build-dir/CASASPECS-DEVTESTPY312147-TTARM15PY312/casa6/casatestutils/nosedir/test_casaconfig/testmeasures
Check the value of measures_site and try again
a nosedir
a nosedir/summary_of_failed.log
a nosedir/xml
a nosedir/test_casaconfig
a nosedir/test_casaconfig/test_casaconfig.py
a nosedir/test_casaconfig/conftest.py
a nosedir/test_casaconfig/casa-20260929-233339.log
a nosedir/test_casaconfig/casa-20260929-234241.log
a nosedir/test_casaconfig/casa-20260929-234937.log
a nosedir/test_casaconfig/short_summary.log
a nosedir/test_casaconfig/casa-20260929-233555.log
a nosedir/test_casaconfig/casa-20260929-233341.log
a nosedir/xml/test_casaconfig
a nosedir/xml/test_casaconfig/nose.xml