Build: #3 failed

Job: Test Tasks macOS 15 Py3.12 failed

Test results

  • 13 tests in total
  • 2 tests failed
  • 2 failures are new
  • 19 minutes taken in total.

Build 3 has the following 2 errors: 2 new failure(s) occurred since the previous build.

New test failures 2
Status Test Duration
Collapse Failed test_casaconfig casaconfig_test.test_casaconfig_measures_available
23 secs
AssertionError: False is not true
test_casaconfig.py:176: in test_casaconfig_measures_available
    self.assertTrue(any(elem in self.get_meas_avail() for elem in [measuresdata_today, measuresdata_yesterday]))
E   AssertionError: False is not true
Collapse Failed test_casaconfig casaconfig_test.test_casaconfig_measures_update
1 min
AssertionError: False is not true
test_casaconfig.py:197: in test_casaconfig_measures_update
    self.assertTrue(newVers == vers)
E   AssertionError: False is not true