Build: #3 failed Manual run by CASA adm account

Build result summary

Details

Completed
Queue duration
1 second
Duration
24 minutes
Labels
None
Revisions
CASA6
2622d8cd816c2e6e3517837f8b7d521faf3e561d
OPEN-CASA-PKG
e5285e68467f01199807a1f1a978aec8a4781be7
Total tests
1424

Tests

Responsible

  • Bob Garwood Bob Garwood Automatically assigned

Code commits

CASA6
Author Commit Message Commit date
Bob Garwood Bob Garwood 2622d8cd816c2e6e3517837f8b7d521faf3e561d casaconfig to 1.5.1, commented out casaconfig dev info from setup.py

Tests

New test failures 4
Status Test View job Duration
Collapse Failed test_casaconfig casaconfig_test.test_casaconfig_measures_available
Test Tasks Many Linux 2.28 Py3.12 23 secs
AssertionError: False is not true
test_casaconfig.py:176: in test_casaconfig_measures_available
    self.assertTrue(any(elem in self.get_meas_avail() for elem in [measuresdata_today, measuresdata_yesterday]))
E   AssertionError: False is not true
Collapse Failed test_casaconfig casaconfig_test.test_casaconfig_measures_update
Test Tasks Many Linux 2.28 Py3.12 1 min
AssertionError: False is not true
test_casaconfig.py:197: in test_casaconfig_measures_update
    self.assertTrue(newVers == vers)
E   AssertionError: False is not true
Collapse Failed test_casaconfig casaconfig_test.test_casaconfig_measures_available
Test Tasks macOS 15 Py3.12 23 secs
AssertionError: False is not true
test_casaconfig.py:176: in test_casaconfig_measures_available
    self.assertTrue(any(elem in self.get_meas_avail() for elem in [measuresdata_today, measuresdata_yesterday]))
E   AssertionError: False is not true
Collapse Failed test_casaconfig casaconfig_test.test_casaconfig_measures_update
Test Tasks macOS 15 Py3.12 1 min
AssertionError: False is not true
test_casaconfig.py:197: in test_casaconfig_measures_update
    self.assertTrue(newVers == vers)
E   AssertionError: False is not true