Build: #3 failed

Job: Test Tasks Many Linux 2.28 Py3.12 failed

Build log

The build generated 563 lines of output. Download or view full build log.

29-Sep-2026 19:29:05 Build CASASPECS - Dev Test 3.12 - CAS-14849 - Test Tasks Many Linux 2.28 Py3.12 #3 (CASASPECS-DEVTESTPY312147-TTM228PY312-3) is being prepared for building on agent casaci-4.cv.nrao.edu, bamboo version: 9.6.26
29-Sep-2026 19:29:05 Remote agent on host casaci-4.cv.nrao.edu
29-Sep-2026 19:29:05 Build working directory is /opt/ci_workspace/casa/bamboo/agent4/xml-data/build-dir/CASASPECS-DEVTESTPY312147-TTM228PY312
29-Sep-2026 19:29:05 Executing build CASASPECS - Dev Test 3.12 - CAS-14849 - Test Tasks Many Linux 2.28 Py3.12 #3 (CASASPECS-DEVTESTPY312147-TTM228PY312-3)
29-Sep-2026 19:29:05 Starting task 'Source Code Checkout' of type 'com.atlassian.bamboo.plugins.vcs:task.vcs.checkout'
29-Sep-2026 19:29:05 Build always requires a clean checkout
29-Sep-2026 19:29:05 Cleaning build directory '/opt/ci_workspace/casa/bamboo/agent4/xml-data/build-dir/CASASPECS-DEVTESTPY312147-TTM228PY312'
29-Sep-2026 19:29:05 Checking out into /opt/ci_workspace/casa/bamboo/agent4/xml-data/build-dir/CASASPECS-DEVTESTPY312147-TTM228PY312
29-Sep-2026 19:29:05 Updating source code to revision: 2622d8cd816c2e6e3517837f8b7d521faf3e561d
29-Sep-2026 19:29:08 Fetching 'refs/heads/CAS-14849' from 'ssh://git@open-bitbucket.nrao.edu:7999/casa/casa6.git'.
29-Sep-2026 19:29:08 Warning: Permanently added '[127.0.0.1]:36729' (RSA) to the list of known hosts.
29-Sep-2026 19:29:08 X11 forwarding request failed on channel 0
29-Sep-2026 19:29:08 Checking out revision 2622d8cd816c2e6e3517837f8b7d521faf3e561d.
29-Sep-2026 19:29:08 Creating local git repository in '/opt/ci_workspace/casa/bamboo/agent4/xml-data/build-dir/CASASPECS-DEVTESTPY312147-TTM228PY312/.git'.
29-Sep-2026 19:29:08 Cloning into '/opt/ci_workspace/casa/bamboo/agent4/xml-data/build-dir/CASASPECS-DEVTESTPY312147-TTM228PY312'...
29-Sep-2026 19:29:08 done.
29-Sep-2026 19:29:10 Switched to a new branch 'CAS-14849'
29-Sep-2026 19:29:10 branch 'CAS-14849' set up to track 'origin/CAS-14849'.
29-Sep-2026 19:29:10 Submodule 'casatools/casacore' (https://github.com/casacore/casacore.git) registered for path 'casatools/casacore'
29-Sep-2026 19:29:10 Submodule 'casatools/grpc-source' (https://github.com/grpc/grpc) registered for path 'casatools/grpc-source'
29-Sep-2026 19:29:10 Cloning into '/opt/ci_workspace/casa/bamboo/agent4/xml-data/build-dir/CASASPECS-DEVTESTPY312147-TTM228PY312/casatools/casacore'...
29-Sep-2026 19:29:17 Cloning into '/opt/ci_workspace/casa/bamboo/agent4/xml-data/build-dir/CASASPECS-DEVTESTPY312147-TTM228PY312/casatools/grpc-source'...
29-Sep-2026 19:29:37 Submodule path 'casatools/casacore': checked out 'aaf72eb7edd5a5fecefa78ca04713233b7b6ffd6'
29-Sep-2026 19:29:37 Submodule path 'casatools/grpc-source': checked out 'cca868ac8f3641df4003a82b7fc54c921e14f765'
29-Sep-2026 19:29:37 Submodule 'third_party/abseil-cpp' (https://github.com/abseil/abseil-cpp) registered for path 'casatools/grpc-source/third_party/abseil-cpp'
29-Sep-2026 19:29:37 Submodule 'third_party/benchmark' (https://github.com/google/benchmark) registered for path 'casatools/grpc-source/third_party/benchmark'
29-Sep-2026 19:29:37 Submodule 'third_party/bloaty' (https://github.com/google/bloaty.git) registered for path 'casatools/grpc-source/third_party/bloaty'
29-Sep-2026 19:29:37 Submodule 'third_party/boringssl' (https://github.com/google/boringssl.git) registered for path 'casatools/grpc-source/third_party/boringssl'
29-Sep-2026 19:29:37 Submodule 'third_party/boringssl-with-bazel' (https://github.com/google/boringssl.git) registered for path 'casatools/grpc-source/third_party/boringssl-with-bazel'
29-Sep-2026 19:29:37 Submodule 'third_party/cares/cares' (https://github.com/c-ares/c-ares.git) registered for path 'casatools/grpc-source/third_party/cares/cares'
29-Sep-2026 19:29:37 Submodule 'third_party/gflags' (https://github.com/gflags/gflags.git) registered for path 'casatools/grpc-source/third_party/gflags'
29-Sep-2026 19:29:37 Submodule 'third_party/googletest' (https://github.com/google/googletest.git) registered for path 'casatools/grpc-source/third_party/googletest'
29-Sep-2026 19:29:37 Submodule 'third_party/protobuf' (https://github.com/google/protobuf.git) registered for path 'casatools/grpc-source/third_party/protobuf'
29-Sep-2026 19:29:37 Submodule 'third_party/zlib' (https://github.com/madler/zlib) registered for path 'casatools/grpc-source/third_party/zlib'
29-Sep-2026 19:29:37 Cloning into '/opt/ci_workspace/casa/bamboo/agent4/xml-data/build-dir/CASASPECS-DEVTESTPY312147-TTM228PY312/casatools/grpc-source/third_party/abseil-cpp'...
29-Sep-2026 19:29:38 Cloning into '/opt/ci_workspace/casa/bamboo/agent4/xml-data/build-dir/CASASPECS-DEVTESTPY312147-TTM228PY312/casatools/grpc-source/third_party/benchmark'...
29-Sep-2026 19:29:39 Cloning into '/opt/ci_workspace/casa/bamboo/agent4/xml-data/build-dir/CASASPECS-DEVTESTPY312147-TTM228PY312/casatools/grpc-source/third_party/bloaty'...
29-Sep-2026 19:29:40 Cloning into '/opt/ci_workspace/casa/bamboo/agent4/xml-data/build-dir/CASASPECS-DEVTESTPY312147-TTM228PY312/casatools/grpc-source/third_party/boringssl'...
29-Sep-2026 19:29:49 Cloning into '/opt/ci_workspace/casa/bamboo/agent4/xml-data/build-dir/CASASPECS-DEVTESTPY312147-TTM228PY312/casatools/grpc-source/third_party/boringssl-with-bazel'...
29-Sep-2026 19:29:58 Cloning into '/opt/ci_workspace/casa/bamboo/agent4/xml-data/build-dir/CASASPECS-DEVTESTPY312147-TTM228PY312/casatools/grpc-source/third_party/cares/cares'...
29-Sep-2026 19:29:59 Cloning into '/opt/ci_workspace/casa/bamboo/agent4/xml-data/build-dir/CASASPECS-DEVTESTPY312147-TTM228PY312/casatools/grpc-source/third_party/gflags'...
29-Sep-2026 19:30:00 Cloning into '/opt/ci_workspace/casa/bamboo/agent4/xml-data/build-dir/CASASPECS-DEVTESTPY312147-TTM228PY312/casatools/grpc-source/third_party/googletest'...
29-Sep-2026 19:30:01 Cloning into '/opt/ci_workspace/casa/bamboo/agent4/xml-data/build-dir/CASASPECS-DEVTESTPY312147-TTM228PY312/casatools/grpc-source/third_party/protobuf'...
29-Sep-2026 19:30:10 Cloning into '/opt/ci_workspace/casa/bamboo/agent4/xml-data/build-dir/CASASPECS-DEVTESTPY312147-TTM228PY312/casatools/grpc-source/third_party/zlib'...
29-Sep-2026 19:30:10 Submodule path 'casatools/grpc-source/third_party/abseil-cpp': checked out 'cc4bed2d74f7c8717e31f9579214ab52a9c9c610'
29-Sep-2026 19:30:10 Submodule path 'casatools/grpc-source/third_party/benchmark': checked out '5b7683f49e1e9223cf9927b24f6fd3d6bd82e3f8'
29-Sep-2026 19:30:10 Submodule path 'casatools/grpc-source/third_party/bloaty': checked out '73594cde8c9a52a102c4341c244c833aa61b9c06'
29-Sep-2026 19:30:10 Submodule 'third_party/googletest' (https://github.com/google/googletest.git) registered for path 'casatools/grpc-source/third_party/bloaty/third_party/googletest'
29-Sep-2026 19:30:10 Submodule 'third_party/libFuzzer' (https://chromium.googlesource.com/chromium/llvm-project/llvm/lib/Fuzzer) registered for path 'casatools/grpc-source/third_party/bloaty/third_party/libFuzzer'
29-Sep-2026 19:30:10 Submodule 'third_party/re2' (https://github.com/google/re2) registered for path 'casatools/grpc-source/third_party/bloaty/third_party/re2'
29-Sep-2026 19:30:10 Cloning into '/opt/ci_workspace/casa/bamboo/agent4/xml-data/build-dir/CASASPECS-DEVTESTPY312147-TTM228PY312/casatools/grpc-source/third_party/bloaty/third_party/googletest'...
29-Sep-2026 19:30:11 Cloning into '/opt/ci_workspace/casa/bamboo/agent4/xml-data/build-dir/CASASPECS-DEVTESTPY312147-TTM228PY312/casatools/grpc-source/third_party/bloaty/third_party/libFuzzer'...
29-Sep-2026 19:30:11 Cloning into '/opt/ci_workspace/casa/bamboo/agent4/xml-data/build-dir/CASASPECS-DEVTESTPY312147-TTM228PY312/casatools/grpc-source/third_party/bloaty/third_party/re2'...
29-Sep-2026 19:30:12 Submodule path 'casatools/grpc-source/third_party/bloaty/third_party/googletest': checked out 'a2b8a8e07628e5fd60644b6dd99c1b5e7d7f1f47'
29-Sep-2026 19:30:12 Submodule path 'casatools/grpc-source/third_party/bloaty/third_party/libFuzzer': checked out '1b543d6e5073b56be214394890c9193979a3d7e1'
29-Sep-2026 19:30:12 Submodule path 'casatools/grpc-source/third_party/bloaty/third_party/re2': checked out 'c964d9b07816f9b52ca692e23b8b3dba33beec54'
29-Sep-2026 19:30:12 Submodule path 'casatools/grpc-source/third_party/boringssl': checked out 'be2ee342d3781ddb954f91f8a7e660c6f59e87e5'
29-Sep-2026 19:30:13 Submodule path 'casatools/grpc-source/third_party/boringssl-with-bazel': checked out '886e7d75368e3f4fab3f4d0d3584e4abfc557755'
29-Sep-2026 19:30:13 Submodule path 'casatools/grpc-source/third_party/cares/cares': checked out '3be1924221e1326df520f8498d704a5c4c8d0cce'
29-Sep-2026 19:30:13 Submodule path 'casatools/grpc-source/third_party/gflags': checked out '30dbc81fb5ffdc98ea9b14b1918bfe4e8779b26e'
29-Sep-2026 19:30:13 Submodule 'doc' (https://github.com/gflags/gflags.git) registered for path 'casatools/grpc-source/third_party/gflags/doc'
29-Sep-2026 19:30:13 Cloning into '/opt/ci_workspace/casa/bamboo/agent4/xml-data/build-dir/CASASPECS-DEVTESTPY312147-TTM228PY312/casatools/grpc-source/third_party/gflags/doc'...
29-Sep-2026 19:30:13 Submodule path 'casatools/grpc-source/third_party/gflags/doc': checked out '971dd2a4fadac9cdab174c523c22df79efd63aa5'
29-Sep-2026 19:30:13 Submodule path 'casatools/grpc-source/third_party/googletest': checked out 'ec44c6c1675c25b9827aacd08c02433cccde7780'
29-Sep-2026 19:30:13 Submodule path 'casatools/grpc-source/third_party/protobuf': checked out '2761122b810fe8861004ae785cc3ab39f384d342'
29-Sep-2026 19:30:13 Submodule 'third_party/benchmark' (https://github.com/google/benchmark.git) registered for path 'casatools/grpc-source/third_party/protobuf/third_party/benchmark'
29-Sep-2026 19:30:13 Cloning into '/opt/ci_workspace/casa/bamboo/agent4/xml-data/build-dir/CASASPECS-DEVTESTPY312147-TTM228PY312/casatools/grpc-source/third_party/protobuf/third_party/benchmark'...
29-Sep-2026 19:30:14 Submodule path 'casatools/grpc-source/third_party/protobuf/third_party/benchmark': checked out '360e66c1c4777c99402cf8cd535aa510fee16573'
29-Sep-2026 19:30:14 Submodule path 'casatools/grpc-source/third_party/zlib': checked out 'cacf7f1d4e3d44d871b605da3b647f07d718623f'
29-Sep-2026 19:30:14 Updated source code to revision: 2622d8cd816c2e6e3517837f8b7d521faf3e561d
29-Sep-2026 19:30:14 Finished task 'Source Code Checkout' with result: Success
29-Sep-2026 19:30:14 Running pre-build action: Build Log Labeller Pre Build Action
29-Sep-2026 19:30:14 Running pre-build action: VCS Version Collector
29-Sep-2026 19:30:14 Build CASASPECS - Dev Test 3.12 - CAS-14849 - Test Tasks Many Linux 2.28 Py3.12 #3 (CASASPECS-DEVTESTPY312147-TTM228PY312-3) started building on agent 'casaci-4.cv.nrao.edu' (Remote agent on host casaci-4.cv.nrao.edu)
29-Sep-2026 19:30:14 Starting task 'Update data' of type 'com.atlassian.bamboo.plugins.scripttask:task.builder.script'
29-Sep-2026 19:30:14
Beginning to execute external process for build 'CASASPECS - Dev Test 3.12 - CAS-14849 - Test Tasks Many Linux 2.28 Py3.12 #3 (CASASPECS-DEVTESTPY312147-TTM228PY312-3)'
... running command line:
/opt/ci_workspace/casa/bamboo/agent4/temp/CASASPECS-DEVTESTPY312147-TTM228PY312-3-ScriptBuildTask-4915256049982938452.sh
... in: /opt/ci_workspace/casa/bamboo/agent4/xml-data/build-dir/CASASPECS-DEVTESTPY312147-TTM228PY312
29-Sep-2026 19:30:14 Already up to date.
29-Sep-2026 19:30:14 /opt/ci_workspace/casa/bamboo/agent4/temp/CASASPECS-DEVTESTPY312147-TTM228PY312-3-ScriptBuildTask-4915256049982938452.sh: line 2: cd: /opt/casa/data/casa-data-req: No such file or directory
29-Sep-2026 19:30:14 Already up to date.
29-Sep-2026 19:30:14 Data update complete
29-Sep-2026 19:30:14 Finished task 'Update data' with result: Success
29-Sep-2026 19:30:14
Substituting variable: ${bamboo.repository.branch.name} with CAS-14849
29-Sep-2026 19:30:14 Starting task 'Create wheeldirectory' of type 'com.atlassian.bamboo.plugins.scripttask:task.builder.script'
29-Sep-2026 19:30:14
Beginning to execute external process for build 'CASASPECS - Dev Test 3.12 - CAS-14849 - Test Tasks Many Linux 2.28 Py3.12 #3 (CASASPECS-DEVTESTPY312147-TTM228PY312-3)'
... running command line:
/opt/ci_workspace/casa/bamboo/agent4/temp/CASASPECS-DEVTESTPY312147-TTM228PY312-3-ScriptBuildTask-4896514623805254220.sh
... in: /opt/ci_workspace/casa/bamboo/agent4/xml-data/build-dir/CASASPECS-DEVTESTPY312147-TTM228PY312
29-Sep-2026 19:30:14 Finished task 'Create wheeldirectory' with result: Success
29-Sep-2026 19:30:14 Starting task 'Get latest wheel' of type 'com.atlassian.bamboo.plugins.bamboo-artifact-downloader-plugin:artifactdownloadertask'
29-Sep-2026 19:30:14 Preparing to download plan result CASASPECS-DBC257-3 artifact: Non required shared artifact Http Compression On : [ManyLinux228 Python 3.12 Casatestutils], patterns: [casatestutils*.whl] anchored at: [source/wheels]
29-Sep-2026 19:30:14 Retrieving artifact ManyLinux228 Python 3.12 Casatestutils for CASASPECS-DBC257-3 using Bamboo server artifact handler
29-Sep-2026 19:30:14 Artifact [ManyLinux228 Python 3.12 Casatestutils] downloaded successfully in 21.23 ms to wheeldirectory/
29-Sep-2026 19:30:14 Preparing to download plan result CASASPECS-DBC257-3 artifact: Non required shared artifact Http Compression On : [ManyLinux228 Python 3.12 Tool wheel], patterns: [casatools*.whl] anchored at: [source/wheels]
29-Sep-2026 19:30:14 Retrieving artifact ManyLinux228 Python 3.12 Tool wheel for CASASPECS-DBC257-3 using Bamboo server artifact handler
29-Sep-2026 19:30:17 Artifact [ManyLinux228 Python 3.12 Tool wheel] downloaded successfully in 2.746 s to wheeldirectory/
29-Sep-2026 19:30:17 Preparing to download plan result CASASPECS-DBC257-3 artifact: Non required shared artifact Http Compression On : [ManyLinux228 Python 3.12 Task wheel], patterns: [casatasks*.whl] anchored at: [source/wheels]
29-Sep-2026 19:30:17 Retrieving artifact ManyLinux228 Python 3.12 Task wheel for CASASPECS-DBC257-3 using Bamboo server artifact handler
29-Sep-2026 19:30:17 Artifact [ManyLinux228 Python 3.12 Task wheel] downloaded successfully in 153.0 ms to wheeldirectory/
29-Sep-2026 19:30:17 Finished task 'Get latest wheel' with result: Success
29-Sep-2026 19:30:17
Substituting variable: ${bamboo.agentId} with 153550852
29-Sep-2026 19:30:17
Substituting variable: ${bamboo.agentId} with 153550852
29-Sep-2026 19:30:17
Substituting variable: ${bamboo.agentId} with 153550852
29-Sep-2026 19:30:17 Starting task 'Stop and remove running wheel-container-test' of type 'com.atlassian.bamboo.plugins.scripttask:task.builder.script'
29-Sep-2026 19:30:17
Beginning to execute external process for build 'CASASPECS - Dev Test 3.12 - CAS-14849 - Test Tasks Many Linux 2.28 Py3.12 #3 (CASASPECS-DEVTESTPY312147-TTM228PY312-3)'
... running command line:
/opt/ci_workspace/casa/bamboo/agent4/temp/CASASPECS-DEVTESTPY312147-TTM228PY312-3-ScriptBuildTask-15606688675501989376.sh
... in: /opt/ci_workspace/casa/bamboo/agent4/xml-data/build-dir/CASASPECS-DEVTESTPY312147-TTM228PY312
29-Sep-2026 19:30:17 Error response from daemon: No such container: wheel-container-test_153550852
29-Sep-2026 19:30:17 Error response from daemon: No such container: wheel-container-test_153550852
29-Sep-2026 19:30:17 Removed wheel-container-test_153550852
29-Sep-2026 19:30:17 Finished task 'Stop and remove running wheel-container-test' with result: Success
29-Sep-2026 19:30:17
Substituting variable: ${bamboo.working.directory} with /opt/ci_workspace/casa/bamboo/agent4/xml-data/build-dir/CASASPECS-DEVTESTPY312147-TTM228PY312
29-Sep-2026 19:30:17
Substituting variable: ${bamboo.agentId} with 153550852
29-Sep-2026 19:30:17 Starting task 'Start container' of type 'com.atlassian.bamboo.plugins.bamboo-docker-plugin:task.docker.cli'
29-Sep-2026 19:30:17 Running image name (casa-docker.nrao.edu:5000/casa-test-rocky-8.10:4)
29-Sep-2026 19:30:17
Beginning to execute external process for build 'CASASPECS - Dev Test 3.12 - CAS-14849 - Test Tasks Many Linux 2.28 Py3.12 #3 (CASASPECS-DEVTESTPY312147-TTM228PY312-3)'
... running command line:
/usr/bin/docker run --volume /opt/ci_workspace/casa/bamboo/agent4/xml-data/build-dir/CASASPECS-DEVTESTPY312147-TTM228PY312/wheeldirectory:/wheeldirectory --volume /opt/casa/data:/opt/casa/data --detach --cpus=8 --memory=64g --name wheel-container-test_153550852 casa-docker.nrao.edu:5000/casa-test-rocky-8.10:4 tail -f /dev/null
... in: /opt/ci_workspace/casa/bamboo/agent4/xml-data/build-dir/CASASPECS-DEVTESTPY312147-TTM228PY312
29-Sep-2026 19:30:17 614d046bf7034926224a7c2ff94d2e6dc01a94cf088ffebf8c6f2ca406a8382c
29-Sep-2026 19:30:17 Finished task 'Start container' with result: Success
29-Sep-2026 19:30:17
Substituting variable: ${bamboo.agentId} with 153550852
29-Sep-2026 19:30:17
Substituting variable: ${bamboo.planRepository.branchName} with CAS-14849
29-Sep-2026 19:30:17 Starting task 'Test wheel' of type 'com.atlassian.bamboo.plugins.scripttask:task.builder.script'
29-Sep-2026 19:30:17
Beginning to execute external process for build 'CASASPECS - Dev Test 3.12 - CAS-14849 - Test Tasks Many Linux 2.28 Py3.12 #3 (CASASPECS-DEVTESTPY312147-TTM228PY312-3)'
... running command line:
/opt/ci_workspace/casa/bamboo/agent4/temp/CASASPECS-DEVTESTPY312147-TTM228PY312-3-ScriptBuildTask-13729802540112111156.sh
... in: /opt/ci_workspace/casa/bamboo/agent4/xml-data/build-dir/CASASPECS-DEVTESTPY312147-TTM228PY312
29-Sep-2026 19:30:17 branch: CAS-14849
29-Sep-2026 19:30:17 Python version: 3.12
29-Sep-2026 19:30:17   % Total    % Received % Xferd  Average Speed   Time    Time     Time  Current
29-Sep-2026 19:30:17                                  Dload  Upload   Total   Spent    Left  Speed
29-Sep-2026 19:30:17
29-Sep-2026 19:30:18   0     0    0     0    0     0      0      0 --:--:-- --:--:-- --:--:--     0
29-Sep-2026 19:30:18 100 6002k  100 6002k    0     0  99.3M      0 --:--:-- --:--:-- --:--:-- 99.3M
29-Sep-2026 19:30:18 bamboo_jira_components:''
29-Sep-2026 19:30:18 bamboo_testlist:''
29-Sep-2026 19:30:18 Ticket components:  -j "casaconfig"
29-Sep-2026 19:30:18 datapath=[ "/opt/casa/data/master", "/opt/casa/data/casatestdata" ]
29-Sep-2026 19:30:18 measurespath="/opt/casa/data/master"
29-Sep-2026 19:30:18 measures_auto_update=False
29-Sep-2026 19:30:18 data_auto_update=False
29-Sep-2026 19:30:18 Ticket fix version: CASA 6.ACTIVE
29-Sep-2026 19:30:18 No matching version found
29-Sep-2026 19:30:18 datapath=[ "/opt/casa/data/master", "/opt/casa/data/casatestdata" ]
29-Sep-2026 19:30:18 measurespath="/opt/casa/data/master"
29-Sep-2026 19:30:18 measures_auto_update=False
29-Sep-2026 19:30:18 data_auto_update=False
29-Sep-2026 19:31:35 branch 'CAS-14849' set up to track 'origin/CAS-14849'.
29-Sep-2026 19:31:35 Switched to a new branch 'CAS-14849'
29-Sep-2026 19:31:35 Updated 0 paths from fb45b40137
29-Sep-2026 19:31:35 Updated 0 paths from fb45b40137
29-Sep-2026 19:31:35 Updated 0 paths from a0fff8df6c
29-Sep-2026 19:31:35 Requirement already satisfied: pip in /home/casatest/venv/lib/python3.12/site-packages (24.3.1)
29-Sep-2026 19:31:35 Collecting pip
29-Sep-2026 19:31:35   Downloading pip-26.2.1-py3-none-any.whl.metadata (4.6 kB)
29-Sep-2026 19:31:35 Collecting setuptools
29-Sep-2026 19:31:35   Downloading setuptools-84.0.0-py3-none-any.whl.metadata (6.6 kB)
29-Sep-2026 19:31:36 Collecting wheel
29-Sep-2026 19:31:36   Downloading wheel-0.48.0-py3-none-any.whl.metadata (2.3 kB)
29-Sep-2026 19:31:36 Collecting numpy
29-Sep-2026 19:31:36   Downloading numpy-2.5.3-cp312-cp312-manylinux_2_27_x86_64.manylinux_2_28_x86_64.whl.metadata (6.6 kB)
29-Sep-2026 19:31:36 Collecting packaging>=24.0 (from wheel)
29-Sep-2026 19:31:36   Downloading packaging-26.3-py3-none-any.whl.metadata (3.5 kB)
29-Sep-2026 19:31:36 Downloading pip-26.2.1-py3-none-any.whl (1.8 MB)
29-Sep-2026 19:31:36    ━━━━━━━━━━━━━━━━━━━━━━━━━━━━━━━━━━━━━━━━ 1.8/1.8 MB 96.3 MB/s eta 0:00:00
29-Sep-2026 19:31:36 Downloading setuptools-84.0.0-py3-none-any.whl (818 kB)
29-Sep-2026 19:31:36    ━━━━━━━━━━━━━━━━━━━━━━━━━━━━━━━━━━━━━━━━ 818.2/818.2 kB 87.9 MB/s eta 0:00:00
29-Sep-2026 19:31:36 Downloading wheel-0.48.0-py3-none-any.whl (33 kB)
29-Sep-2026 19:31:36 Downloading numpy-2.5.3-cp312-cp312-manylinux_2_27_x86_64.manylinux_2_28_x86_64.whl (16.7 MB)
29-Sep-2026 19:31:36    ━━━━━━━━━━━━━━━━━━━━━━━━━━━━━━━━━━━━━━━━ 16.7/16.7 MB 184.1 MB/s eta 0:00:00
29-Sep-2026 19:31:36 Downloading packaging-26.3-py3-none-any.whl (129 kB)
29-Sep-2026 19:31:36 Installing collected packages: setuptools, pip, packaging, numpy, wheel
29-Sep-2026 19:31:36   Attempting uninstall: pip
29-Sep-2026 19:31:36     Found existing installation: pip 24.3.1
29-Sep-2026 19:31:36     Uninstalling pip-24.3.1:
29-Sep-2026 19:31:36       Successfully uninstalled pip-24.3.1
29-Sep-2026 19:31:39 Successfully installed numpy-2.5.3 packaging-26.3 pip-26.2.1 setuptools-84.0.0 wheel-0.48.0
29-Sep-2026 19:31:39 Looking in indexes: https://pypi.org/simple, https://test.pypi.org/simple
29-Sep-2026 19:31:39 Collecting casaconfig==1.5.1
29-Sep-2026 19:31:39   Downloading casaconfig-1.5.1-py3-none-any.whl.metadata (4.0 kB)
29-Sep-2026 19:31:39 Collecting certifi>=2023.5.7 (from casaconfig==1.5.1)
29-Sep-2026 19:31:39   Downloading certifi-2026.7.22-py3-none-any.whl.metadata (2.5 kB)
29-Sep-2026 19:31:39 Downloading casaconfig-1.5.1-py3-none-any.whl (77 kB)
29-Sep-2026 19:31:39 Downloading certifi-2026.7.22-py3-none-any.whl (136 kB)
29-Sep-2026 19:31:39 Installing collected packages: certifi, casaconfig
29-Sep-2026 19:31:39
29-Sep-2026 19:31:39 Successfully installed casaconfig-1.5.1 certifi-2026.7.22
29-Sep-2026 19:31:40 Processing ./casatestutils-6.7.7.7a14849.dev2-py3-none-any.whl
29-Sep-2026 19:31:40 Collecting pytest>=6.0 (from casatestutils==6.7.7.7a14849.dev2)
29-Sep-2026 19:31:40   Downloading pytest-9.1.1-py3-none-any.whl.metadata (7.6 kB)
29-Sep-2026 19:31:40 Collecting astropy (from casatestutils==6.7.7.7a14849.dev2)
29-Sep-2026 19:31:40   Downloading astropy-8.0.1-cp311-abi3-manylinux2014_x86_64.manylinux_2_17_x86_64.manylinux_2_28_x86_64.whl.metadata (11 kB)
29-Sep-2026 19:31:40 Collecting iniconfig>=1.0.1 (from pytest>=6.0->casatestutils==6.7.7.7a14849.dev2)
29-Sep-2026 19:31:40   Downloading iniconfig-2.3.0-py3-none-any.whl.metadata (2.5 kB)
29-Sep-2026 19:31:40 Requirement already satisfied: packaging>=22 in /home/casatest/venv/lib/python3.12/site-packages (from pytest>=6.0->casatestutils==6.7.7.7a14849.dev2) (26.3)
29-Sep-2026 19:31:40 Collecting pluggy<2,>=1.5 (from pytest>=6.0->casatestutils==6.7.7.7a14849.dev2)
29-Sep-2026 19:31:40   Downloading pluggy-1.6.0-py3-none-any.whl.metadata (4.8 kB)
29-Sep-2026 19:31:40 Collecting pygments>=2.7.2 (from pytest>=6.0->casatestutils==6.7.7.7a14849.dev2)
29-Sep-2026 19:31:40   Downloading pygments-2.21.0-py3-none-any.whl.metadata (2.5 kB)
29-Sep-2026 19:31:40 Collecting astropy-iers-data>=0.2026.6.22.1.23.34 (from astropy->casatestutils==6.7.7.7a14849.dev2)
29-Sep-2026 19:31:40   Downloading astropy_iers_data-0.2026.9.28.0.59.37-py3-none-any.whl.metadata (3.4 kB)
29-Sep-2026 19:31:40 Requirement already satisfied: numpy>=2.0 in /home/casatest/venv/lib/python3.12/site-packages (from astropy->casatestutils==6.7.7.7a14849.dev2) (2.5.3)
29-Sep-2026 19:31:40 Collecting pyerfa>=2.0.1.3 (from astropy->casatestutils==6.7.7.7a14849.dev2)
29-Sep-2026 19:31:40   Downloading pyerfa-2.0.1.5-cp39-abi3-manylinux_2_17_x86_64.manylinux2014_x86_64.whl.metadata (5.7 kB)
29-Sep-2026 19:31:40 Collecting PyYAML>=6.0.0 (from astropy->casatestutils==6.7.7.7a14849.dev2)
29-Sep-2026 19:31:40   Downloading pyyaml-6.0.3-cp312-cp312-manylinux2014_x86_64.manylinux_2_17_x86_64.manylinux_2_28_x86_64.whl.metadata (2.4 kB)
29-Sep-2026 19:31:40 Downloading pytest-9.1.1-py3-none-any.whl (386 kB)
29-Sep-2026 19:31:40 Downloading pluggy-1.6.0-py3-none-any.whl (20 kB)
29-Sep-2026 19:31:40 Downloading iniconfig-2.3.0-py3-none-any.whl (7.5 kB)
29-Sep-2026 19:31:40 Downloading pygments-2.21.0-py3-none-any.whl (1.3 MB)
29-Sep-2026 19:31:40    ━━━━━━━━━━━━━━━━━━━━━━━━━━━━━━━━━━━━━━━━ 1.3/1.3 MB 94.6 MB/s  0:00:00
29-Sep-2026 19:31:40 Downloading astropy-8.0.1-cp311-abi3-manylinux2014_x86_64.manylinux_2_17_x86_64.manylinux_2_28_x86_64.whl (10.5 MB)
29-Sep-2026 19:31:40    ━━━━━━━━━━━━━━━━━━━━━━━━━━━━━━━━━━━━━━━━ 10.5/10.5 MB 104.0 MB/s  0:00:00
29-Sep-2026 19:31:40 Downloading astropy_iers_data-0.2026.9.28.0.59.37-py3-none-any.whl (2.0 MB)
29-Sep-2026 19:31:40    ━━━━━━━━━━━━━━━━━━━━━━━━━━━━━━━━━━━━━━━━ 2.0/2.0 MB 77.0 MB/s  0:00:00
29-Sep-2026 19:31:40 Downloading pyerfa-2.0.1.5-cp39-abi3-manylinux_2_17_x86_64.manylinux2014_x86_64.whl (738 kB)
29-Sep-2026 19:31:40    ━━━━━━━━━━━━━━━━━━━━━━━━━━━━━━━━━━━━━━━━ 738.7/738.7 kB 52.4 MB/s  0:00:00
29-Sep-2026 19:31:40 Downloading pyyaml-6.0.3-cp312-cp312-manylinux2014_x86_64.manylinux_2_17_x86_64.manylinux_2_28_x86_64.whl (807 kB)
29-Sep-2026 19:31:40    ━━━━━━━━━━━━━━━━━━━━━━━━━━━━━━━━━━━━━━━━ 807.9/807.9 kB 105.2 MB/s  0:00:00
29-Sep-2026 19:31:40 Installing collected packages: PyYAML, pygments, pyerfa, pluggy, iniconfig, astropy-iers-data, pytest, astropy, casatestutils
29-Sep-2026 19:31:43
29-Sep-2026 19:31:43 Successfully installed PyYAML-6.0.3 astropy-8.0.1 astropy-iers-data-0.2026.9.28.0.59.37 casatestutils-6.7.7.7a14849.dev2 iniconfig-2.3.0 pluggy-1.6.0 pyerfa-2.0.1.5 pygments-2.21.0 pytest-9.1.1
29-Sep-2026 19:31:44 Processing ./casatools-6.7.7.7a14849.dev2-cp312-cp312-manylinux_2_28_x86_64.whl
29-Sep-2026 19:31:44 Requirement already satisfied: numpy in /home/casatest/venv/lib/python3.12/site-packages (from casatools==6.7.7.7a14849.dev2) (2.5.3)
29-Sep-2026 19:31:44 Requirement already satisfied: casaconfig in /home/casatest/venv/lib/python3.12/site-packages (from casatools==6.7.7.7a14849.dev2) (1.5.1)
29-Sep-2026 19:31:44 Requirement already satisfied: certifi>=2023.5.7 in /home/casatest/venv/lib/python3.12/site-packages (from casaconfig->casatools==6.7.7.7a14849.dev2) (2026.7.22)
29-Sep-2026 19:31:44 Installing collected packages: casatools
29-Sep-2026 19:31:45 Successfully installed casatools-6.7.7.7a14849.dev2
29-Sep-2026 19:31:45 Processing ./casatasks-6.7.7.7a14849.dev2-py3-none-any.whl
29-Sep-2026 19:31:45 Requirement already satisfied: casatools==6.7.7.7a14849.dev2 in /home/casatest/venv/lib/python3.12/site-packages (from casatasks==6.7.7.7a14849.dev2) (6.7.7.7a14849.dev2)
29-Sep-2026 19:31:45 Collecting matplotlib (from casatasks==6.7.7.7a14849.dev2)
29-Sep-2026 19:31:45   Downloading matplotlib-3.11.2-cp312-cp312-manylinux2014_x86_64.manylinux_2_17_x86_64.whl.metadata (80 kB)
29-Sep-2026 19:31:45 Collecting scipy (from casatasks==6.7.7.7a14849.dev2)
29-Sep-2026 19:31:45   Downloading scipy-1.18.1-cp312-cp312-manylinux_2_27_x86_64.manylinux_2_28_x86_64.whl.metadata (62 kB)
29-Sep-2026 19:31:45 Requirement already satisfied: certifi in /home/casatest/venv/lib/python3.12/site-packages (from casatasks==6.7.7.7a14849.dev2) (2026.7.22)
29-Sep-2026 19:31:45 Requirement already satisfied: pyerfa in /home/casatest/venv/lib/python3.12/site-packages (from casatasks==6.7.7.7a14849.dev2) (2.0.1.5)
29-Sep-2026 19:31:45 Requirement already satisfied: numpy in /home/casatest/venv/lib/python3.12/site-packages (from casatools==6.7.7.7a14849.dev2->casatasks==6.7.7.7a14849.dev2) (2.5.3)
29-Sep-2026 19:31:45 Requirement already satisfied: casaconfig in /home/casatest/venv/lib/python3.12/site-packages (from casatools==6.7.7.7a14849.dev2->casatasks==6.7.7.7a14849.dev2) (1.5.1)
29-Sep-2026 19:31:45 Collecting contourpy>=1.0.1 (from matplotlib->casatasks==6.7.7.7a14849.dev2)
29-Sep-2026 19:31:45   Downloading contourpy-1.4.0-cp312-cp312-manylinux_2_27_x86_64.manylinux_2_28_x86_64.whl.metadata (3.8 kB)
29-Sep-2026 19:31:46 Collecting cycler>=0.10 (from matplotlib->casatasks==6.7.7.7a14849.dev2)
29-Sep-2026 19:31:46   Downloading cycler-0.12.1-py3-none-any.whl.metadata (3.8 kB)
29-Sep-2026 19:31:46 Collecting fonttools>=4.28.2 (from matplotlib->casatasks==6.7.7.7a14849.dev2)
29-Sep-2026 19:31:46   Downloading fonttools-4.66.1-cp312-cp312-manylinux2014_x86_64.manylinux_2_17_x86_64.whl.metadata (130 kB)
29-Sep-2026 19:31:46 Collecting kiwisolver>=1.3.1 (from matplotlib->casatasks==6.7.7.7a14849.dev2)
29-Sep-2026 19:31:46   Downloading kiwisolver-1.5.1-cp312-cp312-manylinux2014_x86_64.manylinux_2_17_x86_64.whl.metadata (5.2 kB)
29-Sep-2026 19:31:46 Requirement already satisfied: packaging>=20.0 in /home/casatest/venv/lib/python3.12/site-packages (from matplotlib->casatasks==6.7.7.7a14849.dev2) (26.3)
29-Sep-2026 19:31:46 Collecting pillow>=9 (from matplotlib->casatasks==6.7.7.7a14849.dev2)
29-Sep-2026 19:31:46   Downloading pillow-12.3.0-cp312-cp312-manylinux_2_27_x86_64.manylinux_2_28_x86_64.whl.metadata (9.1 kB)
29-Sep-2026 19:31:46 Collecting pyparsing>=3 (from matplotlib->casatasks==6.7.7.7a14849.dev2)
29-Sep-2026 19:31:46   Downloading pyparsing-3.3.3-py3-none-any.whl.metadata (5.9 kB)
29-Sep-2026 19:31:46 Collecting python-dateutil>=2.7 (from matplotlib->casatasks==6.7.7.7a14849.dev2)
29-Sep-2026 19:31:46   Downloading python_dateutil-2.9.0.post0-py2.py3-none-any.whl.metadata (8.4 kB)
29-Sep-2026 19:31:46 Collecting six>=1.5 (from python-dateutil>=2.7->matplotlib->casatasks==6.7.7.7a14849.dev2)
29-Sep-2026 19:31:46   Downloading six-1.17.0-py2.py3-none-any.whl.metadata (1.7 kB)
29-Sep-2026 19:31:46 Downloading matplotlib-3.11.2-cp312-cp312-manylinux2014_x86_64.manylinux_2_17_x86_64.whl (9.9 MB)
29-Sep-2026 19:31:46    ━━━━━━━━━━━━━━━━━━━━━━━━━━━━━━━━━━━━━━━━ 9.9/9.9 MB 222.4 MB/s  0:00:00
29-Sep-2026 19:31:46 Downloading contourpy-1.4.0-cp312-cp312-manylinux_2_27_x86_64.manylinux_2_28_x86_64.whl (383 kB)
29-Sep-2026 19:31:46 Downloading cycler-0.12.1-py3-none-any.whl (8.3 kB)
29-Sep-2026 19:31:46 Downloading fonttools-4.66.1-cp312-cp312-manylinux2014_x86_64.manylinux_2_17_x86_64.whl (5.4 MB)
29-Sep-2026 19:31:46    ━━━━━━━━━━━━━━━━━━━━━━━━━━━━━━━━━━━━━━━━ 5.4/5.4 MB 136.8 MB/s  0:00:00
29-Sep-2026 19:31:46 Downloading kiwisolver-1.5.1-cp312-cp312-manylinux2014_x86_64.manylinux_2_17_x86_64.whl (1.5 MB)
29-Sep-2026 19:31:46    ━━━━━━━━━━━━━━━━━━━━━━━━━━━━━━━━━━━━━━━━ 1.5/1.5 MB 164.9 MB/s  0:00:00
29-Sep-2026 19:31:46 Downloading pillow-12.3.0-cp312-cp312-manylinux_2_27_x86_64.manylinux_2_28_x86_64.whl (6.9 MB)
29-Sep-2026 19:31:46    ━━━━━━━━━━━━━━━━━━━━━━━━━━━━━━━━━━━━━━━━ 6.9/6.9 MB 233.1 MB/s  0:00:00
29-Sep-2026 19:31:46 Downloading pyparsing-3.3.3-py3-none-any.whl (126 kB)
29-Sep-2026 19:31:46 Downloading python_dateutil-2.9.0.post0-py2.py3-none-any.whl (229 kB)
29-Sep-2026 19:31:46 Downloading six-1.17.0-py2.py3-none-any.whl (11 kB)
29-Sep-2026 19:31:46 Downloading scipy-1.18.1-cp312-cp312-manylinux_2_27_x86_64.manylinux_2_28_x86_64.whl (35.3 MB)
29-Sep-2026 19:31:46    ━━━━━━━━━━━━━━━━━━━━━━━━━━━━━━━━━━━━━━━━ 35.3/35.3 MB 229.1 MB/s  0:00:00
29-Sep-2026 19:31:46 Installing collected packages: six, scipy, pyparsing, pillow, kiwisolver, fonttools, cycler, contourpy, python-dateutil, matplotlib, casatasks
29-Sep-2026 19:31:52
29-Sep-2026 19:31:52 Successfully installed casatasks-6.7.7.7a14849.dev2 contourpy-1.4.0 cycler-0.12.1 fonttools-4.66.1 kiwisolver-1.5.1 matplotlib-3.11.2 pillow-12.3.0 pyparsing-3.3.3 python-dateutil-2.9.0.post0 scipy-1.18.1 six-1.17.0
29-Sep-2026 19:31:56 branch 'CAS-14849' set up to track 'origin/CAS-14849'.
29-Sep-2026 19:31:56 Switched to a new branch 'CAS-14849'
29-Sep-2026 19:31:56 Runtest command: python3.12 runtest.py --ignore_list 'test_casampi,test_task_msview,test_task_imview,test_task_plotms' -t /home/casatest/casaconfig/tests 2>&1 | tee casatasks_test.log
29-Sep-2026 19:31:56 LICENSE
29-Sep-2026 19:31:56 README.md
29-Sep-2026 19:31:56 __init__.py
29-Sep-2026 19:31:56 casatestutils
29-Sep-2026 19:31:56 pyproject.toml
29-Sep-2026 19:31:56 runtest.py
29-Sep-2026 19:31:56 setup.py
29-Sep-2026 19:31:56 testrunner
29-Sep-2026 19:31:56 tests
29-Sep-2026 19:31:56 version
29-Sep-2026 19:31:56 xmlrunner_to_junit.py
29-Sep-2026 19:31:56 ============================= test session starts ==============================
29-Sep-2026 19:31:56 platform linux -- Python 3.12.9, pytest-9.1.1, pluggy-1.6.0 -- /home/casatest/venv/bin/python3.12
29-Sep-2026 19:31:56 cachedir: .pytest_cache
29-Sep-2026 19:31:56 rootdir: /home/casatest/casa6/casatestutils/nosedir/test_casaconfig
29-Sep-2026 19:31:56 configfile: pytest.ini
29-Sep-2026 19:31:56 collecting ... collected 13 items
29-Sep-2026 19:31:56
29-Sep-2026 19:31:56
29-Sep-2026 19:33:35 test_casaconfig.py::casaconfig_test::test_auto_install_data
29-Sep-2026 19:33:35 Test auto install of all data to measurespath on casatools startup
29-Sep-2026 19:33:35 PASSED
29-Sep-2026 19:33:35
29-Sep-2026 19:33:36 test_casaconfig.py::casaconfig_test::test_auto_update_measures
29-Sep-2026 19:33:36 Test Automatic Measures Updates to measurespath
29-Sep-2026 19:33:36 pull_data using version casarundata-2026.02.19-1.tar.gz, acquiring the lock ...
29-Sep-2026 19:33:39 downloading casarundata contents to  /home/casatest/casa6/casatestutils/nosedir/test_casaconfig/testrundata (336M) ... done
29-Sep-2026 19:35:13 casarundata installed casarundata-2026.02.19-1.tar.gz at /home/casatest/casa6/casatestutils/nosedir/test_casaconfig/testrundata
29-Sep-2026 19:35:13 PASSED
29-Sep-2026 19:35:13
29-Sep-2026 19:35:36 test_casaconfig.py::casaconfig_test::test_casaconfig_measures_available
29-Sep-2026 19:35:36 Test That Today or Yesterday measures data is returned
29-Sep-2026 19:35:36 FAILED
29-Sep-2026 19:35:36
29-Sep-2026 19:36:46 test_casaconfig.py::casaconfig_test::test_casaconfig_measures_update Error: the Observatories table was not found as expected in /home/casatest/casa6/casatestutils/nosedir/test_casaconfig/testmeasures
29-Sep-2026 19:36:46 Either install casarundata first or set use_astron_obs_table and force to be True when using measures_update.
29-Sep-2026 19:36:46 Note that the Observatories table provided in the measures tarfile is not the same as that maintained by CASA
29-Sep-2026 19:36:46
29-Sep-2026 19:36:46 Test downgrade to upgrade measures data to location
29-Sep-2026 19:36:46 measures_update ... acquiring the lock ...
29-Sep-2026 19:36:46 A measures update has been requested by the force argument
29-Sep-2026 19:36:46   ... finding available measures ...
29-Sep-2026 19:36:46   ... downloading NRAO_Measures_20260928-140458.ztar from https://go.nrao.edu/iers/ to /home/casatest/casa6/casatestutils/nosedir/test_casaconfig/testmeasures ...
29-Sep-2026 19:36:46   ... measures data updated at /home/casatest/casa6/casatestutils/nosedir/test_casaconfig/testmeasures
29-Sep-2026 19:36:46 FAILED
29-Sep-2026 19:36:46
29-Sep-2026 19:36:46 test_casaconfig.py::casaconfig_test::test_config_import
29-Sep-2026 19:36:46 Tests of the config import
29-Sep-2026 19:36:46 PASSED
29-Sep-2026 19:36:46
29-Sep-2026 19:36:46 test_casaconfig.py::casaconfig_test::test_daily_update
29-Sep-2026 19:36:46 test that updates do not happen if the installed data is less than 1 day old and do happen when they are older
29-Sep-2026 19:36:46 pull_data using version casarundata-2025.12.12-1.tar.gz, acquiring the lock ...
29-Sep-2026 19:36:51 downloading casarundata contents to  /home/casatest/casa6/casatestutils/nosedir/test_casaconfig/testrundata (336M) ... done
29-Sep-2026 19:38:02 casarundata installed casarundata-2025.12.12-1.tar.gz at /home/casatest/casa6/casatestutils/nosedir/test_casaconfig/testrundata
29-Sep-2026 19:38:02 data_update: version installed or checked less than 1 day(s) ago, nothing updated or checked
29-Sep-2026 19:38:02 measures_update: version installed or checked less than 1 day(s) ago, nothing updated or checked
29-Sep-2026 19:38:02 data_update: version installed or checked less than 1 day(s) ago, nothing updated or checked
29-Sep-2026 19:38:02 measures_update ... acquiring the lock ...
29-Sep-2026 19:38:02   ... finding available measures ...
29-Sep-2026 19:38:02   ... downloading NRAO_Measures_20260928-140458.ztar from https://go.nrao.edu/iers/ to /home/casatest/casa6/casatestutils/nosedir/test_casaconfig/testrundata ...
29-Sep-2026 19:38:02   ... measures data updated at /home/casatest/casa6/casatestutils/nosedir/test_casaconfig/testrundata
29-Sep-2026 19:38:02 data_update using version casarundata-2026.02.19-1.tar.gz, acquiring the lock ...
29-Sep-2026 19:38:02 Removing files using manifest from previous install of casarundata-2025.12.12-1.tar.gz on 2026-09-29
29-Sep-2026 19:38:06 downloading casarundata contents to  /home/casatest/casa6/casatestutils/nosedir/test_casaconfig/testrundata (336M) ... done
29-Sep-2026 19:40:05 casarundata installed casarundata-2026.02.19-1.tar.gz at /home/casatest/casa6/casatestutils/nosedir/test_casaconfig/testrundata
29-Sep-2026 19:40:05 measures_update ... acquiring the lock ...
29-Sep-2026 19:40:05   ... finding available measures ...
29-Sep-2026 19:40:05   ... downloading NRAO_Measures_20260928-140458.ztar from https://go.nrao.edu/iers/ to /home/casatest/casa6/casatestutils/nosedir/test_casaconfig/testrundata ...
29-Sep-2026 19:40:05   ... measures data updated at /home/casatest/casa6/casatestutils/nosedir/test_casaconfig/testrundata
29-Sep-2026 19:40:05 PASSED
29-Sep-2026 19:40:05
29-Sep-2026 19:40:05 test_casaconfig.py::casaconfig_test::test_exceptions_no_data
29-Sep-2026 19:40:05 test that exceptions that do not require any data happen when expected
29-Sep-2026 19:40:05 PASSED
29-Sep-2026 19:40:05
29-Sep-2026 19:40:05 test_casaconfig.py::casaconfig_test::test_exceptions_with_data
29-Sep-2026 19:40:05 test that exceptions that require data happen when expected
29-Sep-2026 19:40:05 pull_data using version casarundata-2026.02.19-1.tar.gz, acquiring the lock ...
29-Sep-2026 19:40:09 downloading casarundata contents to  /home/casatest/casa6/casatestutils/nosedir/test_casaconfig/testrundata (336M) ... done
29-Sep-2026 19:40:33 lock file is not empty : /home/casatest/casa6/casatestutils/nosedir/test_casaconfig/testrundata/data_update.lock
29-Sep-2026 19:40:33 The lock file at /home/casatest/casa6/casatestutils/nosedir/test_casaconfig/testrundata is not empty.
29-Sep-2026 19:40:33 A previous attempt to update path may have failed or exited prematurely.
29-Sep-2026 19:40:33 Remove the lock file and set force to True with the desired version (default to most recent).
29-Sep-2026 19:40:33 It may be best to completely repopulate path using pull_data and measures_update.
29-Sep-2026 19:40:33 lock file is not empty : /home/casatest/casa6/casatestutils/nosedir/test_casaconfig/testrundata/data_update.lock
29-Sep-2026 19:40:33 data_update: the lock file at /home/casatest/casa6/casatestutils/nosedir/test_casaconfig/testrundata is not empty.
29-Sep-2026 19:40:33 A previous attempt to update path may have failed or exited prematurely.
29-Sep-2026 19:40:33 Remove the lock file and set force to True with the desired version (default to most recent).
29-Sep-2026 19:40:33 It may be best to completely re-populate path using pull_data and measures_update.
29-Sep-2026 19:40:33 casarundata installed casarundata-2026.02.19-1.tar.gz at /home/casatest/casa6/casatestutils/nosedir/test_casaconfig/testrundata
29-Sep-2026 19:40:33 measures_update ... acquiring the lock ...
29-Sep-2026 19:40:33 data_update using version casarundata-2024.02.09-1.tar.gz, acquiring the lock ...
29-Sep-2026 19:40:33 PASSED
29-Sep-2026 19:40:33
29-Sep-2026 19:40:33 test_casaconfig.py::casaconfig_test::test_file_exists
29-Sep-2026 19:40:33 Test Default config.py exists in casaconfig module
29-Sep-2026 19:40:33 PASSED
29-Sep-2026 19:40:33
29-Sep-2026 19:40:34 test_casaconfig.py::casaconfig_test::test_import_casatools_bad_measurespath
29-Sep-2026 19:40:34 Test that import casatools will return ImportError with measurespath set to an empty directory that cannot be written to
29-Sep-2026 19:40:34 PASSED
29-Sep-2026 19:40:34
29-Sep-2026 19:44:14 test_casaconfig.py::casaconfig_test::test_measures_site measures_update can't find specified version ./WSRT_Measures_20260802-160001.ztar at site https://go.nrao.edu/iers/
29-Sep-2026 19:46:35 measures_update can't find specified version NRAO_Measures_20260925-140548.ztar at site https://iers.astron.nl/
29-Sep-2026 19:46:35 Unable to retrieve list of available measures versions, measures_site value may be an empty list or no files were found at measures_site, check and try again.
29-Sep-2026 19:46:35 There was a remote error while attempting to update measures at /home/casatest/casa6/casatestutils/nosedir/test_casaconfig/testmeasures
29-Sep-2026 19:46:35 Check the value of measures_site and try again
29-Sep-2026 19:46:58
29-Sep-2026 19:46:58 tests related to measures site
29-Sep-2026 19:46:58 Warning: the most recent measures tar file at each of the sites was older than config.measures_site_interval
29-Sep-2026 19:46:58 https://go.nrao.edu/iers/ had the most recent measures tar file, returning that list
29-Sep-2026 19:46:58 Warning: the most recent measures tar file at each of the sites was older than config.measures_site_interval
29-Sep-2026 19:46:58 https://go.nrao.edu/iers/ had the most recent measures tar file, returning that list
29-Sep-2026 19:46:58 measures_update ... acquiring the lock ...
29-Sep-2026 19:46:58 A measures update has been requested by the force argument
29-Sep-2026 19:46:58   ... finding available measures ...
29-Sep-2026 19:46:58   ... downloading NRAO_Measures_20260928-140458.ztar from https://go.nrao.edu/iers/ to /home/casatest/casa6/casatestutils/nosedir/test_casaconfig/testmeasures ...
29-Sep-2026 19:46:58   ... measures data updated at /home/casatest/casa6/casatestutils/nosedir/test_casaconfig/testmeasures
29-Sep-2026 19:46:58 di : {'site': 'https://go.nrao.edu/iers/', 'version': 'NRAO_Measures_20260928-140458.ztar', 'date': '2026-09-29', 'age': 1.3021959198845758e-08}
29-Sep-2026 19:46:58 measures_update ... acquiring the lock ...
29-Sep-2026 19:46:58 A measures update has been requested by the force argument
29-Sep-2026 19:46:58   ... finding available measures ...
29-Sep-2026 19:46:58   ... downloading ./WSRT_Measures_20260802-160001.ztar from https://iers.astron.nl/ to /home/casatest/casa6/casatestutils/nosedir/test_casaconfig/testmeasures ...
29-Sep-2026 19:46:58   ... measures data updated at /home/casatest/casa6/casatestutils/nosedir/test_casaconfig/testmeasures
29-Sep-2026 19:46:58 measures_update ... acquiring the lock ...
29-Sep-2026 19:46:58 A measures update has been requested by the force argument
29-Sep-2026 19:46:58   ... finding available measures ...
29-Sep-2026 19:46:58   ... downloading ./WSRT_Measures_20260802-160001.ztar from https://iers.astron.nl/ to /home/casatest/casa6/casatestutils/nosedir/test_casaconfig/testmeasures ...
29-Sep-2026 19:46:58   ... measures data updated at /home/casatest/casa6/casatestutils/nosedir/test_casaconfig/testmeasures
29-Sep-2026 19:46:58 measures_update ... acquiring the lock ...
29-Sep-2026 19:46:58 A measures update has been requested by the force argument
29-Sep-2026 19:46:58   ... finding available measures ...
29-Sep-2026 19:46:58   ... downloading ./WSRT_Measures_20260804-160001.ztar from https://iers.astron.nl/ to /home/casatest/casa6/casatestutils/nosedir/test_casaconfig/testmeasures ...
29-Sep-2026 19:46:58   ... measures data updated at /home/casatest/casa6/casatestutils/nosedir/test_casaconfig/testmeasures
29-Sep-2026 19:46:58 measures_update ... acquiring the lock ...
29-Sep-2026 19:46:58 A measures update has been requested by the force argument
29-Sep-2026 19:46:58   ... finding available measures ...
29-Sep-2026 19:46:58 measures_update ... acquiring the lock ...
29-Sep-2026 19:46:58 A measures update has been requested by the force argument
29-Sep-2026 19:46:58   ... finding available measures ...
29-Sep-2026 19:46:58   ... downloading NRAO_Measures_20260925-140548.ztar from https://go.nrao.edu/iers/ to /home/casatest/casa6/casatestutils/nosedir/test_casaconfig/testmeasures ...
29-Sep-2026 19:46:58   ... measures data updated at /home/casatest/casa6/casatestutils/nosedir/test_casaconfig/testmeasures
29-Sep-2026 19:46:58 measures_update ... acquiring the lock ...
29-Sep-2026 19:46:58 A measures update has been requested by the force argument
29-Sep-2026 19:46:58   ... finding available measures ...
29-Sep-2026 19:46:58   ... downloading NRAO_Measures_20260925-140548.ztar from https://go.nrao.edu/iers/ to /home/casatest/casa6/casatestutils/nosedir/test_casaconfig/testmeasures ...
29-Sep-2026 19:46:58   ... measures data updated at /home/casatest/casa6/casatestutils/nosedir/test_casaconfig/testmeasures
29-Sep-2026 19:46:58 measures_update ... acquiring the lock ...
29-Sep-2026 19:46:58 A measures update has been requested by the force argument
29-Sep-2026 19:46:58   ... finding available measures ...
29-Sep-2026 19:46:58   ... downloading NRAO_Measures_20260928-140458.ztar from https://go.nrao.edu/iers/ to /home/casatest/casa6/casatestutils/nosedir/test_casaconfig/testmeasures ...
29-Sep-2026 19:46:58   ... measures data updated at /home/casatest/casa6/casatestutils/nosedir/test_casaconfig/testmeasures
29-Sep-2026 19:46:58 measures_update ... acquiring the lock ...
29-Sep-2026 19:46:58 A measures update has been requested by the force argument
29-Sep-2026 19:46:58   ... finding available measures ...
29-Sep-2026 19:46:58 measures_update ... acquiring the lock ...
29-Sep-2026 19:46:58 A measures update has been requested by the force argument
29-Sep-2026 19:46:58   ... finding available measures ...
29-Sep-2026 19:46:58 PASSED
29-Sep-2026 19:46:58
29-Sep-2026 19:46:58 test_casaconfig.py::casaconfig_test::test_read_measurespath_from_user_config
29-Sep-2026 19:46:58 Test casaconfig downloads specific measures data to location and casatools reads that data location
29-Sep-2026 19:46:58 pull_data using version casarundata-2026.02.19-1.tar.gz, acquiring the lock ...
29-Sep-2026 19:47:02 downloading casarundata contents to  /home/casatest/casa6/casatestutils/nosedir/test_casaconfig/testrundata (336M) ... done
29-Sep-2026 19:48:12 casarundata installed casarundata-2026.02.19-1.tar.gz at /home/casatest/casa6/casatestutils/nosedir/test_casaconfig/testrundata
29-Sep-2026 19:48:12 PASSED
29-Sep-2026 19:48:12
29-Sep-2026 19:48:13 test_casaconfig.py::casaconfig_test::test_update_interval
29-Sep-2026 19:48:13 tests use of config update_interval values
29-Sep-2026 19:48:13 pull_data using version casarundata-2026.02.19-1.tar.gz, acquiring the lock ...
29-Sep-2026 19:48:16 downloading casarundata contents to  /home/casatest/casa6/casatestutils/nosedir/test_casaconfig/testrundata (336M) ... done
29-Sep-2026 19:48:18 casarundata installed casarundata-2026.02.19-1.tar.gz at /home/casatest/casa6/casatestutils/nosedir/test_casaconfig/testrundata
29-Sep-2026 19:48:18 data_update using version casarundata-2025.12.12-1.tar.gz, acquiring the lock ...
29-Sep-2026 19:48:18 Removing files using manifest from previous install of casarundata-2026.02.19-1.tar.gz on 2026-09-29
29-Sep-2026 19:48:22 downloading casarundata contents to  /home/casatest/casa6/casatestutils/nosedir/test_casaconfig/testrundata (336M) ... done
29-Sep-2026 19:48:23 casarundata installed casarundata-2025.12.12-1.tar.gz at /home/casatest/casa6/casatestutils/nosedir/test_casaconfig/testrundata
29-Sep-2026 19:48:23 data_update: version installed or checked less than 1 day(s) ago, nothing updated or checked
29-Sep-2026 19:48:23 data_update using version casarundata-2026.02.19-1.tar.gz, acquiring the lock ...
29-Sep-2026 19:48:23 Removing files using manifest from previous install of casarundata-2025.12.12-1.tar.gz on 2026-09-29
29-Sep-2026 19:48:26 downloading casarundata contents to  /home/casatest/casa6/casatestutils/nosedir/test_casaconfig/testrundata (336M) ... done
29-Sep-2026 19:50:50 casarundata installed casarundata-2026.02.19-1.tar.gz at /home/casatest/casa6/casatestutils/nosedir/test_casaconfig/testrundata
29-Sep-2026 19:50:50 measures_update ... acquiring the lock ...
29-Sep-2026 19:50:50 A measures update has been requested by the force argument
29-Sep-2026 19:50:50   ... finding available measures ...
29-Sep-2026 19:50:50   ... downloading NRAO_Measures_20260927-140501.ztar from https://go.nrao.edu/iers/ to /home/casatest/casa6/casatestutils/nosedir/test_casaconfig/testrundata ...
29-Sep-2026 19:50:50   ... measures data updated at /home/casatest/casa6/casatestutils/nosedir/test_casaconfig/testrundata
29-Sep-2026 19:50:50 measures_update: version installed or checked less than 1 day(s) ago, nothing updated or checked
29-Sep-2026 19:50:50 measures_update ... acquiring the lock ...
29-Sep-2026 19:50:50   ... finding available measures ...
29-Sep-2026 19:50:50   ... downloading NRAO_Measures_20260928-140458.ztar from https://go.nrao.edu/iers/ to /home/casatest/casa6/casatestutils/nosedir/test_casaconfig/testrundata ...
29-Sep-2026 19:50:50   ... measures data updated at /home/casatest/casa6/casatestutils/nosedir/test_casaconfig/testrundata
29-Sep-2026 19:50:50 PASSED
29-Sep-2026 19:50:50
29-Sep-2026 19:50:50 =================================== FAILURES ===================================
29-Sep-2026 19:50:50 ______________ casaconfig_test.test_casaconfig_measures_available ______________
29-Sep-2026 19:50:50 test_casaconfig.py:176: in test_casaconfig_measures_available
29-Sep-2026 19:50:50     self.assertTrue(any(elem in self.get_meas_avail() for elem in [measuresdata_today, measuresdata_yesterday]))
29-Sep-2026 19:50:50 E   AssertionError: False is not true
29-Sep-2026 19:50:50 _______________ casaconfig_test.test_casaconfig_measures_update ________________
29-Sep-2026 19:50:50 test_casaconfig.py:197: in test_casaconfig_measures_update
29-Sep-2026 19:50:50     self.assertTrue(newVers == vers)
29-Sep-2026 19:50:50 E   AssertionError: False is not true
29-Sep-2026 19:50:50 - generated xml file: /home/casatest/casa6/casatestutils/nosedir/xml/test_casaconfig/nose.xml -
29-Sep-2026 19:50:50 =========================== short test summary info ============================
29-Sep-2026 19:50:50 FAILED test_casaconfig.py::casaconfig_test::test_casaconfig_measures_available
29-Sep-2026 19:50:50 FAILED test_casaconfig.py::casaconfig_test::test_casaconfig_measures_update
29-Sep-2026 19:50:50 ============= 2 failed, 11 passed, 1 warning in 1133.42s (0:18:53) =============
29-Sep-2026 19:50:50 Namespace(list=False, verbose=False, dry_run=False, classes=None, file=None, mapfile=None, branch=None, merge_target=None, pkg=None, work_dir=None, ncores=2, test_paths='/home/casatest/casaconfig/tests', test_list=None, test_config=None, test_group=None, pmode=None, bamboo=False, cachedir=None, ignore_list='test_casampi,test_task_msview,test_task_imview,test_task_plotms', run_skipped=False, only_skipped=False)
29-Sep-2026 19:50:50
29-Sep-2026 19:50:50 Operating system: Linux
29-Sep-2026 19:50:50
29-Sep-2026 19:50:50 Arguments Sent Direct To Pytest :  []
29-Sep-2026 19:50:50
29-Sep-2026 19:50:50 Tests to Ignore:  ['test_casampi', 'test_task_msview', 'test_task_imview', 'test_task_plotms']
29-Sep-2026 19:50:50 Running 1 Test(s)
29-Sep-2026 19:50:50 Cleaning: /home/casatest/casa6/casatestutils/nosedir/
29-Sep-2026 19:50:50 Tests: ['/home/casatest/casaconfig/tests/test_casaconfig.py']
29-Sep-2026 19:50:50
29-Sep-2026 19:50:50 Setting Working Directory: /home/casatest/casa6/casatestutils/nosedir/test_casaconfig/
29-Sep-2026 19:50:50 Test Directory: /home/casatest/casa6/casatestutils/nosedir/test_casaconfig
29-Sep-2026 19:50:50
29-Sep-2026 19:50:50 Running Command: pytest --junitxml=/home/casatest/casa6/casatestutils/nosedir/xml/test_casaconfig/nose.xml -s --disable-pytest-warnings --verbose -ra --tb=short /home/casatest/casa6/casatestutils/nosedir/test_casaconfig/
29-Sep-2026 19:50:50 total 79564
29-Sep-2026 19:50:50 -rw-r--r-- 1 casaci 15001  1934135 Sep 29 23:30 casatasks-6.7.7.7a14849.dev2-py3-none-any.whl
29-Sep-2026 19:50:50 -rw-r--r-- 1 casaci root     15290 Sep 29 23:50 casatasks_test.log
29-Sep-2026 19:50:50 -rw-r--r-- 1 casaci 15001   161130 Sep 29 23:30 casatestutils-6.7.7.7a14849.dev2-py3-none-any.whl
29-Sep-2026 19:50:50 -rw-r--r-- 1 casaci 15001 79346756 Sep 29 23:30 casatools-6.7.7.7a14849.dev2-cp312-cp312-manylinux_2_28_x86_64.whl
29-Sep-2026 19:50:50 -rw-r--r-- 1 casaci root       907 Sep 29 23:50 requirements.txt
29-Sep-2026 19:50:50 -rw-r--r-- 1 casaci root      2092 Sep 29 23:50 test_casaconfig.xml
29-Sep-2026 19:50:50 Finished task 'Test wheel' with result: Success
29-Sep-2026 19:50:50 Starting task 'Inject is_641' of type 'com.atlassian.bamboo.plugins.bamboo-variable-inject-plugin:inject'
29-Sep-2026 19:50:50 Injected variable bamboo.inject.is_641=False in LOCAL scope
29-Sep-2026 19:50:50 Finished task 'Inject is_641' with result: Success
29-Sep-2026 19:50:50
Substituting variable: ${bamboo.agentId} with 153550852
29-Sep-2026 19:50:50
Substituting variable: ${bamboo.agentId} with 153550852
29-Sep-2026 19:50:50
Substituting variable: ${bamboo.agentId} with 153550852
29-Sep-2026 19:50:50
Substituting variable: ${bamboo.agentId} with 153550852
29-Sep-2026 19:50:50 Starting task 'Tar work directory' of type 'com.atlassian.bamboo.plugins.scripttask:task.builder.script'
29-Sep-2026 19:50:50
Beginning to execute external process for build 'CASASPECS - Dev Test 3.12 - CAS-14849 - Test Tasks Many Linux 2.28 Py3.12 #3 (CASASPECS-DEVTESTPY312147-TTM228PY312-3)'
... running command line:
/opt/ci_workspace/casa/bamboo/agent4/temp/CASASPECS-DEVTESTPY312147-TTM228PY312-3-ScriptBuildTask-7519324700006230505.sh
... in: /opt/ci_workspace/casa/bamboo/agent4/xml-data/build-dir/CASASPECS-DEVTESTPY312147-TTM228PY312
29-Sep-2026 19:50:50 Package working directory
29-Sep-2026 19:50:50 nosedir/
29-Sep-2026 19:50:50 nosedir/test_casaconfig/
29-Sep-2026 19:50:50 nosedir/test_casaconfig/test_casaconfig.py
29-Sep-2026 19:50:50 nosedir/test_casaconfig/conftest.py
29-Sep-2026 19:50:50 nosedir/test_casaconfig/casa-20260929-233157.log
29-Sep-2026 19:50:50 nosedir/test_casaconfig/short_summary.log
29-Sep-2026 19:50:50 nosedir/test_casaconfig/casa-20260929-233404.log
29-Sep-2026 19:50:50 nosedir/test_casaconfig/casa-20260929-234034.log
29-Sep-2026 19:50:50 nosedir/test_casaconfig/casa-20260929-234725.log
29-Sep-2026 19:50:50 nosedir/xml/
29-Sep-2026 19:50:50 nosedir/xml/test_casaconfig/
29-Sep-2026 19:50:50 nosedir/xml/test_casaconfig/nose.xml
29-Sep-2026 19:50:50 nosedir/summary_of_failed.log
29-Sep-2026 19:50:50 nosedir/requirements.txt
29-Sep-2026 19:50:51 total 79580
29-Sep-2026 19:50:51 -rw-r--r-- 1 casaci 15001  1934135 Sep 29 23:30 casatasks-6.7.7.7a14849.dev2-py3-none-any.whl
29-Sep-2026 19:50:51 -rw-r--r-- 1 casaci root     15290 Sep 29 23:50 casatasks_test.log
29-Sep-2026 19:50:51 -rw-r--r-- 1 casaci 15001   161130 Sep 29 23:30 casatestutils-6.7.7.7a14849.dev2-py3-none-any.whl
29-Sep-2026 19:50:51 -rw-r--r-- 1 casaci 15001 79346756 Sep 29 23:30 casatools-6.7.7.7a14849.dev2-cp312-cp312-manylinux_2_28_x86_64.whl
29-Sep-2026 19:50:51 -rw-r--r-- 1 casaci root       907 Sep 29 23:50 requirements.txt
29-Sep-2026 19:50:51 -rw-r--r-- 1 casaci root      2092 Sep 29 23:50 test_casaconfig.xml
29-Sep-2026 19:50:51 -rw-r--r-- 1 casaci root     12767 Sep 29 23:50 work-manylinux_228_casatasks-3.12.tar.gz
29-Sep-2026 19:50:51 Done packaging working directory
29-Sep-2026 19:50:51 Finished task 'Tar work directory' with result: Success
29-Sep-2026 19:50:51 Starting task 'Parse tests' of type 'com.atlassian.bamboo.plugins.testresultparser:task.testresultparser.junit'
29-Sep-2026 19:50:51 Parsing test results under /opt/ci_workspace/casa/bamboo/agent4/xml-data/build-dir/CASASPECS-DEVTESTPY312147-TTM228PY312...
29-Sep-2026 19:50:51 Failing task since 2 failing test cases were found.
29-Sep-2026 19:50:51 Finished task 'Parse tests' with result: Failed
29-Sep-2026 19:50:51 Running post build plugin 'Docker Container Cleanup'
29-Sep-2026 19:50:51
Beginning to execute external process for build 'CASASPECS - Dev Test 3.12 - CAS-14849 - Test Tasks Many Linux 2.28 Py3.12 #3 (CASASPECS-DEVTESTPY312147-TTM228PY312-3)'
... running command line:
/usr/bin/docker rm -f wheel-container-test_153550852
... in: /opt/ci_workspace/casa/bamboo/agent4/xml-data/build-dir/CASASPECS-DEVTESTPY312147-TTM228PY312
29-Sep-2026 19:50:52 wheel-container-test_153550852
29-Sep-2026 19:50:52 Running post build plugin 'NCover Results Collector'
29-Sep-2026 19:50:52 Running post build plugin 'Build Results Label Collector'
29-Sep-2026 19:50:52 Running post build plugin 'Clover Results Collector'
29-Sep-2026 19:50:52 Running post build plugin 'npm Cache Cleanup'
29-Sep-2026 19:50:52 Running post build plugin 'Artifact Copier'
29-Sep-2026 19:50:52 Publishing an artifact: Workdir
29-Sep-2026 19:50:52 Finished publishing of artifact Non required job artifact Http Compression On : [Workdir], patterns: [work*.tar.gz] anchored at: [wheeldirectory/] in 54.08 ms
29-Sep-2026 19:50:52 Publishing an artifact: XML Directories
29-Sep-2026 19:50:52 Finished publishing of artifact Non required job artifact Http Compression On : [XML Directories], patterns: [**/*.xml] anchored at: [wheeldirectory/] in 13.10 ms
29-Sep-2026 19:50:52 Publishing an artifact: casatasks_test.log
29-Sep-2026 19:50:52 Finished publishing of artifact Non required job artifact Http Compression On : [casatasks_test.log], patterns: [casatasks_test.log] anchored at: [wheeldirectory/] in 12.28 ms
29-Sep-2026 19:50:52 Publishing an artifact: requirements.txt
29-Sep-2026 19:50:52 Finished publishing of artifact Non required job artifact Http Compression On : [requirements.txt], patterns: [requirements.txt] anchored at: [wheeldirectory/] in 9.522 ms
29-Sep-2026 19:50:52 Finalising the build...
29-Sep-2026 19:50:52 Stopping timer.
29-Sep-2026 19:50:52 Build CASASPECS-DEVTESTPY312147-TTM228PY312-3 completed.
29-Sep-2026 19:50:52 Running on server: post build plugin 'Build Hanging Detection Configuration'
29-Sep-2026 19:50:52 Running on server: post build plugin 'NCover Results Collector'
29-Sep-2026 19:50:52 Running on server: post build plugin 'Build Labeller'
29-Sep-2026 19:50:52 Running on server: post build plugin 'Clover Delta Calculator'
29-Sep-2026 19:50:53 Running on server: post build plugin 'Maven Dependencies Postprocessor'
29-Sep-2026 19:50:53 All post build plugins have finished
29-Sep-2026 19:50:53 Generating build results summary...
29-Sep-2026 19:50:53 Saving build results to disk...
29-Sep-2026 19:50:53 Store variable context...
29-Sep-2026 19:50:53 Finished building CASASPECS-DEVTESTPY312147-TTM228PY312-3.