Build: #3 failed
Job: Test Tasks Many Linux 2.28 Py3.12 failed
Job result summary
- Completed
- Duration
- 21 minutes
- Agent
- casaci-4.cv.nrao.edu test agent4
- Revision
-
2622d8cd816c2e6e3517837f8b7d521faf3e561d
- Total tests
- 13
Tests
- 13 tests in total
- 2 tests failed
- 2 failures are new
- 18 minutes taken in total.
| Status | Test | Duration | |
|---|---|---|---|
| Collapse |
test_casaconfig
casaconfig_test.test_casaconfig_measures_available
|
23 secs | |
AssertionError: False is not true
test_casaconfig.py:176: in test_casaconfig_measures_available
self.assertTrue(any(elem in self.get_meas_avail() for elem in [measuresdata_today, measuresdata_yesterday]))
E AssertionError: False is not true
|
|||
| Collapse |
test_casaconfig
casaconfig_test.test_casaconfig_measures_update
|
1 min | |
AssertionError: False is not true
test_casaconfig.py:197: in test_casaconfig_measures_update
self.assertTrue(newVers == vers)
E AssertionError: False is not true
|
|||
Error summary
The build generated some errors. See the full build log for more details.
/opt/ci_workspace/casa/bamboo/agent4/temp/CASASPECS-DEVTESTPY312147-TTM228PY312-3-ScriptBuildTask-4915256049982938452.sh: line 2: cd: /opt/casa/data/casa-data-req: No such file or directory
Error response from daemon: No such container: wheel-container-test_153550852
Error response from daemon: No such container: wheel-container-test_153550852
% Total % Received % Xferd Average Speed Time Time Time Current
Dload Upload Total Spent Left Speed
0 0 0 0 0 0 0 0 --:--:-- --:--:-- --:--:-- 0
100 6002k 100 6002k 0 0 99.3M 0 --:--:-- --:--:-- --:--:-- 99.3M
Switched to a new branch 'CAS-14849'
Updated 0 paths from fb45b40137
Updated 0 paths from fb45b40137
Updated 0 paths from a0fff8df6c
Switched to a new branch 'CAS-14849'
Error response from daemon: No such container: wheel-container-test_153550852
Error response from daemon: No such container: wheel-container-test_153550852
% Total % Received % Xferd Average Speed Time Time Time Current
Dload Upload Total Spent Left Speed
0 0 0 0 0 0 0 0 --:--:-- --:--:-- --:--:-- 0
100 6002k 100 6002k 0 0 99.3M 0 --:--:-- --:--:-- --:--:-- 99.3M
Switched to a new branch 'CAS-14849'
Updated 0 paths from fb45b40137
Updated 0 paths from fb45b40137
Updated 0 paths from a0fff8df6c
Switched to a new branch 'CAS-14849'