Test Tools and Tasks using measures at go (dot) nrao (dot) edu (slash)iers

Build: #10 failed

Job: Test Tools Many Linux 2.28 Rocky 8.10 Py3.12 failed

Build log

The build generated 1,101 lines of output.   The output is too long and has been truncated to the last 1,000 lines. Download or view full build log.

27-Oct-2026 10:37:05 Starting task 'Start container' of type 'com.atlassian.bamboo.plugins.bamboo-docker-plugin:task.docker.cli'
27-Oct-2026 10:37:05 Running image name (casa-docker.nrao.edu:5000/casa-test-rocky-8.10:4)
27-Oct-2026 10:37:05
Beginning to execute external process for build 'CASASPECS - Master Test 3.12 with NRAO IERS - Test Tools Many Linux 2.28 Rocky 8.10 Py3.12 #10 (CASASPECS-MASTERTESTNRAOIERSPY312-TTOMLNRAOIERSPY312-10)'
... running command line:
/usr/bin/docker run --volume /opt/ci_workspace/casa/bamboo/agent4/xml-data/build-dir/CASASPECS-MASTERTESTNRAOIERSPY312-TTOMLNRAOIERSPY312/wheeldirectory:/wheeldirectory --volume /opt/casa/data/casatestdata:/opt/casa/data/casatestdata --detach --name wheel-container-test-153550852 casa-docker.nrao.edu:5000/casa-test-rocky-8.10:4 tail -f /dev/null
... in: /opt/ci_workspace/casa/bamboo/agent4/xml-data/build-dir/CASASPECS-MASTERTESTNRAOIERSPY312-TTOMLNRAOIERSPY312
27-Oct-2026 10:37:07 209f0b03b6d0d8e41a8fd5c68295fd56b7784e0be6a33aea9fede0e823dee4fd
27-Oct-2026 10:37:07 Finished task 'Start container' with result: Success
27-Oct-2026 10:37:07
Substituting variable: ${bamboo.agentId} with 153550852
27-Oct-2026 10:37:07
Substituting variable: ${bamboo.planRepository.branchName} with master
27-Oct-2026 10:37:07
Substituting variable: ${bamboo.python_version} with 3.12
27-Oct-2026 10:37:07 Starting task 'Test wheel' of type 'com.atlassian.bamboo.plugins.scripttask:task.builder.script'
27-Oct-2026 10:37:07
Beginning to execute external process for build 'CASASPECS - Master Test 3.12 with NRAO IERS - Test Tools Many Linux 2.28 Rocky 8.10 Py3.12 #10 (CASASPECS-MASTERTESTNRAOIERSPY312-TTOMLNRAOIERSPY312-10)'
... running command line:
/opt/ci_workspace/casa/bamboo/agent4/temp/CASASPECS-MASTERTESTNRAOIERSPY312-TTOMLNRAOIERSPY312-10-ScriptBuildTask-15651212288704757229.sh
... in: /opt/ci_workspace/casa/bamboo/agent4/xml-data/build-dir/CASASPECS-MASTERTESTNRAOIERSPY312-TTOMLNRAOIERSPY312
27-Oct-2026 10:37:07 branch: master
27-Oct-2026 10:37:07 Python version: 3.12
27-Oct-2026 10:37:07   % Total    % Received % Xferd  Average Speed   Time    Time     Time  Current
27-Oct-2026 10:37:07                                  Dload  Upload   Total   Spent    Left  Speed
27-Oct-2026 10:37:07
27-Oct-2026 10:37:07   0     0    0     0    0     0      0      0 --:--:-- --:--:-- --:--:--     0
27-Oct-2026 10:37:07 99 6002k   99 5984k    0     0  38.7M      0 --:--:-- --:--:-- --:--:-- 38.4M
27-Oct-2026 10:37:07 100 6002k  100 6002k    0     0  38.8M      0 --:--:-- --:--:-- --:--:-- 38.5M
27-Oct-2026 10:37:07 bamboo_jira_components:''
27-Oct-2026 10:37:07 bamboo_testlist:''
27-Oct-2026 10:37:07 Ticket components:
27-Oct-2026 10:37:07 datapath=[ "/home/casatest/data/measures", "/opt/casa/data/casatestdata" ]
27-Oct-2026 10:37:07 measurespath="/home/casatest/data/measures"
27-Oct-2026 10:37:07 measures_auto_update=False
27-Oct-2026 10:37:07 data_auto_update=False
27-Oct-2026 10:37:08 [4014266] Failed to execute script 'atlutil' due to unhandled exception!
27-Oct-2026 10:37:08 Traceback (most recent call last):
27-Oct-2026 10:37:08   File "atlutil.py", line 200, in <module>
27-Oct-2026 10:37:08   File "atlutil.py", line 165, in has_fix_version
27-Oct-2026 10:37:08 KeyError: 'fields'
27-Oct-2026 10:37:08 datapath=[ "/home/casatest/data/measures", "/opt/casa/data/casatestdata" ]
27-Oct-2026 10:37:08 measurespath="/home/casatest/data/measures"
27-Oct-2026 10:37:08 measures_auto_update=False
27-Oct-2026 10:37:08 data_auto_update=False
27-Oct-2026 10:37:10 Requirement already satisfied: pip in /home/casatest/venv/lib/python3.12/site-packages (24.3.1)
27-Oct-2026 10:37:10 Collecting pip
27-Oct-2026 10:37:10   Downloading pip-26.2.2-py3-none-any.whl.metadata (4.6 kB)
27-Oct-2026 10:37:10 Collecting numpy
27-Oct-2026 10:37:10   Downloading numpy-2.5.4-cp312-cp312-manylinux_2_27_x86_64.manylinux_2_28_x86_64.whl.metadata (6.6 kB)
27-Oct-2026 10:37:10 Downloading pip-26.2.2-py3-none-any.whl (1.8 MB)
27-Oct-2026 10:37:10    ━━━━━━━━━━━━━━━━━━━━━━━━━━━━━━━━━━━━━━━━ 1.8/1.8 MB 97.2 MB/s eta 0:00:00
27-Oct-2026 10:37:10 Downloading numpy-2.5.4-cp312-cp312-manylinux_2_27_x86_64.manylinux_2_28_x86_64.whl (16.7 MB)
27-Oct-2026 10:37:10    ━━━━━━━━━━━━━━━━━━━━━━━━━━━━━━━━━━━━━━━━ 16.7/16.7 MB 231.2 MB/s eta 0:00:00
27-Oct-2026 10:37:10 Installing collected packages: pip, numpy
27-Oct-2026 10:37:10   Attempting uninstall: pip
27-Oct-2026 10:37:10     Found existing installation: pip 24.3.1
27-Oct-2026 10:37:10     Uninstalling pip-24.3.1:
27-Oct-2026 10:37:10       Successfully uninstalled pip-24.3.1
27-Oct-2026 10:37:12 Successfully installed numpy-2.5.4 pip-26.2.2
27-Oct-2026 10:37:13 Processing ./casatestutils-6.8.0.1-py3-none-any.whl
27-Oct-2026 10:37:13 Collecting pytest>=6.0 (from casatestutils==6.8.0.1)
27-Oct-2026 10:37:13   Downloading pytest-9.1.1-py3-none-any.whl.metadata (7.6 kB)
27-Oct-2026 10:37:13 Collecting astropy (from casatestutils==6.8.0.1)
27-Oct-2026 10:37:13   Downloading astropy-8.0.2-cp311-abi3-manylinux2014_x86_64.manylinux_2_17_x86_64.manylinux_2_28_x86_64.whl.metadata (11 kB)
27-Oct-2026 10:37:13 Collecting iniconfig>=1.0.1 (from pytest>=6.0->casatestutils==6.8.0.1)
27-Oct-2026 10:37:13   Downloading iniconfig-2.3.1-py3-none-any.whl.metadata (2.8 kB)
27-Oct-2026 10:37:13 Collecting packaging>=22 (from pytest>=6.0->casatestutils==6.8.0.1)
27-Oct-2026 10:37:13   Downloading packaging-26.3-py3-none-any.whl.metadata (3.5 kB)
27-Oct-2026 10:37:13 Collecting pluggy<2,>=1.5 (from pytest>=6.0->casatestutils==6.8.0.1)
27-Oct-2026 10:37:13   Downloading pluggy-1.7.0-py3-none-any.whl.metadata (5.0 kB)
27-Oct-2026 10:37:13 Collecting pygments>=2.7.2 (from pytest>=6.0->casatestutils==6.8.0.1)
27-Oct-2026 10:37:13   Downloading pygments-2.21.0-py3-none-any.whl.metadata (2.5 kB)
27-Oct-2026 10:37:13 Collecting astropy-iers-data>=0.2026.9.28.0.59.37 (from astropy->casatestutils==6.8.0.1)
27-Oct-2026 10:37:13   Downloading astropy_iers_data-0.2026.10.19.0.52.1-py3-none-any.whl.metadata (3.4 kB)
27-Oct-2026 10:37:13 Requirement already satisfied: numpy>=2.0 in /home/casatest/venv/lib/python3.12/site-packages (from astropy->casatestutils==6.8.0.1) (2.5.4)
27-Oct-2026 10:37:13 Collecting pyerfa>=2.0.1.3 (from astropy->casatestutils==6.8.0.1)
27-Oct-2026 10:37:13   Downloading pyerfa-2.0.1.5-cp39-abi3-manylinux_2_17_x86_64.manylinux2014_x86_64.whl.metadata (5.7 kB)
27-Oct-2026 10:37:13 Collecting PyYAML>=6.0.0 (from astropy->casatestutils==6.8.0.1)
27-Oct-2026 10:37:13   Downloading pyyaml-6.0.3-cp312-cp312-manylinux2014_x86_64.manylinux_2_17_x86_64.manylinux_2_28_x86_64.whl.metadata (2.4 kB)
27-Oct-2026 10:37:13 Downloading pytest-9.1.1-py3-none-any.whl (386 kB)
27-Oct-2026 10:37:13 Downloading pluggy-1.7.0-py3-none-any.whl (27 kB)
27-Oct-2026 10:37:13 Downloading iniconfig-2.3.1-py3-none-any.whl (7.6 kB)
27-Oct-2026 10:37:13 Downloading packaging-26.3-py3-none-any.whl (129 kB)
27-Oct-2026 10:37:13 Downloading pygments-2.21.0-py3-none-any.whl (1.3 MB)
27-Oct-2026 10:37:13    ━━━━━━━━━━━━━━━━━━━━━━━━━━━━━━━━━━━━━━━━ 1.3/1.3 MB 96.4 MB/s  0:00:00
27-Oct-2026 10:37:13 Downloading astropy-8.0.2-cp311-abi3-manylinux2014_x86_64.manylinux_2_17_x86_64.manylinux_2_28_x86_64.whl (10.4 MB)
27-Oct-2026 10:37:13    ━━━━━━━━━━━━━━━━━━━━━━━━━━━━━━━━━━━━━━━━ 10.4/10.4 MB 107.0 MB/s  0:00:00
27-Oct-2026 10:37:13 Downloading astropy_iers_data-0.2026.10.19.0.52.1-py3-none-any.whl (2.0 MB)
27-Oct-2026 10:37:13    ━━━━━━━━━━━━━━━━━━━━━━━━━━━━━━━━━━━━━━━━ 2.0/2.0 MB 111.7 MB/s  0:00:00
27-Oct-2026 10:37:13 Downloading pyerfa-2.0.1.5-cp39-abi3-manylinux_2_17_x86_64.manylinux2014_x86_64.whl (738 kB)
27-Oct-2026 10:37:13    ━━━━━━━━━━━━━━━━━━━━━━━━━━━━━━━━━━━━━━━━ 738.7/738.7 kB 74.4 MB/s  0:00:00
27-Oct-2026 10:37:13 Downloading pyyaml-6.0.3-cp312-cp312-manylinux2014_x86_64.manylinux_2_17_x86_64.manylinux_2_28_x86_64.whl (807 kB)
27-Oct-2026 10:37:13    ━━━━━━━━━━━━━━━━━━━━━━━━━━━━━━━━━━━━━━━━ 807.9/807.9 kB 110.0 MB/s  0:00:00
27-Oct-2026 10:37:13 Installing collected packages: PyYAML, pygments, pyerfa, pluggy, packaging, iniconfig, astropy-iers-data, pytest, astropy, casatestutils
27-Oct-2026 10:37:16
27-Oct-2026 10:37:16 Successfully installed PyYAML-6.0.3 astropy-8.0.2 astropy-iers-data-0.2026.10.19.0.52.1 casatestutils-6.8.0.1 iniconfig-2.3.1 packaging-26.3 pluggy-1.7.0 pyerfa-2.0.1.5 pygments-2.21.0 pytest-9.1.1
27-Oct-2026 10:37:17 Processing ./casatools-6.8.0.1-cp312-cp312-manylinux_2_28_x86_64.whl
27-Oct-2026 10:37:17 Requirement already satisfied: numpy in /home/casatest/venv/lib/python3.12/site-packages (from casatools==6.8.0.1) (2.5.4)
27-Oct-2026 10:37:17 Collecting casaconfig (from casatools==6.8.0.1)
27-Oct-2026 10:37:17   Downloading casaconfig-1.5.2-py3-none-any.whl.metadata (4.0 kB)
27-Oct-2026 10:37:17 Collecting certifi>=2023.5.7 (from casaconfig->casatools==6.8.0.1)
27-Oct-2026 10:37:17   Downloading certifi-2026.10.23-py3-none-any.whl.metadata (2.5 kB)
27-Oct-2026 10:37:17 Downloading casaconfig-1.5.2-py3-none-any.whl (77 kB)
27-Oct-2026 10:37:17 Downloading certifi-2026.10.23-py3-none-any.whl (135 kB)
27-Oct-2026 10:37:17 Installing collected packages: certifi, casaconfig, casatools
27-Oct-2026 10:37:18
27-Oct-2026 10:37:18 Successfully installed casaconfig-1.5.2 casatools-6.8.0.1 certifi-2026.10.23
27-Oct-2026 10:37:19 Checking for updates into /home/casatest/data/measures
27-Oct-2026 10:37:19 pull_data using version casarundata-2026.10.26-1.tar.gz, acquiring the lock ...
27-Oct-2026 10:37:19 downloading casarundata contents to  /home/casatest/data/measures (26M) ... done
27-Oct-2026 10:37:19 casarundata installed casarundata-2026.10.26-1.tar.gz at /home/casatest/data/measures
27-Oct-2026 10:38:06 measures_update ... acquiring the lock ...
27-Oct-2026 10:38:06 A measures update has been requested by the force argument
27-Oct-2026 10:38:06   ... finding available measures ...
27-Oct-2026 10:38:06   ... downloading NRAO_Measures_20261026-140619.ztar from https://go.nrao.edu/iers/ to /home/casatest/data/measures ...
27-Oct-2026 10:38:06   ... measures data updated at /home/casatest/data/measures
27-Oct-2026 10:38:07 {'MJD0': 37664.0, 'TAB_VERSION': '0002.0000', 'VS_CREATE': '2026/10/26/18:06', 'VS_DATE': '2026/10/26/18:06', 'VS_TYPE': 'IERS EOP2000C04_20 Earth Orientation Data IAU2000', 'VS_VERSION': '0001.0001', 'dMJD': 1.0}
27-Oct-2026 10:39:45 Already on 'master'
27-Oct-2026 10:39:45 Your branch is up to date with 'origin/master'.
27-Oct-2026 10:39:45   % Total    % Received % Xferd  Average Speed   Time    Time     Time  Current
27-Oct-2026 10:39:45                                  Dload  Upload   Total   Spent    Left  Speed
27-Oct-2026 10:39:45
27-Oct-2026 10:39:45   0     0    0     0    0     0      0      0 --:--:-- --:--:-- --:--:--     0
27-Oct-2026 10:39:45 100   669    0   669    0     0  37166      0 --:--:-- --:--:-- --:--:-- 37166
27-Oct-2026 10:40:07 ============================= test session starts ==============================
27-Oct-2026 10:40:07 platform linux -- Python 3.12.9, pytest-9.1.1, pluggy-1.7.0 -- /home/casatest/venv/bin/python3.12
27-Oct-2026 10:40:07 cachedir: .pytest_cache
27-Oct-2026 10:40:07 rootdir: /home/casatest/casa6/casatestutils/nosedir/test_tool_ms_createmultims
27-Oct-2026 10:40:07 configfile: pytest.ini
27-Oct-2026 10:40:07 collecting ... collected 1 item
27-Oct-2026 10:40:07
27-Oct-2026 10:40:07
27-Oct-2026 10:40:08 2026-10-27 14:40:08        INFO        ms::createmultims        Copying subtables from part1.ms to the other MMS members.
27-Oct-2026 10:40:10 2026-10-27 14:40:10        INFO        name::        No table opened.
27-Oct-2026 10:40:10 2026-10-27 14:40:10        INFO        name::        No table opened.
27-Oct-2026 10:40:10 test_tool_ms_createmultims.py::test_createmultims::test1
27-Oct-2026 10:40:10 Test_createmultims 1: 4 parts, same sources but different spws
27-Oct-2026 10:40:10 Copying part1.ms
27-Oct-2026 10:40:10 Copying part2-mod.ms
27-Oct-2026 10:40:10 Copying part2-mod2.ms
27-Oct-2026 10:40:10 Copying part2.ms
27-Oct-2026 10:40:10 Copying part3.ms
27-Oct-2026 10:40:10 Copying part4.ms
27-Oct-2026 10:40:10 PASSED
27-Oct-2026 10:40:10
27-Oct-2026 10:40:10 - generated xml file: /home/casatest/casa6/casatestutils/nosedir/xml/test_tool_ms_createmultims/nose.xml -
27-Oct-2026 10:40:10 ========================= 1 passed, 1 warning in 2.50s =========================
27-Oct-2026 10:40:10 ============================= test session starts ==============================
27-Oct-2026 10:40:10 platform linux -- Python 3.12.9, pytest-9.1.1, pluggy-1.7.0 -- /home/casatest/venv/bin/python3.12
27-Oct-2026 10:40:10 cachedir: .pytest_cache
27-Oct-2026 10:40:10 rootdir: /home/casatest/casa6/casatestutils/nosedir/test_tool_quanta
27-Oct-2026 10:40:10 configfile: pytest.ini
27-Oct-2026 10:40:10 collecting ... collected 9 items
27-Oct-2026 10:40:10
27-Oct-2026 10:40:10
27-Oct-2026 10:40:10 2026-10-27 14:40:11        SEVERE                Exception Reported: Error in QuantumHolder::fromString with input string "bogus": Illegal input units or format
27-Oct-2026 10:40:10 2026-10-27 14:40:11        SEVERE        +         in converting quantity
27-Oct-2026 10:40:10 test_tool_quanta.py::quanta_convert_test::test_exceptions
27-Oct-2026 10:40:10 Test various exception cases
27-Oct-2026 10:40:10 PASSED
27-Oct-2026 10:40:10
27-Oct-2026 10:40:10 test_tool_quanta.py::quanta_convert_test::test_valid
27-Oct-2026 10:40:10 Test specifying the quantity as a scalar
27-Oct-2026 10:40:10 PASSED
27-Oct-2026 10:40:10
27-Oct-2026 10:40:10 test_tool_quanta.py::quanta_convert_test::test_value_as_string
27-Oct-2026 10:40:10 Test specifying value as a string
27-Oct-2026 10:40:10 PASSED
27-Oct-2026 10:40:10
27-Oct-2026 10:40:10 2026-10-27 14:40:11        SEVERE                Error in QuantumHolder::fromString with input string "blah": Illegal input units or format
27-Oct-2026 10:40:10 2026-10-27 14:40:11        SEVERE        +         in converting quantity
27-Oct-2026 10:40:10 2026-10-27 14:40:11        SEVERE                Exception Reported: Error in QuantumHolder::fromString with input string "blah": Illegal input units or format
27-Oct-2026 10:40:10 2026-10-27 14:40:11        SEVERE        +         in converting quantity
27-Oct-2026 10:40:10 2026-10-27 14:40:11        SEVERE                Error in QuantumHolder::fromString with input string "blah": Illegal input units or format
27-Oct-2026 10:40:10 2026-10-27 14:40:11        SEVERE        +         in converting quantity
27-Oct-2026 10:40:10 2026-10-27 14:40:11        SEVERE                Exception Reported: Error in QuantumHolder::fromString with input string "blah": Illegal input units or format
27-Oct-2026 10:40:10 2026-10-27 14:40:11        SEVERE        +         in converting quantity
27-Oct-2026 10:40:10 2026-10-27 14:40:11        SEVERE                Exception Reported: Unit::check Illegal unit string 'zz'
27-Oct-2026 10:40:10 2026-10-27 14:40:11        SEVERE                Exception Reported: Unit::check Illegal unit string 'zz'
27-Oct-2026 10:40:10 test_tool_quanta.py::quanta_quantity_test::test_exceptions
27-Oct-2026 10:40:10 Test various exception cases
27-Oct-2026 10:40:10 PASSED
27-Oct-2026 10:40:10
27-Oct-2026 10:40:10 test_tool_quanta.py::quanta_quantity_test::test_multidimensional_arra_value
27-Oct-2026 10:40:10 Test specifying the quantity as a multidimensional array
27-Oct-2026 10:40:10 PASSED
27-Oct-2026 10:40:10
27-Oct-2026 10:40:10 test_tool_quanta.py::quanta_quantity_test::test_scalar_value
27-Oct-2026 10:40:10 Test specifying the quantity as a scalar
27-Oct-2026 10:40:10 PASSED
27-Oct-2026 10:40:10
27-Oct-2026 10:40:10 test_tool_quanta.py::quanta_quantity_test::test_value_as_record
27-Oct-2026 10:40:10 Test value as record (eg already a quantity).
27-Oct-2026 10:40:10 This is essentially a reflection operator.
27-Oct-2026 10:40:10 PASSED
27-Oct-2026 10:40:10
27-Oct-2026 10:40:10 test_tool_quanta.py::quanta_quantity_test::test_value_as_string
27-Oct-2026 10:40:10 Test specifying value as a string
27-Oct-2026 10:40:10 PASSED
27-Oct-2026 10:40:10
27-Oct-2026 10:40:10 test_tool_quanta.py::quanta_quantity_test::test_vector_value
27-Oct-2026 10:40:10 Test specifying the quantity as a vector
27-Oct-2026 10:40:10 PASSED
27-Oct-2026 10:40:10
27-Oct-2026 10:40:10 - generated xml file: /home/casatest/casa6/casatestutils/nosedir/xml/test_tool_quanta/nose.xml -
27-Oct-2026 10:40:10 ========================= 9 passed, 1 warning in 0.29s =========================
27-Oct-2026 10:40:10 ============================= test session starts ==============================
27-Oct-2026 10:40:10 platform linux -- Python 3.12.9, pytest-9.1.1, pluggy-1.7.0 -- /home/casatest/venv/bin/python3.12
27-Oct-2026 10:40:10 cachedir: .pytest_cache
27-Oct-2026 10:40:10 rootdir: /home/casatest/casa6/casatestutils/nosedir/test_tool_calibrater
27-Oct-2026 10:40:10 configfile: pytest.ini
27-Oct-2026 10:40:10 collecting ... collected 24 items
27-Oct-2026 10:40:10
27-Oct-2026 10:40:10
27-Oct-2026 10:40:11 2026-10-27 14:40:11        INFO        calibrater::open        ****Using NEW VI2-driven calibrater tool****
27-Oct-2026 10:40:11 2026-10-27 14:40:11        INFO        calibrater::open        Opening MS: gaincaltest2.ms for calibration.
27-Oct-2026 10:40:11 2026-10-27 14:40:11        INFO                Clearing all model records in MS header.
27-Oct-2026 10:40:11 2026-10-27 14:40:11        INFO        VisSetUtil::addScrCols        Adding MODEL_DATA and CORRECTED_DATA column(s).
27-Oct-2026 10:40:11 2026-10-27 14:40:12        SEVERE        Calibrater::initialize (file /source/casa6/casatools/src/code/synthesis/MeasurementComponents/Calibrater.cc, line 433)        Caught exception: Measures directory specified which does not contain the IERS data: /home/casatest/data/measures
27-Oct-2026 10:40:11 2026-10-27 14:40:12        SEVERE                Exception Reported: Error in Calibrater::initialize()
27-Oct-2026 10:40:11 2026-10-27 14:40:12        WARN        calibrater::setvi(bool,bool)        Already using NEW VisibilityIterator.
27-Oct-2026 10:40:11 test_tool_calibrater.py::calibrater_test::test_activityRecord
27-Oct-2026 10:40:11 Check that using the calibrater to modify the vis shows in the activity record 
27-Oct-2026 10:40:11 FAILED
27-Oct-2026 10:40:11
27-Oct-2026 10:40:11 2026-10-27 14:40:12        INFO        calibrater::open        ****Using NEW VI2-driven calibrater tool****
27-Oct-2026 10:40:11 2026-10-27 14:40:12        INFO        calibrater::open        Opening MS: gaincaltest2.ms for calibration.
27-Oct-2026 10:40:11 2026-10-27 14:40:12        INFO        Calibrater::        Initializing nominal selection to the whole MS.
27-Oct-2026 10:40:11 2026-10-27 14:40:12        INFO        calibrater::setapply        Beginning setapply--(MSSelection version)-------
27-Oct-2026 10:40:11 2026-10-27 14:40:12        INFO        Calibrater::setapply(type, applypar)        Arranging to APPLY:
27-Oct-2026 10:40:11 2026-10-27 14:40:12        INFO        Calibrater::setapply(type, applypar)        .   G Jones: table=gaincaltest2.ms.G0 select= interp=linear spwmap=[-1] calWt=false
27-Oct-2026 10:40:11 2026-10-27 14:40:12        INFO        calibrater::corrupt        Beginning corrupt---------------------------
27-Oct-2026 10:40:11 2026-10-27 14:40:12        INFO        Calibrater::corrupt2 (VI2/VB2)        The following calibration terms are arranged for apply:
27-Oct-2026 10:40:11 2026-10-27 14:40:12        INFO        Calibrater::corrupt2 (VI2/VB2)        .   G Jones: table=gaincaltest2.ms.G0 select= interp=linear spwmap=[-1] calWt=false
27-Oct-2026 10:40:12 2026-10-27 14:40:12        SEVERE        Calibrater::corrupt2 (VI2/VB2)        Caught exception: Measures directory specified which does not contain the IERS data: /home/casatest/data/measures
27-Oct-2026 10:40:12 2026-10-27 14:40:12        INFO        Calibrater::corrupt2 (VI2/VB2)        Resetting all calibration application settings.
27-Oct-2026 10:40:12 2026-10-27 14:40:12        SEVERE                Exception Reported: Error in Calibrater::corrupt2.
27-Oct-2026 10:40:12 2026-10-27 14:40:12        WARN        calibrater::setvi(bool,bool)        Already using NEW VisibilityIterator.
27-Oct-2026 10:40:12 test_tool_calibrater.py::calibrater_test::test_corruptCal
27-Oct-2026 10:40:12 Check that the MS is corrupted using the cal table 
27-Oct-2026 10:40:12 FAILED
27-Oct-2026 10:40:12
27-Oct-2026 10:40:12 2026-10-27 14:40:12        INFO        calibrater::open        ****Using NEW VI2-driven calibrater tool****
27-Oct-2026 10:40:12 2026-10-27 14:40:12        INFO        calibrater::open        Opening MS: gaincaltest2.ms for calibration.
27-Oct-2026 10:40:12 2026-10-27 14:40:12        INFO        Calibrater::        Initializing nominal selection to the whole MS.
27-Oct-2026 10:40:12 2026-10-27 14:40:12        WARN        calibrater::setvi(bool,bool)        Already using NEW VisibilityIterator.
27-Oct-2026 10:40:12 test_tool_calibrater.py::calibrater_test::test_createEmpty
27-Oct-2026 10:40:12 Check that an empty cal table can be created
27-Oct-2026 10:40:12 PASSED
27-Oct-2026 10:40:12
27-Oct-2026 10:40:12 2026-10-27 14:40:12        INFO        name::        No table opened.
27-Oct-2026 10:40:12 2026-10-27 14:40:12        INFO        showcache::        The Table Cache has the following 1 entries:
27-Oct-2026 10:40:12 2026-10-27 14:40:12        INFO        showcache::            0: "/home/casatest/casa6/casatestutils/nosedir/test_tool_calibrater/gaincaltest2.ms"
27-Oct-2026 10:40:12 2026-10-27 14:40:12        WARN        calibrater::setvi(bool,bool)        Already using NEW VisibilityIterator.
27-Oct-2026 10:40:12 test_tool_calibrater.py::calibrater_test::test_done
27-Oct-2026 10:40:12 Check that done closes the active calibrator tool 
27-Oct-2026 10:40:12 FAILED
27-Oct-2026 10:40:12
27-Oct-2026 10:40:12 2026-10-27 14:40:12        WARN        calibrater::setvi(bool,bool)        Forcing use of OLD VisibilityIterator.
27-Oct-2026 10:40:12 2026-10-27 14:40:12        INFO        calibrater::open        ****Using OLD VI-driven calibrater tool****
27-Oct-2026 10:40:12 2026-10-27 14:40:12        INFO        calibrater::open        Opening MS: gaincaltest2.ms for calibration.
27-Oct-2026 10:40:12 2026-10-27 14:40:12        INFO        Calibrater::        Initializing nominal selection to the whole MS.
27-Oct-2026 10:40:12 2026-10-27 14:40:13        SEVERE        Calibrater::initialize (file /source/casa6/casatools/src/code/synthesis/MeasurementComponents/Calibrater.cc, line 5881)        Caught exception: Measures directory specified which does not contain the IERS data: /home/casatest/data/measures
27-Oct-2026 10:40:12 2026-10-27 14:40:13        SEVERE                Exception Reported: Error in Calibrater::initialize()
27-Oct-2026 10:40:12 2026-10-27 14:40:13        WARN        calibrater::setvi(bool,bool)        Forcing use of NEW VisibilityIterator.
27-Oct-2026 10:40:12 test_tool_calibrater.py::calibrater_test::test_reinitModel
27-Oct-2026 10:40:12 Check that initcalset will reset the CORRECTED_DATA to unity 
27-Oct-2026 10:40:12 FAILED
27-Oct-2026 10:40:12
27-Oct-2026 10:40:12 2026-10-27 14:40:13        INFO        calibrater::open        ****Using NEW VI2-driven calibrater tool****
27-Oct-2026 10:40:12 2026-10-27 14:40:13        INFO        calibrater::open        Opening MS: gaincaltest2.ms for calibration.
27-Oct-2026 10:40:12 2026-10-27 14:40:13        INFO        Calibrater::        Initializing nominal selection to the whole MS.
27-Oct-2026 10:40:12 2026-10-27 14:40:13        INFO        calibrater::setapply        Beginning setapply--(MSSelection version)-------
27-Oct-2026 10:40:12 2026-10-27 14:40:13        INFO        Calibrater::setapply(type, applypar)        Arranging to APPLY:
27-Oct-2026 10:40:12 2026-10-27 14:40:13        INFO        Calibrater::setapply(type, applypar)        .   G Jones: table=gaincaltest2.ms.G0 select= interp=linear spwmap=[-1] calWt=false
27-Oct-2026 10:40:12 2026-10-27 14:40:13        INFO        calibrater::setsolve        Beginning setsolve--(MSSelection version)-------
27-Oct-2026 10:40:12 2026-10-27 14:40:13        INFO        Calibrater::setsolve        Arranging to SOLVE:
27-Oct-2026 10:40:12 2026-10-27 14:40:13        INFO        Calibrater::setsolve        .   Mf Mueller: table=gaincaltest2.ms.G0 append=false solint=inf,none refantmode='flex' refant='none' minsnr=0 apmode=AP solnorm=false
27-Oct-2026 10:40:12 2026-10-27 14:40:13        INFO        calibrater::reset        Reseting solve/apply state
27-Oct-2026 10:40:12 2026-10-27 14:40:13        INFO        calibrater::solve        Beginning solve-----------------------------
27-Oct-2026 10:40:12 2026-10-27 14:40:13        SEVERE        Calibrater::solve        Caught exception: Please run setsolve before attempting to solve.
27-Oct-2026 10:40:12 2026-10-27 14:40:13        INFO        Calibrater::solve        Reseting entire solve/apply state.
27-Oct-2026 10:40:12 2026-10-27 14:40:13        SEVERE                Exception Reported: Error in Calibrater::solve.
27-Oct-2026 10:40:12 2026-10-27 14:40:13        INFO        calibrater::correct        Beginning correct---------------------------
27-Oct-2026 10:40:12 2026-10-27 14:40:13        INFO        Calibrater::correct2 (VI2/VB2)        The following calibration terms are arranged for apply:
27-Oct-2026 10:40:12 2026-10-27 14:40:13        INFO        Calibrater::correct2 (VI2/VB2)        .   (None)
27-Oct-2026 10:40:12 2026-10-27 14:40:13        SEVERE        Calibrater::correct2 (VI2/VB2)        Caught exception: Measures directory specified which does not contain the IERS data: /home/casatest/data/measures
27-Oct-2026 10:40:12 2026-10-27 14:40:13        INFO        Calibrater::correct2 (VI2/VB2)        Resetting all calibration application settings.
27-Oct-2026 10:40:12 2026-10-27 14:40:13        SEVERE                Exception Reported: Error in Calibrater::correct.
27-Oct-2026 10:40:12 2026-10-27 14:40:13        WARN        calibrater::setvi(bool,bool)        Already using NEW VisibilityIterator.
27-Oct-2026 10:40:12 test_tool_calibrater.py::calibrater_test::test_resetSolveApply
27-Oct-2026 10:40:12 Check that the reset function can clear set apply and solves 
27-Oct-2026 10:40:12 PASSED
27-Oct-2026 10:40:12
27-Oct-2026 10:40:12 2026-10-27 14:40:13        INFO        calibrater::open        ****Using NEW VI2-driven calibrater tool****
27-Oct-2026 10:40:12 2026-10-27 14:40:13        INFO        calibrater::open        Opening MS: gaincaltest2.ms for calibration.
27-Oct-2026 10:40:12 2026-10-27 14:40:13        INFO        Calibrater::        Initializing nominal selection to the whole MS.
27-Oct-2026 10:40:13 2026-10-27 14:40:13        WARN        calibrater::setvi(bool,bool)        Already using NEW VisibilityIterator.
27-Oct-2026 10:40:13 test_tool_calibrater.py::calibrater_test::test_returnDict
27-Oct-2026 10:40:13 Check that the returndict function gives a dictonary with the expected keys 
27-Oct-2026 10:40:13 FAILED
27-Oct-2026 10:40:13
27-Oct-2026 10:40:13 2026-10-27 14:40:13        INFO        calibrater::open        ****Using NEW VI2-driven calibrater tool****
27-Oct-2026 10:40:13 2026-10-27 14:40:13        INFO        calibrater::open        Opening MS: gaincaltest2.ms for calibration.
27-Oct-2026 10:40:13 2026-10-27 14:40:13        INFO        Calibrater::        Initializing nominal selection to the whole MS.
27-Oct-2026 10:40:13 2026-10-27 14:40:13        INFO        calibrater::setdata        Beginning selectvis--(MSSelection version)-------
27-Oct-2026 10:40:13 2026-10-27 14:40:13        INFO        calibrater::reset        Reseting solve/apply state
27-Oct-2026 10:40:13 2026-10-27 14:40:13        INFO        Calibrater::selectvis        Performing selection on MeasurementSet
27-Oct-2026 10:40:13 2026-10-27 14:40:13        INFO        Calibrater::selectvis+         Selecting on antenna/baseline: '0'
27-Oct-2026 10:40:13 2026-10-27 14:40:13        INFO        Calibrater::selectvis        By selection 328860 rows are reduced to 65772
27-Oct-2026 10:40:13 2026-10-27 14:40:13        INFO        Calibrater::selectvis        Frequency selection: Selecting all channels in all spws.
27-Oct-2026 10:40:13 2026-10-27 14:40:13        INFO        calibrater::setdata        chanmode=none nchan=1 start=0 step=1 mStart='0km/s' mStep='0km/s' msSelect=''
27-Oct-2026 10:40:13 2026-10-27 14:40:13        INFO        calibrater::setapply        Beginning setapply--(MSSelection version)-------
27-Oct-2026 10:40:13 2026-10-27 14:40:13        INFO        Calibrater::setapply(type, applypar)        Arranging to APPLY:
27-Oct-2026 10:40:13 2026-10-27 14:40:13        INFO        Calibrater::setapply(type, applypar)        .   G Jones: table=gaincaltest2.ms.G0 select= interp=linear spwmap=[-1] calWt=false
27-Oct-2026 10:40:13 2026-10-27 14:40:13        INFO        calibrater::correct        Beginning correct---------------------------
27-Oct-2026 10:40:13 2026-10-27 14:40:13        INFO        Calibrater::correct2 (VI2/VB2)        The following calibration terms are arranged for apply:
27-Oct-2026 10:40:13 2026-10-27 14:40:13        INFO        Calibrater::correct2 (VI2/VB2)        .   G Jones: table=gaincaltest2.ms.G0 select= interp=linear spwmap=[-1] calWt=false
27-Oct-2026 10:40:13 2026-10-27 14:40:13        SEVERE        Calibrater::correct2 (VI2/VB2)        Caught exception: Measures directory specified which does not contain the IERS data: /home/casatest/data/measures
27-Oct-2026 10:40:13 2026-10-27 14:40:13        INFO        Calibrater::correct2 (VI2/VB2)        Resetting all calibration application settings.
27-Oct-2026 10:40:13 2026-10-27 14:40:13        SEVERE                Exception Reported: Error in Calibrater::correct.
27-Oct-2026 10:40:13 2026-10-27 14:40:13        WARN        calibrater::setvi(bool,bool)        Already using NEW VisibilityIterator.
27-Oct-2026 10:40:13 test_tool_calibrater.py::calibrater_test::test_selectVisBaseline
27-Oct-2026 10:40:13 Check that selectvis properly selects baseline/antenna
27-Oct-2026 10:40:13 FAILED
27-Oct-2026 10:40:13
27-Oct-2026 10:40:13 2026-10-27 14:40:14        INFO        calibrater::open        ****Using NEW VI2-driven calibrater tool****
27-Oct-2026 10:40:13 2026-10-27 14:40:14        INFO        calibrater::open        Opening MS: gaincaltest2.ms for calibration.
27-Oct-2026 10:40:13 2026-10-27 14:40:14        INFO        Calibrater::        Initializing nominal selection to the whole MS.
27-Oct-2026 10:40:13 2026-10-27 14:40:14        INFO        calibrater::setdata        Beginning selectvis--(MSSelection version)-------
27-Oct-2026 10:40:13 2026-10-27 14:40:14        INFO        calibrater::reset        Reseting solve/apply state
27-Oct-2026 10:40:13 2026-10-27 14:40:14        INFO        Calibrater::selectvis        Performing selection on MeasurementSet
27-Oct-2026 10:40:13 2026-10-27 14:40:14        INFO        Calibrater::selectvis+         Selecting on field: '0'
27-Oct-2026 10:40:13 2026-10-27 14:40:14        INFO        Calibrater::selectvis        By selection 328860 rows are reduced to 172260
27-Oct-2026 10:40:13 2026-10-27 14:40:14        INFO        Calibrater::selectvis        Frequency selection: Selecting all channels in all spws.
27-Oct-2026 10:40:13 2026-10-27 14:40:14        INFO        calibrater::setdata        chanmode=none nchan=1 start=0 step=1 mStart='0km/s' mStep='0km/s' msSelect=''
27-Oct-2026 10:40:13 2026-10-27 14:40:14        INFO        calibrater::setapply        Beginning setapply--(MSSelection version)-------
27-Oct-2026 10:40:13 2026-10-27 14:40:14        INFO        Calibrater::setapply(type, applypar)        Arranging to APPLY:
27-Oct-2026 10:40:13 2026-10-27 14:40:14        INFO        Calibrater::setapply(type, applypar)        .   G Jones: table=gaincaltest2.ms.G0 select= interp=linear spwmap=[-1] calWt=false
27-Oct-2026 10:40:13 2026-10-27 14:40:14        INFO        calibrater::correct        Beginning correct---------------------------
27-Oct-2026 10:40:13 2026-10-27 14:40:14        INFO        Calibrater::correct2 (VI2/VB2)        The following calibration terms are arranged for apply:
27-Oct-2026 10:40:13 2026-10-27 14:40:14        INFO        Calibrater::correct2 (VI2/VB2)        .   G Jones: table=gaincaltest2.ms.G0 select= interp=linear spwmap=[-1] calWt=false
27-Oct-2026 10:40:13 2026-10-27 14:40:14        SEVERE        Calibrater::correct2 (VI2/VB2)        Caught exception: Measures directory specified which does not contain the IERS data: /home/casatest/data/measures
27-Oct-2026 10:40:13 2026-10-27 14:40:14        INFO        Calibrater::correct2 (VI2/VB2)        Resetting all calibration application settings.
27-Oct-2026 10:40:13 2026-10-27 14:40:14        SEVERE                Exception Reported: Error in Calibrater::correct.
27-Oct-2026 10:40:13 2026-10-27 14:40:14        WARN        calibrater::setvi(bool,bool)        Already using NEW VisibilityIterator.
27-Oct-2026 10:40:13 test_tool_calibrater.py::calibrater_test::test_selectVisField
27-Oct-2026 10:40:13 Check that the field is properly selected by selectvis
27-Oct-2026 10:40:13 FAILED
27-Oct-2026 10:40:13
27-Oct-2026 10:40:13 2026-10-27 14:40:14        INFO        calibrater::open        ****Using NEW VI2-driven calibrater tool****
27-Oct-2026 10:40:13 2026-10-27 14:40:14        INFO        calibrater::open        Opening MS: gaincaltest2.ms for calibration.
27-Oct-2026 10:40:13 2026-10-27 14:40:14        INFO        Calibrater::        Initializing nominal selection to the whole MS.
27-Oct-2026 10:40:13 2026-10-27 14:40:14        INFO        calibrater::setdata        Beginning selectvis--(MSSelection version)-------
27-Oct-2026 10:40:13 2026-10-27 14:40:14        INFO        calibrater::reset        Reseting solve/apply state
27-Oct-2026 10:40:13 2026-10-27 14:40:14        INFO        Calibrater::selectvis        Performing selection on MeasurementSet
27-Oct-2026 10:40:13 2026-10-27 14:40:14        INFO        Calibrater::selectvis+         Selecting on intent: '*AMPLI*'
27-Oct-2026 10:40:13 2026-10-27 14:40:14        INFO        Calibrater::selectvis        Selection did not drop any rows
27-Oct-2026 10:40:13 2026-10-27 14:40:14        INFO        Calibrater::selectvis        Frequency selection: Selecting all channels in all spws.
27-Oct-2026 10:40:13 2026-10-27 14:40:14        INFO        calibrater::setdata        chanmode=none nchan=1 start=0 step=1 mStart='0km/s' mStep='0km/s' msSelect=''
27-Oct-2026 10:40:13 2026-10-27 14:40:14        INFO        calibrater::setapply        Beginning setapply--(MSSelection version)-------
27-Oct-2026 10:40:13 2026-10-27 14:40:14        INFO        Calibrater::setapply(type, applypar)        Arranging to APPLY:
27-Oct-2026 10:40:14 2026-10-27 14:40:14        INFO        Calibrater::setapply(type, applypar)        .   G Jones: table=gaincaltest2.ms.G0 select= interp=linear spwmap=[-1] calWt=false
27-Oct-2026 10:40:14 2026-10-27 14:40:14        INFO        calibrater::correct        Beginning correct---------------------------
27-Oct-2026 10:40:14 2026-10-27 14:40:14        INFO        Calibrater::correct2 (VI2/VB2)        The following calibration terms are arranged for apply:
27-Oct-2026 10:40:14 2026-10-27 14:40:14        INFO        Calibrater::correct2 (VI2/VB2)        .   G Jones: table=gaincaltest2.ms.G0 select= interp=linear spwmap=[-1] calWt=false
27-Oct-2026 10:40:14 2026-10-27 14:40:14        SEVERE        Calibrater::correct2 (VI2/VB2)        Caught exception: Measures directory specified which does not contain the IERS data: /home/casatest/data/measures
27-Oct-2026 10:40:14 2026-10-27 14:40:14        INFO        Calibrater::correct2 (VI2/VB2)        Resetting all calibration application settings.
27-Oct-2026 10:40:14 2026-10-27 14:40:14        SEVERE                Exception Reported: Error in Calibrater::correct.
27-Oct-2026 10:40:14 2026-10-27 14:40:14        WARN        calibrater::setvi(bool,bool)        Already using NEW VisibilityIterator.
27-Oct-2026 10:40:14 test_tool_calibrater.py::calibrater_test::test_selectVisIntent
27-Oct-2026 10:40:14 Check that the intent is properly selected by selectvis
27-Oct-2026 10:40:14 FAILED
27-Oct-2026 10:40:14
27-Oct-2026 10:40:14 2026-10-27 14:40:14        INFO        calibrater::open        ****Using NEW VI2-driven calibrater tool****
27-Oct-2026 10:40:14 2026-10-27 14:40:14        INFO        calibrater::open        Opening MS: gaincaltest2.ms for calibration.
27-Oct-2026 10:40:14 2026-10-27 14:40:14        INFO        Calibrater::        Initializing nominal selection to the whole MS.
27-Oct-2026 10:40:14 2026-10-27 14:40:14        INFO        calibrater::setdata        Beginning selectvis--(MSSelection version)-------
27-Oct-2026 10:40:14 2026-10-27 14:40:14        INFO        calibrater::reset        Reseting solve/apply state
27-Oct-2026 10:40:14 2026-10-27 14:40:14        INFO        Calibrater::selectvis        Performing selection on MeasurementSet
27-Oct-2026 10:40:14 2026-10-27 14:40:14        INFO        Calibrater::selectvis+         Selecting by observation IDs: '0'
27-Oct-2026 10:40:14 2026-10-27 14:40:14        INFO        Calibrater::selectvis        By selection 328860 rows are reduced to 318870
27-Oct-2026 10:40:14 2026-10-27 14:40:14        INFO        Calibrater::selectvis        Frequency selection: Selecting all channels in all spws.
27-Oct-2026 10:40:14 2026-10-27 14:40:14        INFO        calibrater::setdata        chanmode=none nchan=1 start=0 step=1 mStart='0km/s' mStep='0km/s' msSelect=''
27-Oct-2026 10:40:14 2026-10-27 14:40:14        INFO        calibrater::setapply        Beginning setapply--(MSSelection version)-------
27-Oct-2026 10:40:14 2026-10-27 14:40:14        INFO        Calibrater::setapply(type, applypar)        Arranging to APPLY:
27-Oct-2026 10:40:14 2026-10-27 14:40:14        INFO        Calibrater::setapply(type, applypar)        .   G Jones: table=gaincaltest2.ms.G0 select= interp=linear spwmap=[-1] calWt=false
27-Oct-2026 10:40:14 2026-10-27 14:40:14        INFO        calibrater::correct        Beginning correct---------------------------
27-Oct-2026 10:40:14 2026-10-27 14:40:14        INFO        Calibrater::correct2 (VI2/VB2)        The following calibration terms are arranged for apply:
27-Oct-2026 10:40:14 2026-10-27 14:40:14        INFO        Calibrater::correct2 (VI2/VB2)        .   G Jones: table=gaincaltest2.ms.G0 select= interp=linear spwmap=[-1] calWt=false
27-Oct-2026 10:40:14 2026-10-27 14:40:14        SEVERE        Calibrater::correct2 (VI2/VB2)        Caught exception: Measures directory specified which does not contain the IERS data: /home/casatest/data/measures
27-Oct-2026 10:40:14 2026-10-27 14:40:14        INFO        Calibrater::correct2 (VI2/VB2)        Resetting all calibration application settings.
27-Oct-2026 10:40:14 2026-10-27 14:40:14        SEVERE                Exception Reported: Error in Calibrater::correct.
27-Oct-2026 10:40:14 2026-10-27 14:40:14        WARN        calibrater::setvi(bool,bool)        Already using NEW VisibilityIterator.
27-Oct-2026 10:40:14 test_tool_calibrater.py::calibrater_test::test_selectVisObs
27-Oct-2026 10:40:14 FAILED
27-Oct-2026 10:40:14
27-Oct-2026 10:40:14 2026-10-27 14:40:15        INFO        calibrater::open        ****Using NEW VI2-driven calibrater tool****
27-Oct-2026 10:40:14 2026-10-27 14:40:15        INFO        calibrater::open        Opening MS: gaincaltest2.ms for calibration.
27-Oct-2026 10:40:14 2026-10-27 14:40:15        INFO        Calibrater::        Initializing nominal selection to the whole MS.
27-Oct-2026 10:40:14 2026-10-27 14:40:15        INFO        calibrater::setdata        Beginning selectvis--(MSSelection version)-------
27-Oct-2026 10:40:14 2026-10-27 14:40:15        INFO        calibrater::reset        Reseting solve/apply state
27-Oct-2026 10:40:14 2026-10-27 14:40:15        INFO        Calibrater::selectvis        Performing selection on MeasurementSet
27-Oct-2026 10:40:14 2026-10-27 14:40:15        INFO        Calibrater::selectvis+         Selecting on scan: '2'
27-Oct-2026 10:40:14 2026-10-27 14:40:15        INFO        Calibrater::selectvis        By selection 328860 rows are reduced to 15660
27-Oct-2026 10:40:14 2026-10-27 14:40:15        INFO        Calibrater::selectvis        Frequency selection: Selecting all channels in all spws.
27-Oct-2026 10:40:14 2026-10-27 14:40:15        INFO        calibrater::setdata        chanmode=none nchan=1 start=0 step=1 mStart='0km/s' mStep='0km/s' msSelect=''
27-Oct-2026 10:40:14 2026-10-27 14:40:15        INFO        calibrater::setapply        Beginning setapply--(MSSelection version)-------
27-Oct-2026 10:40:14 2026-10-27 14:40:15        INFO        Calibrater::setapply(type, applypar)        Arranging to APPLY:
27-Oct-2026 10:40:14 2026-10-27 14:40:15        INFO        Calibrater::setapply(type, applypar)        .   G Jones: table=gaincaltest2.ms.G0 select= interp=linear spwmap=[-1] calWt=false
27-Oct-2026 10:40:14 2026-10-27 14:40:15        INFO        calibrater::correct        Beginning correct---------------------------
27-Oct-2026 10:40:14 2026-10-27 14:40:15        INFO        Calibrater::correct2 (VI2/VB2)        The following calibration terms are arranged for apply:
27-Oct-2026 10:40:14 2026-10-27 14:40:15        INFO        Calibrater::correct2 (VI2/VB2)        .   G Jones: table=gaincaltest2.ms.G0 select= interp=linear spwmap=[-1] calWt=false
27-Oct-2026 10:40:14 2026-10-27 14:40:15        SEVERE        Calibrater::correct2 (VI2/VB2)        Caught exception: Measures directory specified which does not contain the IERS data: /home/casatest/data/measures
27-Oct-2026 10:40:14 2026-10-27 14:40:15        INFO        Calibrater::correct2 (VI2/VB2)        Resetting all calibration application settings.
27-Oct-2026 10:40:14 2026-10-27 14:40:15        SEVERE                Exception Reported: Error in Calibrater::correct.
27-Oct-2026 10:40:14 2026-10-27 14:40:15        WARN        calibrater::setvi(bool,bool)        Already using NEW VisibilityIterator.
27-Oct-2026 10:40:14 test_tool_calibrater.py::calibrater_test::test_selectVisScan
27-Oct-2026 10:40:14 Check tht the scan is properly selected by selectvis
27-Oct-2026 10:40:14 FAILED
27-Oct-2026 10:40:14
27-Oct-2026 10:40:15 2026-10-27 14:40:15        INFO        calibrater::open        ****Using NEW VI2-driven calibrater tool****
27-Oct-2026 10:40:15 2026-10-27 14:40:15        INFO        calibrater::open        Opening MS: gaincaltest2.ms for calibration.
27-Oct-2026 10:40:15 2026-10-27 14:40:15        INFO        Calibrater::        Initializing nominal selection to the whole MS.
27-Oct-2026 10:40:15 2026-10-27 14:40:15        INFO        calibrater::setdata        Beginning selectvis--(MSSelection version)-------
27-Oct-2026 10:40:15 2026-10-27 14:40:15        INFO        calibrater::reset        Reseting solve/apply state
27-Oct-2026 10:40:15 2026-10-27 14:40:15        INFO        Calibrater::selectvis        Performing selection on MeasurementSet
27-Oct-2026 10:40:15 2026-10-27 14:40:15        INFO        Calibrater::selectvis+         Selecting on spw: '0'
27-Oct-2026 10:40:15 2026-10-27 14:40:15        INFO        Calibrater::selectvis        By selection 328860 rows are reduced to 82215
27-Oct-2026 10:40:15 2026-10-27 14:40:15        INFO        Calibrater::selectvis        Frequency selection:
27-Oct-2026 10:40:15 2026-10-27 14:40:15        INFO        Calibrater::selectvis        .  Spw 0:0~7 (8 channels, step by 1)
27-Oct-2026 10:40:15 2026-10-27 14:40:15        INFO        calibrater::setdata        chanmode=none nchan=1 start=0 step=1 mStart='0km/s' mStep='0km/s' msSelect=''
27-Oct-2026 10:40:15 2026-10-27 14:40:15        INFO        calibrater::setapply        Beginning setapply--(MSSelection version)-------
27-Oct-2026 10:40:15 2026-10-27 14:40:15        INFO        Calibrater::setapply(type, applypar)        Arranging to APPLY:
27-Oct-2026 10:40:15 2026-10-27 14:40:15        INFO        Calibrater::setapply(type, applypar)        .   G Jones: table=gaincaltest2.ms.G0 select= interp=linear spwmap=[-1] calWt=false
27-Oct-2026 10:40:15 2026-10-27 14:40:15        INFO        calibrater::correct        Beginning correct---------------------------
27-Oct-2026 10:40:15 2026-10-27 14:40:15        INFO        Calibrater::correct2 (VI2/VB2)        The following calibration terms are arranged for apply:
27-Oct-2026 10:40:15 2026-10-27 14:40:15        INFO        Calibrater::correct2 (VI2/VB2)        .   G Jones: table=gaincaltest2.ms.G0 select= interp=linear spwmap=[-1] calWt=false
27-Oct-2026 10:40:15 2026-10-27 14:40:15        SEVERE        Calibrater::correct2 (VI2/VB2)        Caught exception: Measures directory specified which does not contain the IERS data: /home/casatest/data/measures
27-Oct-2026 10:40:15 2026-10-27 14:40:15        INFO        Calibrater::correct2 (VI2/VB2)        Resetting all calibration application settings.
27-Oct-2026 10:40:15 2026-10-27 14:40:15        SEVERE                Exception Reported: Error in Calibrater::correct.
27-Oct-2026 10:40:15 2026-10-27 14:40:15        WARN        calibrater::setvi(bool,bool)        Already using NEW VisibilityIterator.
27-Oct-2026 10:40:15 test_tool_calibrater.py::calibrater_test::test_selectVisSpw
27-Oct-2026 10:40:15 Check that spw is properly selected by selectvis
27-Oct-2026 10:40:15 FAILED
27-Oct-2026 10:40:15
27-Oct-2026 10:40:15 2026-10-27 14:40:15        INFO        calibrater::open        ****Using NEW VI2-driven calibrater tool****
27-Oct-2026 10:40:15 2026-10-27 14:40:15        INFO        calibrater::open        Opening MS: gaincaltest2.ms for calibration.
27-Oct-2026 10:40:15 2026-10-27 14:40:15        INFO        Calibrater::        Initializing nominal selection to the whole MS.
27-Oct-2026 10:40:15 2026-10-27 14:40:15        INFO        calibrater::setdata        Beginning selectvis--(MSSelection version)-------
27-Oct-2026 10:40:15 2026-10-27 14:40:15        INFO        calibrater::reset        Reseting solve/apply state
27-Oct-2026 10:40:15 2026-10-27 14:40:15        INFO        Calibrater::selectvis        Performing selection on MeasurementSet
27-Oct-2026 10:40:15 2026-10-27 14:40:15        INFO        Calibrater::selectvis+         Selecting on time: '>04:38:23'
27-Oct-2026 10:40:15 2026-10-27 14:40:15        INFO        Calibrater::selectvis        By selection 328860 rows are reduced to 313200
27-Oct-2026 10:40:15 2026-10-27 14:40:15        INFO        Calibrater::selectvis        Frequency selection: Selecting all channels in all spws.
27-Oct-2026 10:40:15 2026-10-27 14:40:15        INFO        calibrater::setdata        chanmode=none nchan=1 start=0 step=1 mStart='0km/s' mStep='0km/s' msSelect=''
27-Oct-2026 10:40:15 2026-10-27 14:40:15        INFO        calibrater::setapply        Beginning setapply--(MSSelection version)-------
27-Oct-2026 10:40:15 2026-10-27 14:40:15        INFO        Calibrater::setapply(type, applypar)        Arranging to APPLY:
27-Oct-2026 10:40:15 2026-10-27 14:40:15        INFO        Calibrater::setapply(type, applypar)        .   G Jones: table=gaincaltest2.ms.G0 select= interp=linear spwmap=[-1] calWt=false
27-Oct-2026 10:40:15 2026-10-27 14:40:15        INFO        calibrater::correct        Beginning correct---------------------------
27-Oct-2026 10:40:15 2026-10-27 14:40:15        INFO        Calibrater::correct2 (VI2/VB2)        The following calibration terms are arranged for apply:
27-Oct-2026 10:40:15 2026-10-27 14:40:15        INFO        Calibrater::correct2 (VI2/VB2)        .   G Jones: table=gaincaltest2.ms.G0 select= interp=linear spwmap=[-1] calWt=false
27-Oct-2026 10:40:15 2026-10-27 14:40:15        SEVERE        Calibrater::correct2 (VI2/VB2)        Caught exception: Measures directory specified which does not contain the IERS data: /home/casatest/data/measures
27-Oct-2026 10:40:15 2026-10-27 14:40:15        INFO        Calibrater::correct2 (VI2/VB2)        Resetting all calibration application settings.
27-Oct-2026 10:40:15 2026-10-27 14:40:15        SEVERE                Exception Reported: Error in Calibrater::correct.
27-Oct-2026 10:40:15 2026-10-27 14:40:15        WARN        calibrater::setvi(bool,bool)        Already using NEW VisibilityIterator.
27-Oct-2026 10:40:15 test_tool_calibrater.py::calibrater_test::test_selectVisTime
27-Oct-2026 10:40:15 Check that time is properly selected by selectvis
27-Oct-2026 10:40:15 FAILED
27-Oct-2026 10:40:15
27-Oct-2026 10:40:15 2026-10-27 14:40:16        INFO        calibrater::open        ****Using NEW VI2-driven calibrater tool****
27-Oct-2026 10:40:15 2026-10-27 14:40:16        INFO        calibrater::open        Opening MS: gaincaltest2.ms for calibration.
27-Oct-2026 10:40:15 2026-10-27 14:40:16        INFO        Calibrater::        Initializing nominal selection to the whole MS.
27-Oct-2026 10:40:15 2026-10-27 14:40:16        INFO        calibrater::setdata        Beginning selectvis--(MSSelection version)-------
27-Oct-2026 10:40:15 2026-10-27 14:40:16        INFO        calibrater::reset        Reseting solve/apply state
27-Oct-2026 10:40:15 2026-10-27 14:40:16        INFO        Calibrater::selectvis        Performing selection on MeasurementSet
27-Oct-2026 10:40:15 2026-10-27 14:40:16        INFO        Calibrater::selectvis+         Selecting on uvrange: '> 500000lambda'
27-Oct-2026 10:40:15 2026-10-27 14:40:16        INFO        Calibrater::selectvis        By selection 328860 rows are reduced to 103321
27-Oct-2026 10:40:15 2026-10-27 14:40:16        INFO        Calibrater::selectvis        Frequency selection: Selecting all channels in all spws.
27-Oct-2026 10:40:15 2026-10-27 14:40:16        INFO        calibrater::setdata        chanmode=none nchan=1 start=0 step=1 mStart='0km/s' mStep='0km/s' msSelect=''
27-Oct-2026 10:40:15 2026-10-27 14:40:16        INFO        calibrater::setapply        Beginning setapply--(MSSelection version)-------
27-Oct-2026 10:40:15 2026-10-27 14:40:16        INFO        Calibrater::setapply(type, applypar)        Arranging to APPLY:
27-Oct-2026 10:40:15 2026-10-27 14:40:16        INFO        Calibrater::setapply(type, applypar)        .   G Jones: table=gaincaltest2.ms.G0 select= interp=linear spwmap=[-1] calWt=false
27-Oct-2026 10:40:15 2026-10-27 14:40:16        INFO        calibrater::correct        Beginning correct---------------------------
27-Oct-2026 10:40:15 2026-10-27 14:40:16        INFO        Calibrater::correct2 (VI2/VB2)        The following calibration terms are arranged for apply:
27-Oct-2026 10:40:15 2026-10-27 14:40:16        INFO        Calibrater::correct2 (VI2/VB2)        .   G Jones: table=gaincaltest2.ms.G0 select= interp=linear spwmap=[-1] calWt=false
27-Oct-2026 10:40:16 2026-10-27 14:40:16        SEVERE        Calibrater::correct2 (VI2/VB2)        Caught exception: Measures directory specified which does not contain the IERS data: /home/casatest/data/measures
27-Oct-2026 10:40:16 2026-10-27 14:40:16        INFO        Calibrater::correct2 (VI2/VB2)        Resetting all calibration application settings.
27-Oct-2026 10:40:16 2026-10-27 14:40:16        SEVERE                Exception Reported: Error in Calibrater::correct.
27-Oct-2026 10:40:16 2026-10-27 14:40:16        WARN        calibrater::setvi(bool,bool)        Already using NEW VisibilityIterator.
27-Oct-2026 10:40:16 test_tool_calibrater.py::calibrater_test::test_selectVisUVrange
27-Oct-2026 10:40:16 Check that selectvis properly selects for uvrange
27-Oct-2026 10:40:16 FAILED
27-Oct-2026 10:40:16
27-Oct-2026 10:40:16 2026-10-27 14:40:16        INFO        calibrater::open        ****Using NEW VI2-driven calibrater tool****
27-Oct-2026 10:40:16 2026-10-27 14:40:16        INFO        calibrater::open        Opening MS: gaincaltest2.ms for calibration.
27-Oct-2026 10:40:16 2026-10-27 14:40:16        INFO        Calibrater::        Initializing nominal selection to the whole MS.
27-Oct-2026 10:40:16 2026-10-27 14:40:16        INFO        calibrater::parsecallibfile        Beginning parsecallibfile-)-------
27-Oct-2026 10:40:16 2026-10-27 14:40:16        INFO        calibrater::setcallib        Beginning setcallib---------
27-Oct-2026 10:40:16 2026-10-27 14:40:16        INFO        Calibrater::setcallib2(callib)        Arranging to APPLY:
27-Oct-2026 10:40:16 2026-10-27 14:40:16        INFO                .   G Jones: table=gaincaltest2.ms.G0 (by cal library) calWt=true
27-Oct-2026 10:40:16 2026-10-27 14:40:16        INFO                .   0:
27-Oct-2026 10:40:16 2026-10-27 14:40:16        INFO        +             MS: obs= scan= fld= intent= spw=
27-Oct-2026 10:40:16 2026-10-27 14:40:16        INFO        +             CT: tinterp=linear finterp=
27-Oct-2026 10:40:16 2026-10-27 14:40:16        INFO        +                 obsmap=[]         scanmap=[]         fldmap=[]
27-Oct-2026 10:40:16 2026-10-27 14:40:16        INFO        +                 spwmap=[]         antmap=[]
27-Oct-2026 10:40:16 2026-10-27 14:40:16        INFO        calibrater::corrupt        Beginning corrupt---------------------------
27-Oct-2026 10:40:16 2026-10-27 14:40:16        INFO        Calibrater::corrupt2 (VI2/VB2)        The following calibration terms are arranged for apply:
27-Oct-2026 10:40:16 2026-10-27 14:40:16        INFO        Calibrater::corrupt2 (VI2/VB2)        .   G Jones: table=gaincaltest2.ms.G0 (by cal library) calWt=true
27-Oct-2026 10:40:16 2026-10-27 14:40:16        SEVERE        Calibrater::corrupt2 (VI2/VB2)        Caught exception: Measures directory specified which does not contain the IERS data: /home/casatest/data/measures
27-Oct-2026 10:40:16 2026-10-27 14:40:16        INFO        Calibrater::corrupt2 (VI2/VB2)        Resetting all calibration application settings.
27-Oct-2026 10:40:16 2026-10-27 14:40:16        SEVERE                Exception Reported: Error in Calibrater::corrupt2.
27-Oct-2026 10:40:16 2026-10-27 14:40:16        WARN        calibrater::setvi(bool,bool)        Already using NEW VisibilityIterator.
27-Oct-2026 10:40:16 test_tool_calibrater.py::calibrater_test::test_setCalLib
27-Oct-2026 10:40:16 Check that a provided cal table can be used to corrupt the MODEL_DATA 
27-Oct-2026 10:40:16 FAILED
27-Oct-2026 10:40:16
27-Oct-2026 10:40:16 2026-10-27 14:40:16        INFO        calibrater::open        ****Using NEW VI2-driven calibrater tool****
27-Oct-2026 10:40:16 2026-10-27 14:40:16        INFO        calibrater::open        Opening MS: gaincaltest2.ms for calibration.
27-Oct-2026 10:40:16 2026-10-27 14:40:16        INFO        Calibrater::        Initializing nominal selection to the whole MS.
27-Oct-2026 10:40:16 2026-10-27 14:40:16        INFO        Calibrater::setCorrDepFlags        Setting correlation dependent flags = True
27-Oct-2026 10:40:16 2026-10-27 14:40:16        WARN        calibrater::setvi(bool,bool)        Already using NEW VisibilityIterator.
27-Oct-2026 10:40:16 test_tool_calibrater.py::calibrater_test::test_setCorrDepFlags
27-Oct-2026 10:40:16 Check that corrdepflags will be checked 
27-Oct-2026 10:40:16 PASSED
27-Oct-2026 10:40:16
27-Oct-2026 10:40:16 2026-10-27 14:40:17        INFO        calibrater::open        ****Using NEW VI2-driven calibrater tool****
27-Oct-2026 10:40:16 2026-10-27 14:40:17        INFO        calibrater::open        Opening MS: ngc5921.ms for calibration.
27-Oct-2026 10:40:16 2026-10-27 14:40:17        INFO                Clearing all model records in MS header.
27-Oct-2026 10:40:16 2026-10-27 14:40:17        INFO        VisSetUtil::addScrCols        Adding MODEL_DATA and CORRECTED_DATA column(s).
27-Oct-2026 10:40:16 2026-10-27 14:40:17        SEVERE        Calibrater::initialize (file /source/casa6/casatools/src/code/synthesis/MeasurementComponents/Calibrater.cc, line 433)        Caught exception: Measures directory specified which does not contain the IERS data: /home/casatest/data/measures
27-Oct-2026 10:40:16 2026-10-27 14:40:17        SEVERE                Exception Reported: Error in Calibrater::initialize()
27-Oct-2026 10:40:16 2026-10-27 14:40:17        WARN        calibrater::setvi(bool,bool)        Already using NEW VisibilityIterator.
27-Oct-2026 10:40:16 test_tool_calibrater.py::calibrater_test::test_smoothedCalTables
27-Oct-2026 10:40:16 Check that the smooth command creates a smoothed cal table 
27-Oct-2026 10:40:16 FAILED
27-Oct-2026 10:40:16
27-Oct-2026 10:40:16 2026-10-27 14:40:17        WARN        calibrater::setvi(bool,bool)        Forcing use of OLD VisibilityIterator.
27-Oct-2026 10:40:16 2026-10-27 14:40:17        INFO        calibrater::open        ****Using OLD VI-driven calibrater tool****
27-Oct-2026 10:40:16 2026-10-27 14:40:17        INFO        calibrater::open        Opening MS: ngc5921.ms for calibration.
27-Oct-2026 10:40:16 2026-10-27 14:40:17        INFO        Calibrater::        Initializing nominal selection to the whole MS.
27-Oct-2026 10:40:16 2026-10-27 14:40:17        SEVERE        Calibrater::initialize (file /source/casa6/casatools/src/code/synthesis/MeasurementComponents/Calibrater.cc, line 5881)        Caught exception: Measures directory specified which does not contain the IERS data: /home/casatest/data/measures
27-Oct-2026 10:40:16 2026-10-27 14:40:17        SEVERE                Exception Reported: Error in Calibrater::initialize()
27-Oct-2026 10:40:16 2026-10-27 14:40:17        WARN        calibrater::setvi(bool,bool)        Forcing use of NEW VisibilityIterator.
27-Oct-2026 10:40:16 test_tool_calibrater.py::calibrater_test::test_solveBandpass
27-Oct-2026 10:40:16 Check that solve band poly creates the output table
27-Oct-2026 10:40:16 FAILED
27-Oct-2026 10:40:16
27-Oct-2026 10:40:16 2026-10-27 14:40:17        WARN        calibrater::setvi(bool,bool)        Forcing use of OLD VisibilityIterator.
27-Oct-2026 10:40:16 2026-10-27 14:40:17        INFO        calibrater::open        ****Using OLD VI-driven calibrater tool****
27-Oct-2026 10:40:16 2026-10-27 14:40:17        INFO        calibrater::open        Opening MS: ngc5921.ms for calibration.
27-Oct-2026 10:40:16 2026-10-27 14:40:17        INFO        Calibrater::        Initializing nominal selection to the whole MS.
27-Oct-2026 10:40:16 2026-10-27 14:40:17        SEVERE        Calibrater::initialize (file /source/casa6/casatools/src/code/synthesis/MeasurementComponents/Calibrater.cc, line 5881)        Caught exception: Measures directory specified which does not contain the IERS data: /home/casatest/data/measures
27-Oct-2026 10:40:16 2026-10-27 14:40:17        SEVERE                Exception Reported: Error in Calibrater::initialize()
27-Oct-2026 10:40:16 2026-10-27 14:40:17        WARN        calibrater::setvi(bool,bool)        Forcing use of NEW VisibilityIterator.
27-Oct-2026 10:40:16 test_tool_calibrater.py::calibrater_test::test_solveGainspline
27-Oct-2026 10:40:16 Check that solve gain spline creates the output table 
27-Oct-2026 10:40:16 FAILED
27-Oct-2026 10:40:16
27-Oct-2026 10:40:17 2026-10-27 14:40:17        INFO        calibrater::open        ****Using NEW VI2-driven calibrater tool****
27-Oct-2026 10:40:17 2026-10-27 14:40:17        INFO        calibrater::open        Opening MS: gaincaltest2.ms for calibration.
27-Oct-2026 10:40:17 2026-10-27 14:40:17        INFO        Calibrater::        Initializing nominal selection to the whole MS.
27-Oct-2026 10:40:17 2026-10-27 14:40:17        INFO        calibrater::specifycal        Beginning specifycal-----------------------
27-Oct-2026 10:40:17 2026-10-27 14:40:17        INFO                Creating G Jones table from specified parameters.
27-Oct-2026 10:40:17 2026-10-27 14:40:17        INFO                Generating 'G' corrections.
27-Oct-2026 10:40:17 2026-10-27 14:40:17        INFO                Specified parameter(s) (per spw and pol) repeated on all antennas.
27-Oct-2026 10:40:17 2026-10-27 14:40:17        INFO                Specified parameter(s) (per spw and antenna) repeated on all polarizations.
27-Oct-2026 10:40:17 2026-10-27 14:40:17        INFO                spwId=1 antId=<all> polId=<all> parameter= 3   (ip0,ip1 = [0, 0, 0],[1, 0, 9])
27-Oct-2026 10:40:17 2026-10-27 14:40:17        INFO                Writing solutions to table: testcalout.cal
27-Oct-2026 10:40:17 2026-10-27 14:40:17        WARN        calibrater::setvi(bool,bool)        Already using NEW VisibilityIterator.
27-Oct-2026 10:40:17 test_tool_calibrater.py::calibrater_test::test_specifyCal
27-Oct-2026 10:40:17 Check that specifycal can set values for specific spws and antennas
27-Oct-2026 10:40:17 PASSED
27-Oct-2026 10:40:17
27-Oct-2026 10:40:17 2026-10-27 14:40:17        WARN        calibrater::setvi(bool,bool)        Forcing use of OLD VisibilityIterator.
27-Oct-2026 10:40:17 2026-10-27 14:40:17        INFO        calibrater::open        ****Using OLD VI-driven calibrater tool****
27-Oct-2026 10:40:17 2026-10-27 14:40:17        INFO        calibrater::open        Opening MS: gaincaltest2.ms for calibration.
27-Oct-2026 10:40:17 2026-10-27 14:40:17        INFO        Calibrater::        Initializing nominal selection to the whole MS.
27-Oct-2026 10:40:17 2026-10-27 14:40:17        SEVERE        Calibrater::initialize (file /source/casa6/casatools/src/code/synthesis/MeasurementComponents/Calibrater.cc, line 5881)        Caught exception: Measures directory specified which does not contain the IERS data: /home/casatest/data/measures
27-Oct-2026 10:40:17 2026-10-27 14:40:17        SEVERE                Exception Reported: Error in Calibrater::initialize()
27-Oct-2026 10:40:17 2026-10-27 14:40:17        WARN        calibrater::setvi(bool,bool)        Forcing use of NEW VisibilityIterator.
27-Oct-2026 10:40:17 test_tool_calibrater.py::calibrater_test::test_standardPath
27-Oct-2026 10:40:17 open setapply setsolve state solve close 
27-Oct-2026 10:40:17 FAILED
27-Oct-2026 10:40:17
27-Oct-2026 10:40:17 2026-10-27 14:40:17        INFO        calibrater::open        ****Using NEW VI2-driven calibrater tool****
27-Oct-2026 10:40:17 2026-10-27 14:40:17        INFO        calibrater::open        Opening MS: gaincaltest2.ms for calibration.
27-Oct-2026 10:40:17 2026-10-27 14:40:17        INFO        Calibrater::        Initializing nominal selection to the whole MS.
27-Oct-2026 10:40:17 2026-10-27 14:40:17        INFO        name::        No table opened.
27-Oct-2026 10:40:17 2026-10-27 14:40:17        INFO        showcache::        The Table Cache has the following 30 entries:
27-Oct-2026 10:40:17 2026-10-27 14:40:17        INFO        showcache::            0: "/home/casatest/casa6/casatestutils/nosedir/test_tool_calibrater/gaincaltest2.ms"
27-Oct-2026 10:40:17 2026-10-27 14:40:17        INFO        showcache::            1: "/home/casatest/casa6/casatestutils/nosedir/test_tool_calibrater/gaincaltest2.ms/ANTENNA"
27-Oct-2026 10:40:17 2026-10-27 14:40:17        INFO        showcache::            2: "/home/casatest/casa6/casatestutils/nosedir/test_tool_calibrater/gaincaltest2.ms/DATA_DESCRIPTION"
27-Oct-2026 10:40:17 2026-10-27 14:40:17        INFO        showcache::            3: "/home/casatest/casa6/casatestutils/nosedir/test_tool_calibrater/gaincaltest2.ms/FEED"
27-Oct-2026 10:40:17 2026-10-27 14:40:17        INFO        showcache::            4: "/home/casatest/casa6/casatestutils/nosedir/test_tool_calibrater/gaincaltest2.ms/FIELD"
27-Oct-2026 10:40:17 2026-10-27 14:40:17        INFO        showcache::            5: "/home/casatest/casa6/casatestutils/nosedir/test_tool_calibrater/gaincaltest2.ms/FLAG_CMD"
27-Oct-2026 10:40:17 2026-10-27 14:40:17        INFO        showcache::            6: "/home/casatest/casa6/casatestutils/nosedir/test_tool_calibrater/gaincaltest2.ms/HISTORY"
27-Oct-2026 10:40:17 2026-10-27 14:40:17        INFO        showcache::            7: "/home/casatest/casa6/casatestutils/nosedir/test_tool_calibrater/gaincaltest2.ms/OBSERVATION"
27-Oct-2026 10:40:17 2026-10-27 14:40:17        INFO        showcache::            8: "/home/casatest/casa6/casatestutils/nosedir/test_tool_calibrater/gaincaltest2.ms/POINTING"
27-Oct-2026 10:40:17 2026-10-27 14:40:17        INFO        showcache::            9: "/home/casatest/casa6/casatestutils/nosedir/test_tool_calibrater/gaincaltest2.ms/POLARIZATION"
27-Oct-2026 10:40:17 2026-10-27 14:40:17        INFO        showcache::            10: "/home/casatest/casa6/casatestutils/nosedir/test_tool_calibrater/gaincaltest2.ms/PROCESSOR"
27-Oct-2026 10:40:17 2026-10-27 14:40:17        INFO        showcache::            11: "/home/casatest/casa6/casatestutils/nosedir/test_tool_calibrater/gaincaltest2.ms/SOURCE"
27-Oct-2026 10:40:17 2026-10-27 14:40:17        INFO        showcache::            12: "/home/casatest/casa6/casatestutils/nosedir/test_tool_calibrater/gaincaltest2.ms/SPECTRAL_WINDOW"
27-Oct-2026 10:40:17 2026-10-27 14:40:17        INFO        showcache::            13: "/home/casatest/casa6/casatestutils/nosedir/test_tool_calibrater/gaincaltest2.ms/STATE"
27-Oct-2026 10:40:17 2026-10-27 14:40:17        INFO        showcache::            14: "/home/casatest/casa6/casatestutils/nosedir/test_tool_calibrater/gaincaltest2.ms/SYSCAL"
27-Oct-2026 10:40:17 2026-10-27 14:40:17        INFO        showcache::            15: "/home/casatest/casa6/casatestutils/nosedir/test_tool_calibrater/gaincaltest2.ms/WEATHER"
27-Oct-2026 10:40:17 2026-10-27 14:40:17        INFO        showcache::            16: "/home/casatest/casa6/casatestutils/nosedir/test_tool_calibrater/ngc5921.ms"
27-Oct-2026 10:40:17 2026-10-27 14:40:17        INFO        showcache::            17: "/home/casatest/casa6/casatestutils/nosedir/test_tool_calibrater/ngc5921.ms/ANTENNA"
27-Oct-2026 10:40:17 2026-10-27 14:40:17        INFO        showcache::            18: "/home/casatest/casa6/casatestutils/nosedir/test_tool_calibrater/ngc5921.ms/DATA_DESCRIPTION"
27-Oct-2026 10:40:17 2026-10-27 14:40:17        INFO        showcache::            19: "/home/casatest/casa6/casatestutils/nosedir/test_tool_calibrater/ngc5921.ms/FEED"
27-Oct-2026 10:40:17 2026-10-27 14:40:17        INFO        showcache::            20: "/home/casatest/casa6/casatestutils/nosedir/test_tool_calibrater/ngc5921.ms/FIELD"
27-Oct-2026 10:40:17 2026-10-27 14:40:17        INFO        showcache::            21: "/home/casatest/casa6/casatestutils/nosedir/test_tool_calibrater/ngc5921.ms/FLAG_CMD"
27-Oct-2026 10:40:17 2026-10-27 14:40:17        INFO        showcache::            22: "/home/casatest/casa6/casatestutils/nosedir/test_tool_calibrater/ngc5921.ms/HISTORY"
27-Oct-2026 10:40:17 2026-10-27 14:40:17        INFO        showcache::            23: "/home/casatest/casa6/casatestutils/nosedir/test_tool_calibrater/ngc5921.ms/OBSERVATION"
27-Oct-2026 10:40:17 2026-10-27 14:40:17        INFO        showcache::            24: "/home/casatest/casa6/casatestutils/nosedir/test_tool_calibrater/ngc5921.ms/POINTING"
27-Oct-2026 10:40:17 2026-10-27 14:40:17        INFO        showcache::            25: "/home/casatest/casa6/casatestutils/nosedir/test_tool_calibrater/ngc5921.ms/POLARIZATION"
27-Oct-2026 10:40:17 2026-10-27 14:40:17        INFO        showcache::            26: "/home/casatest/casa6/casatestutils/nosedir/test_tool_calibrater/ngc5921.ms/PROCESSOR"
27-Oct-2026 10:40:17 2026-10-27 14:40:17        INFO        showcache::            27: "/home/casatest/casa6/casatestutils/nosedir/test_tool_calibrater/ngc5921.ms/SOURCE"
27-Oct-2026 10:40:17 2026-10-27 14:40:17        INFO        showcache::            28: "/home/casatest/casa6/casatestutils/nosedir/test_tool_calibrater/ngc5921.ms/SPECTRAL_WINDOW"
27-Oct-2026 10:40:17 2026-10-27 14:40:17        INFO        showcache::            29: "/home/casatest/casa6/casatestutils/nosedir/test_tool_calibrater/ngc5921.ms/STATE"
27-Oct-2026 10:40:17 2026-10-27 14:40:17        INFO        name::        No table opened.
27-Oct-2026 10:40:17 2026-10-27 14:40:17        INFO        showcache::        The Table Cache has the following 30 entries:
27-Oct-2026 10:40:17 2026-10-27 14:40:17        INFO        showcache::            0: "/home/casatest/casa6/casatestutils/nosedir/test_tool_calibrater/gaincaltest2.ms"
27-Oct-2026 10:40:17 2026-10-27 14:40:17        INFO        showcache::            1: "/home/casatest/casa6/casatestutils/nosedir/test_tool_calibrater/gaincaltest2.ms/ANTENNA"
27-Oct-2026 10:40:17 2026-10-27 14:40:17        INFO        showcache::            2: "/home/casatest/casa6/casatestutils/nosedir/test_tool_calibrater/gaincaltest2.ms/DATA_DESCRIPTION"
27-Oct-2026 10:40:17 2026-10-27 14:40:17        INFO        showcache::            3: "/home/casatest/casa6/casatestutils/nosedir/test_tool_calibrater/gaincaltest2.ms/FEED"
27-Oct-2026 10:40:17 2026-10-27 14:40:17        INFO        showcache::            4: "/home/casatest/casa6/casatestutils/nosedir/test_tool_calibrater/gaincaltest2.ms/FIELD"
27-Oct-2026 10:40:17 2026-10-27 14:40:17        INFO        showcache::            5: "/home/casatest/casa6/casatestutils/nosedir/test_tool_calibrater/gaincaltest2.ms/FLAG_CMD"
27-Oct-2026 10:40:17 2026-10-27 14:40:17        INFO        showcache::            6: "/home/casatest/casa6/casatestutils/nosedir/test_tool_calibrater/gaincaltest2.ms/HISTORY"
27-Oct-2026 10:40:17 2026-10-27 14:40:17        INFO        showcache::            7: "/home/casatest/casa6/casatestutils/nosedir/test_tool_calibrater/gaincaltest2.ms/OBSERVATION"
27-Oct-2026 10:40:17 2026-10-27 14:40:17        INFO        showcache::            8: "/home/casatest/casa6/casatestutils/nosedir/test_tool_calibrater/gaincaltest2.ms/POINTING"
27-Oct-2026 10:40:17 2026-10-27 14:40:17        INFO        showcache::            9: "/home/casatest/casa6/casatestutils/nosedir/test_tool_calibrater/gaincaltest2.ms/POLARIZATION"
27-Oct-2026 10:40:17 2026-10-27 14:40:17        INFO        showcache::            10: "/home/casatest/casa6/casatestutils/nosedir/test_tool_calibrater/gaincaltest2.ms/PROCESSOR"
27-Oct-2026 10:40:17 2026-10-27 14:40:17        INFO        showcache::            11: "/home/casatest/casa6/casatestutils/nosedir/test_tool_calibrater/gaincaltest2.ms/SOURCE"
27-Oct-2026 10:40:17 2026-10-27 14:40:17        INFO        showcache::            12: "/home/casatest/casa6/casatestutils/nosedir/test_tool_calibrater/gaincaltest2.ms/SPECTRAL_WINDOW"
27-Oct-2026 10:40:17 2026-10-27 14:40:17        INFO        showcache::            13: "/home/casatest/casa6/casatestutils/nosedir/test_tool_calibrater/gaincaltest2.ms/STATE"
27-Oct-2026 10:40:17 2026-10-27 14:40:17        INFO        showcache::            14: "/home/casatest/casa6/casatestutils/nosedir/test_tool_calibrater/gaincaltest2.ms/SYSCAL"
27-Oct-2026 10:40:17 2026-10-27 14:40:17        INFO        showcache::            15: "/home/casatest/casa6/casatestutils/nosedir/test_tool_calibrater/gaincaltest2.ms/WEATHER"
27-Oct-2026 10:40:17 2026-10-27 14:40:17        INFO        showcache::            16: "/home/casatest/casa6/casatestutils/nosedir/test_tool_calibrater/ngc5921.ms"
27-Oct-2026 10:40:17 2026-10-27 14:40:17        INFO        showcache::            17: "/home/casatest/casa6/casatestutils/nosedir/test_tool_calibrater/ngc5921.ms/ANTENNA"
27-Oct-2026 10:40:17 2026-10-27 14:40:17        INFO        showcache::            18: "/home/casatest/casa6/casatestutils/nosedir/test_tool_calibrater/ngc5921.ms/DATA_DESCRIPTION"
27-Oct-2026 10:40:17 2026-10-27 14:40:17        INFO        showcache::            19: "/home/casatest/casa6/casatestutils/nosedir/test_tool_calibrater/ngc5921.ms/FEED"
27-Oct-2026 10:40:17 2026-10-27 14:40:17        INFO        showcache::            20: "/home/casatest/casa6/casatestutils/nosedir/test_tool_calibrater/ngc5921.ms/FIELD"
27-Oct-2026 10:40:17 2026-10-27 14:40:17        INFO        showcache::            21: "/home/casatest/casa6/casatestutils/nosedir/test_tool_calibrater/ngc5921.ms/FLAG_CMD"
27-Oct-2026 10:40:17 2026-10-27 14:40:17        INFO        showcache::            22: "/home/casatest/casa6/casatestutils/nosedir/test_tool_calibrater/ngc5921.ms/HISTORY"
27-Oct-2026 10:40:17 2026-10-27 14:40:17        INFO        showcache::            23: "/home/casatest/casa6/casatestutils/nosedir/test_tool_calibrater/ngc5921.ms/OBSERVATION"
27-Oct-2026 10:40:17 2026-10-27 14:40:17        INFO        showcache::            24: "/home/casatest/casa6/casatestutils/nosedir/test_tool_calibrater/ngc5921.ms/POINTING"
27-Oct-2026 10:40:17 2026-10-27 14:40:17        INFO        showcache::            25: "/home/casatest/casa6/casatestutils/nosedir/test_tool_calibrater/ngc5921.ms/POLARIZATION"
27-Oct-2026 10:40:17 2026-10-27 14:40:17        INFO        showcache::            26: "/home/casatest/casa6/casatestutils/nosedir/test_tool_calibrater/ngc5921.ms/PROCESSOR"
27-Oct-2026 10:40:17 2026-10-27 14:40:17        INFO        showcache::            27: "/home/casatest/casa6/casatestutils/nosedir/test_tool_calibrater/ngc5921.ms/SOURCE"
27-Oct-2026 10:40:17 2026-10-27 14:40:17        INFO        showcache::            28: "/home/casatest/casa6/casatestutils/nosedir/test_tool_calibrater/ngc5921.ms/SPECTRAL_WINDOW"
27-Oct-2026 10:40:17 2026-10-27 14:40:17        INFO        showcache::            29: "/home/casatest/casa6/casatestutils/nosedir/test_tool_calibrater/ngc5921.ms/STATE"
27-Oct-2026 10:40:17 2026-10-27 14:40:17        WARN        calibrater::setvi(bool,bool)        Already using NEW VisibilityIterator.
27-Oct-2026 10:40:17 test_tool_calibrater.py::calibrater_test::test_takesMs
27-Oct-2026 10:40:17 Check that the calibrater tool can open and close an MS 
27-Oct-2026 10:40:17 FAILED
27-Oct-2026 10:40:17
27-Oct-2026 10:40:17 2026-10-27 14:40:18        WARN        calibrater::setvi(bool,bool)        Already using NEW VisibilityIterator.
27-Oct-2026 10:40:17 test_tool_calibrater.py::calibrater_test::test_writeToCorrected
27-Oct-2026 10:40:17 Check that the tool writes to the CORRECTED_DATA column 
27-Oct-2026 10:40:17 FAILED
27-Oct-2026 10:40:17
27-Oct-2026 10:40:17 =================================== FAILURES ===================================
27-Oct-2026 10:40:17 _____________________ calibrater_test.test_activityRecord ______________________
27-Oct-2026 10:40:17 test_tool_calibrater.py:111: in test_activityRecord
27-Oct-2026 10:40:17     cb.open(self._vis)
27-Oct-2026 10:40:17 ../../../../venv/lib/python3.12/site-packages/casatools/calibrater.py:30: in open
27-Oct-2026 10:40:17     return self._swigobj.open(filename, compress, addcorr, addmodel)
27-Oct-2026 10:40:17            ^^^^^^^^^^^^^^^^^^^^^^^^^^^^^^^^^^^^^^^^^^^^^^^^^^^^^^^^^
27-Oct-2026 10:40:17 ../../../../venv/lib/python3.12/site-packages/casatools/__casac__/calibrater.py:143: in open
27-Oct-2026 10:40:17     return _calibrater.calibrater_open(self, *args, **kwargs)
27-Oct-2026 10:40:17            ^^^^^^^^^^^^^^^^^^^^^^^^^^^^^^^^^^^^^^^^^^^^^^^^^^
27-Oct-2026 10:40:17 E   RuntimeError: Error in Calibrater::initialize()
27-Oct-2026 10:40:17 _______________________ calibrater_test.test_corruptCal ________________________
27-Oct-2026 10:40:17 test_tool_calibrater.py:631: in test_corruptCal
27-Oct-2026 10:40:17     cb.corrupt()
27-Oct-2026 10:40:17 ../../../../venv/lib/python3.12/site-packages/casatools/calibrater.py:501: in corrupt
27-Oct-2026 10:40:17     return self._swigobj.corrupt()
27-Oct-2026 10:40:17            ^^^^^^^^^^^^^^^^^^^^^^^
27-Oct-2026 10:40:17 ../../../../venv/lib/python3.12/site-packages/casatools/__casac__/calibrater.py:1200: in corrupt
27-Oct-2026 10:40:17     return _calibrater.calibrater_corrupt(self)
27-Oct-2026 10:40:17            ^^^^^^^^^^^^^^^^^^^^^^^^^^^^^^^^^^^^
27-Oct-2026 10:40:17 E   RuntimeError: Error in Calibrater::corrupt2.
27-Oct-2026 10:40:17 __________________________ calibrater_test.test_done ___________________________
27-Oct-2026 10:40:17 test_tool_calibrater.py:165: in test_done
27-Oct-2026 10:40:17     self.assertTrue(len(tb.showcache()) == 0, msg="The cache is not empty to begin with")
27-Oct-2026 10:40:17 E   AssertionError: False is not true : The cache is not empty to begin with
27-Oct-2026 10:40:17 _______________________ calibrater_test.test_reinitModel _______________________
27-Oct-2026 10:40:17 test_tool_calibrater.py:178: in test_reinitModel
27-Oct-2026 10:40:17     cb.open(self._vis)
27-Oct-2026 10:40:17 ../../../../venv/lib/python3.12/site-packages/casatools/calibrater.py:30: in open
27-Oct-2026 10:40:17     return self._swigobj.open(filename, compress, addcorr, addmodel)
27-Oct-2026 10:40:17            ^^^^^^^^^^^^^^^^^^^^^^^^^^^^^^^^^^^^^^^^^^^^^^^^^^^^^^^^^
27-Oct-2026 10:40:17 ../../../../venv/lib/python3.12/site-packages/casatools/__casac__/calibrater.py:143: in open
27-Oct-2026 10:40:17     return _calibrater.calibrater_open(self, *args, **kwargs)
27-Oct-2026 10:40:17            ^^^^^^^^^^^^^^^^^^^^^^^^^^^^^^^^^^^^^^^^^^^^^^^^^^
27-Oct-2026 10:40:17 E   RuntimeError: Error in Calibrater::initialize()
27-Oct-2026 10:40:17 _______________________ calibrater_test.test_returnDict ________________________
27-Oct-2026 10:40:17 test_tool_calibrater.py:654: in test_returnDict
27-Oct-2026 10:40:17     res = cb.returndict()
27-Oct-2026 10:40:17           ^^^^^^^^^^^^^^^
27-Oct-2026 10:40:17 ../../../../venv/lib/python3.12/site-packages/casatools/calibrater.py:431: in returndict
27-Oct-2026 10:40:17     return self._swigobj.returndict()
27-Oct-2026 10:40:17            ^^^^^^^^^^^^^^^^^^^^^^^^^^
27-Oct-2026 10:40:17 ../../../../venv/lib/python3.12/site-packages/casatools/__casac__/calibrater.py:937: in returndict
27-Oct-2026 10:40:17     return _calibrater.calibrater_returndict(self)
27-Oct-2026 10:40:17            ^^^^^^^^^^^^^^^^^^^^^^^^^^^^^^^^^^^^^^^
27-Oct-2026 10:40:17 E   RuntimeError: Measures directory specified which does not contain the IERS data: /home/casatest/data/measures
27-Oct-2026 10:40:17 ____________________ calibrater_test.test_selectVisBaseline ____________________
27-Oct-2026 10:40:17 test_tool_calibrater.py:508: in test_selectVisBaseline
27-Oct-2026 10:40:17     cb.correct()
27-Oct-2026 10:40:17 ../../../../venv/lib/python3.12/site-packages/casatools/calibrater.py:493: in correct
27-Oct-2026 10:40:17     return self._swigobj.correct(applymode)
27-Oct-2026 10:40:17            ^^^^^^^^^^^^^^^^^^^^^^^^^^^^^^^^
27-Oct-2026 10:40:17 ../../../../venv/lib/python3.12/site-packages/casatools/__casac__/calibrater.py:1168: in correct
27-Oct-2026 10:40:17     return _calibrater.calibrater_correct(self, *args, **kwargs)
27-Oct-2026 10:40:17            ^^^^^^^^^^^^^^^^^^^^^^^^^^^^^^^^^^^^^^^^^^^^^^^^^^^^^
27-Oct-2026 10:40:17 E   RuntimeError: Error in Calibrater::correct.
27-Oct-2026 10:40:17 _____________________ calibrater_test.test_selectVisField ______________________
27-Oct-2026 10:40:17 test_tool_calibrater.py:361: in test_selectVisField
27-Oct-2026 10:40:17     cb.correct()
27-Oct-2026 10:40:17 ../../../../venv/lib/python3.12/site-packages/casatools/calibrater.py:493: in correct
27-Oct-2026 10:40:17     return self._swigobj.correct(applymode)
27-Oct-2026 10:40:17            ^^^^^^^^^^^^^^^^^^^^^^^^^^^^^^^^
27-Oct-2026 10:40:17 ../../../../venv/lib/python3.12/site-packages/casatools/__casac__/calibrater.py:1168: in correct
27-Oct-2026 10:40:17     return _calibrater.calibrater_correct(self, *args, **kwargs)
27-Oct-2026 10:40:17            ^^^^^^^^^^^^^^^^^^^^^^^^^^^^^^^^^^^^^^^^^^^^^^^^^^^^^
27-Oct-2026 10:40:17 E   RuntimeError: Error in Calibrater::correct.
27-Oct-2026 10:40:17 _____________________ calibrater_test.test_selectVisIntent _____________________
27-Oct-2026 10:40:17 test_tool_calibrater.py:410: in test_selectVisIntent
27-Oct-2026 10:40:17     cb.correct()
27-Oct-2026 10:40:17 ../../../../venv/lib/python3.12/site-packages/casatools/calibrater.py:493: in correct
27-Oct-2026 10:40:17     return self._swigobj.correct(applymode)
27-Oct-2026 10:40:17            ^^^^^^^^^^^^^^^^^^^^^^^^^^^^^^^^
27-Oct-2026 10:40:17 ../../../../venv/lib/python3.12/site-packages/casatools/__casac__/calibrater.py:1168: in correct
27-Oct-2026 10:40:17     return _calibrater.calibrater_correct(self, *args, **kwargs)
27-Oct-2026 10:40:17            ^^^^^^^^^^^^^^^^^^^^^^^^^^^^^^^^^^^^^^^^^^^^^^^^^^^^^
27-Oct-2026 10:40:17 E   RuntimeError: Error in Calibrater::correct.
27-Oct-2026 10:40:17 ______________________ calibrater_test.test_selectVisObs _______________________
27-Oct-2026 10:40:17 test_tool_calibrater.py:447: in test_selectVisObs
27-Oct-2026 10:40:17     cb.correct()
27-Oct-2026 10:40:17 ../../../../venv/lib/python3.12/site-packages/casatools/calibrater.py:493: in correct
27-Oct-2026 10:40:17     return self._swigobj.correct(applymode)
27-Oct-2026 10:40:17            ^^^^^^^^^^^^^^^^^^^^^^^^^^^^^^^^
27-Oct-2026 10:40:17 ../../../../venv/lib/python3.12/site-packages/casatools/__casac__/calibrater.py:1168: in correct
27-Oct-2026 10:40:17     return _calibrater.calibrater_correct(self, *args, **kwargs)
27-Oct-2026 10:40:17            ^^^^^^^^^^^^^^^^^^^^^^^^^^^^^^^^^^^^^^^^^^^^^^^^^^^^^
27-Oct-2026 10:40:17 E   RuntimeError: Error in Calibrater::correct.
27-Oct-2026 10:40:17 ______________________ calibrater_test.test_selectVisScan ______________________
27-Oct-2026 10:40:17 test_tool_calibrater.py:317: in test_selectVisScan
27-Oct-2026 10:40:17     cb.correct()
27-Oct-2026 10:40:17 ../../../../venv/lib/python3.12/site-packages/casatools/calibrater.py:493: in correct
27-Oct-2026 10:40:17     return self._swigobj.correct(applymode)
27-Oct-2026 10:40:17            ^^^^^^^^^^^^^^^^^^^^^^^^^^^^^^^^
27-Oct-2026 10:40:17 ../../../../venv/lib/python3.12/site-packages/casatools/__casac__/calibrater.py:1168: in correct
27-Oct-2026 10:40:17     return _calibrater.calibrater_correct(self, *args, **kwargs)
27-Oct-2026 10:40:17            ^^^^^^^^^^^^^^^^^^^^^^^^^^^^^^^^^^^^^^^^^^^^^^^^^^^^^
27-Oct-2026 10:40:17 E   RuntimeError: Error in Calibrater::correct.
27-Oct-2026 10:40:17 ______________________ calibrater_test.test_selectVisSpw _______________________
27-Oct-2026 10:40:17 test_tool_calibrater.py:249: in test_selectVisSpw
27-Oct-2026 10:40:17     cb.correct()
27-Oct-2026 10:40:17 ../../../../venv/lib/python3.12/site-packages/casatools/calibrater.py:493: in correct
27-Oct-2026 10:40:17     return self._swigobj.correct(applymode)
27-Oct-2026 10:40:17            ^^^^^^^^^^^^^^^^^^^^^^^^^^^^^^^^
27-Oct-2026 10:40:17 ../../../../venv/lib/python3.12/site-packages/casatools/__casac__/calibrater.py:1168: in correct
27-Oct-2026 10:40:17     return _calibrater.calibrater_correct(self, *args, **kwargs)
27-Oct-2026 10:40:17            ^^^^^^^^^^^^^^^^^^^^^^^^^^^^^^^^^^^^^^^^^^^^^^^^^^^^^
27-Oct-2026 10:40:17 E   RuntimeError: Error in Calibrater::correct.
27-Oct-2026 10:40:17 ______________________ calibrater_test.test_selectVisTime ______________________
27-Oct-2026 10:40:17 test_tool_calibrater.py:285: in test_selectVisTime
27-Oct-2026 10:40:17     cb.correct()
27-Oct-2026 10:40:17 ../../../../venv/lib/python3.12/site-packages/casatools/calibrater.py:493: in correct
27-Oct-2026 10:40:17     return self._swigobj.correct(applymode)
27-Oct-2026 10:40:17            ^^^^^^^^^^^^^^^^^^^^^^^^^^^^^^^^
27-Oct-2026 10:40:17 ../../../../venv/lib/python3.12/site-packages/casatools/__casac__/calibrater.py:1168: in correct
27-Oct-2026 10:40:17     return _calibrater.calibrater_correct(self, *args, **kwargs)
27-Oct-2026 10:40:17            ^^^^^^^^^^^^^^^^^^^^^^^^^^^^^^^^^^^^^^^^^^^^^^^^^^^^^
27-Oct-2026 10:40:17 E   RuntimeError: Error in Calibrater::correct.
27-Oct-2026 10:40:17 ____________________ calibrater_test.test_selectVisUVrange _____________________
27-Oct-2026 10:40:17 test_tool_calibrater.py:468: in test_selectVisUVrange
27-Oct-2026 10:40:17     cb.correct()
27-Oct-2026 10:40:17 ../../../../venv/lib/python3.12/site-packages/casatools/calibrater.py:493: in correct
27-Oct-2026 10:40:17     return self._swigobj.correct(applymode)
27-Oct-2026 10:40:17            ^^^^^^^^^^^^^^^^^^^^^^^^^^^^^^^^
27-Oct-2026 10:40:17 ../../../../venv/lib/python3.12/site-packages/casatools/__casac__/calibrater.py:1168: in correct
27-Oct-2026 10:40:17     return _calibrater.calibrater_correct(self, *args, **kwargs)
27-Oct-2026 10:40:17            ^^^^^^^^^^^^^^^^^^^^^^^^^^^^^^^^^^^^^^^^^^^^^^^^^^^^^
27-Oct-2026 10:40:17 E   RuntimeError: Error in Calibrater::correct.
27-Oct-2026 10:40:17 ________________________ calibrater_test.test_setCalLib ________________________
27-Oct-2026 10:40:17 test_tool_calibrater.py:542: in test_setCalLib
27-Oct-2026 10:40:17     cb.corrupt()
27-Oct-2026 10:40:17 ../../../../venv/lib/python3.12/site-packages/casatools/calibrater.py:501: in corrupt
27-Oct-2026 10:40:17     return self._swigobj.corrupt()
27-Oct-2026 10:40:17            ^^^^^^^^^^^^^^^^^^^^^^^
27-Oct-2026 10:40:17 ../../../../venv/lib/python3.12/site-packages/casatools/__casac__/calibrater.py:1200: in corrupt
27-Oct-2026 10:40:17     return _calibrater.calibrater_corrupt(self)
27-Oct-2026 10:40:17            ^^^^^^^^^^^^^^^^^^^^^^^^^^^^^^^^^^^^
27-Oct-2026 10:40:17 E   RuntimeError: Error in Calibrater::corrupt2.
27-Oct-2026 10:40:17 ____________________ calibrater_test.test_smoothedCalTables ____________________
27-Oct-2026 10:40:17 test_tool_calibrater.py:596: in test_smoothedCalTables
27-Oct-2026 10:40:17     cb.open(self._bandvis)
27-Oct-2026 10:40:17 ../../../../venv/lib/python3.12/site-packages/casatools/calibrater.py:30: in open
27-Oct-2026 10:40:17     return self._swigobj.open(filename, compress, addcorr, addmodel)
27-Oct-2026 10:40:17            ^^^^^^^^^^^^^^^^^^^^^^^^^^^^^^^^^^^^^^^^^^^^^^^^^^^^^^^^^
27-Oct-2026 10:40:17 ../../../../venv/lib/python3.12/site-packages/casatools/__casac__/calibrater.py:143: in open
27-Oct-2026 10:40:17     return _calibrater.calibrater_open(self, *args, **kwargs)
27-Oct-2026 10:40:17            ^^^^^^^^^^^^^^^^^^^^^^^^^^^^^^^^^^^^^^^^^^^^^^^^^^
27-Oct-2026 10:40:17 E   RuntimeError: Error in Calibrater::initialize()
27-Oct-2026 10:40:17 ______________________ calibrater_test.test_solveBandpass ______________________
27-Oct-2026 10:40:17 test_tool_calibrater.py:566: in test_solveBandpass
27-Oct-2026 10:40:17     cb.open(self._bandvis)
27-Oct-2026 10:40:17 ../../../../venv/lib/python3.12/site-packages/casatools/calibrater.py:30: in open
27-Oct-2026 10:40:17     return self._swigobj.open(filename, compress, addcorr, addmodel)
27-Oct-2026 10:40:17            ^^^^^^^^^^^^^^^^^^^^^^^^^^^^^^^^^^^^^^^^^^^^^^^^^^^^^^^^^
27-Oct-2026 10:40:17 ../../../../venv/lib/python3.12/site-packages/casatools/__casac__/calibrater.py:143: in open
27-Oct-2026 10:40:17     return _calibrater.calibrater_open(self, *args, **kwargs)
27-Oct-2026 10:40:17            ^^^^^^^^^^^^^^^^^^^^^^^^^^^^^^^^^^^^^^^^^^^^^^^^^^
27-Oct-2026 10:40:17 E   RuntimeError: Error in Calibrater::initialize()
27-Oct-2026 10:40:17 _____________________ calibrater_test.test_solveGainspline _____________________
27-Oct-2026 10:40:17 test_tool_calibrater.py:577: in test_solveGainspline
27-Oct-2026 10:40:17     cb.open(self._bandvis)
27-Oct-2026 10:40:17 ../../../../venv/lib/python3.12/site-packages/casatools/calibrater.py:30: in open
27-Oct-2026 10:40:17     return self._swigobj.open(filename, compress, addcorr, addmodel)
27-Oct-2026 10:40:17            ^^^^^^^^^^^^^^^^^^^^^^^^^^^^^^^^^^^^^^^^^^^^^^^^^^^^^^^^^
27-Oct-2026 10:40:17 ../../../../venv/lib/python3.12/site-packages/casatools/__casac__/calibrater.py:143: in open
27-Oct-2026 10:40:17     return _calibrater.calibrater_open(self, *args, **kwargs)
27-Oct-2026 10:40:17            ^^^^^^^^^^^^^^^^^^^^^^^^^^^^^^^^^^^^^^^^^^^^^^^^^^
27-Oct-2026 10:40:17 E   RuntimeError: Error in Calibrater::initialize()
27-Oct-2026 10:40:17 ______________________ calibrater_test.test_standardPath _______________________
27-Oct-2026 10:40:17 test_tool_calibrater.py:122: in test_standardPath
27-Oct-2026 10:40:17     cb.open(self._vis)
27-Oct-2026 10:40:17 ../../../../venv/lib/python3.12/site-packages/casatools/calibrater.py:30: in open
27-Oct-2026 10:40:17     return self._swigobj.open(filename, compress, addcorr, addmodel)
27-Oct-2026 10:40:17            ^^^^^^^^^^^^^^^^^^^^^^^^^^^^^^^^^^^^^^^^^^^^^^^^^^^^^^^^^
27-Oct-2026 10:40:17 ../../../../venv/lib/python3.12/site-packages/casatools/__casac__/calibrater.py:143: in open
27-Oct-2026 10:40:17     return _calibrater.calibrater_open(self, *args, **kwargs)
27-Oct-2026 10:40:17            ^^^^^^^^^^^^^^^^^^^^^^^^^^^^^^^^^^^^^^^^^^^^^^^^^^
27-Oct-2026 10:40:17 E   RuntimeError: Error in Calibrater::initialize()
27-Oct-2026 10:40:17 _________________________ calibrater_test.test_takesMs _________________________
27-Oct-2026 10:40:17 test_tool_calibrater.py:105: in test_takesMs
27-Oct-2026 10:40:17     self.assertTrue(len(cache) == 0)
27-Oct-2026 10:40:17 E   AssertionError: False is not true
27-Oct-2026 10:40:17 ____________________ calibrater_test.test_writeToCorrected _____________________
27-Oct-2026 10:40:17 test_tool_calibrater.py:147: in test_writeToCorrected
27-Oct-2026 10:40:17     self.assertFalse('CORRECTED_DATA' in columns)
27-Oct-2026 10:40:17 E   AssertionError: True is not false
27-Oct-2026 10:40:17 - generated xml file: /home/casatest/casa6/casatestutils/nosedir/xml/test_tool_calibrater/nose.xml -
27-Oct-2026 10:40:17 =========================== short test summary info ============================
27-Oct-2026 10:40:17 FAILED test_tool_calibrater.py::calibrater_test::test_activityRecord - Runtim...
27-Oct-2026 10:40:17 FAILED test_tool_calibrater.py::calibrater_test::test_corruptCal - RuntimeErr...
27-Oct-2026 10:40:17 FAILED test_tool_calibrater.py::calibrater_test::test_done - AssertionError: ...
27-Oct-2026 10:40:17 FAILED test_tool_calibrater.py::calibrater_test::test_reinitModel - RuntimeEr...
27-Oct-2026 10:40:17 FAILED test_tool_calibrater.py::calibrater_test::test_returnDict - RuntimeErr...
27-Oct-2026 10:40:17 FAILED test_tool_calibrater.py::calibrater_test::test_selectVisBaseline - Run...
27-Oct-2026 10:40:17 FAILED test_tool_calibrater.py::calibrater_test::test_selectVisField - Runtim...
27-Oct-2026 10:40:17 FAILED test_tool_calibrater.py::calibrater_test::test_selectVisIntent - Runti...
27-Oct-2026 10:40:17 FAILED test_tool_calibrater.py::calibrater_test::test_selectVisObs - RuntimeE...
27-Oct-2026 10:40:17 FAILED test_tool_calibrater.py::calibrater_test::test_selectVisScan - Runtime...
27-Oct-2026 10:40:17 FAILED test_tool_calibrater.py::calibrater_test::test_selectVisSpw - RuntimeE...
27-Oct-2026 10:40:17 FAILED test_tool_calibrater.py::calibrater_test::test_selectVisTime - Runtime...
27-Oct-2026 10:40:17 FAILED test_tool_calibrater.py::calibrater_test::test_selectVisUVrange - Runt...
27-Oct-2026 10:40:17 FAILED test_tool_calibrater.py::calibrater_test::test_setCalLib - RuntimeErro...
27-Oct-2026 10:40:17 FAILED test_tool_calibrater.py::calibrater_test::test_smoothedCalTables - Run...
27-Oct-2026 10:40:17 FAILED test_tool_calibrater.py::calibrater_test::test_solveBandpass - Runtime...
27-Oct-2026 10:40:17 FAILED test_tool_calibrater.py::calibrater_test::test_solveGainspline - Runti...
27-Oct-2026 10:40:17 FAILED test_tool_calibrater.py::calibrater_test::test_standardPath - RuntimeE...
27-Oct-2026 10:40:17 FAILED test_tool_calibrater.py::calibrater_test::test_takesMs - AssertionErro...
27-Oct-2026 10:40:17 FAILED test_tool_calibrater.py::calibrater_test::test_writeToCorrected - Asse...
27-Oct-2026 10:40:17 =================== 20 failed, 4 passed, 1 warning in 6.84s ====================
27-Oct-2026 10:40:17 ============================= test session starts ==============================
27-Oct-2026 10:40:17 platform linux -- Python 3.12.9, pytest-9.1.1, pluggy-1.7.0 -- /home/casatest/venv/bin/python3.12
27-Oct-2026 10:40:17 cachedir: .pytest_cache
27-Oct-2026 10:40:17 rootdir: /home/casatest/casa6/casatestutils/nosedir/test_tool_vpmanager
27-Oct-2026 10:40:17 configfile: pytest.ini
27-Oct-2026 10:40:18 collecting ... collected 0 items / 1 error
27-Oct-2026 10:40:18
27-Oct-2026 10:40:18 ==================================== ERRORS ====================================
27-Oct-2026 10:40:18 ___________________ ERROR collecting test_tool_vpmanager.py ____________________
27-Oct-2026 10:40:18 test_tool_vpmanager.py:42: in <module>
27-Oct-2026 10:40:18     _vp = vptool( )
27-Oct-2026 10:40:18           ^^^^^^^^^
27-Oct-2026 10:40:18 ../../../../venv/lib/python3.12/site-packages/casatools/vpmanager.py:21: in __init__
27-Oct-2026 10:40:18     self._swigobj = _vpmanager()
27-Oct-2026 10:40:18                     ^^^^^^^^^^^^
27-Oct-2026 10:40:18 ../../../../venv/lib/python3.12/site-packages/casatools/__casac__/vpmanager.py:109: in __init__
27-Oct-2026 10:40:18     this = _vpmanager.new_vpmanager()
27-Oct-2026 10:40:18            ^^^^^^^^^^^^^^^^^^^^^^^^^^
27-Oct-2026 10:40:18 E   RuntimeError: Measures directory specified which does not contain the IERS data: /home/casatest/data/measures
27-Oct-2026 10:40:18 - generated xml file: /home/casatest/casa6/casatestutils/nosedir/xml/test_tool_vpmanager/nose.xml -
27-Oct-2026 10:40:18 =========================== short test summary info ============================
27-Oct-2026 10:40:18 ERROR test_tool_vpmanager.py - RuntimeError: Measures directory specified whi...
27-Oct-2026 10:40:18 !!!!!!!!!!!!!!!!!!!! Interrupted: 1 error during collection !!!!!!!!!!!!!!!!!!!!
27-Oct-2026 10:40:18 ========================= 1 warning, 1 error in 0.35s ==========================
27-Oct-2026 10:40:18 Traceback (most recent call last):
27-Oct-2026 10:40:18   File "/home/casatest/casa6/casatestutils/runtest.py", line 1526, in <module>
27-Oct-2026 10:40:18     run(
27-Oct-2026 10:40:18   File "/home/casatest/casa6/casatestutils/runtest.py", line 1135, in run
27-Oct-2026 10:40:18     setup_and_run(cmd, workdir, workpath, dirname, DRY_RUN , pytest_args)
27-Oct-2026 10:40:18   File "/home/casatest/casa6/casatestutils/runtest.py", line 1016, in setup_and_run
27-Oct-2026 10:40:18     update_xml(xmlfile, result, name=os.getcwd().split("/")[-1])
27-Oct-2026 10:40:18   File "/home/casatest/casa6/casatestutils/runtest.py", line 581, in update_xml
27-Oct-2026 10:40:18     testclass = element.attrib["classname"].split(".")[1]
27-Oct-2026 10:40:18                 ~~~~~~~~~~~~~~~~~~~~~~~~~~~~~~~~~~~~~~^^^
27-Oct-2026 10:40:18 IndexError: list index out of range
27-Oct-2026 10:40:18 Namespace(list=False, verbose=False, dry_run=False, classes=None, file=None, mapfile=<_io.TextIOWrapper name='/home/casatest/casa6/casatestutils/casatestutils/component_to_test_map.json' mode='r' encoding='utf-8'>, branch='master', merge_target=None, pkg=None, work_dir=None, ncores=2, test_paths=None, test_list=None, test_config=None, test_group='casatools', pmode=None, bamboo=False, cachedir=None, ignore_list=None, run_skipped=False, only_skipped=False)
27-Oct-2026 10:40:18
27-Oct-2026 10:40:18 Operating system: Linux
27-Oct-2026 10:40:18
27-Oct-2026 10:40:18 Testing Components['casatools']
27-Oct-2026 10:40:18
27-Oct-2026 10:40:18 Arguments Sent Direct To Pytest :  []
27-Oct-2026 10:40:18 Running 33 Test(s)
27-Oct-2026 10:40:18 Cleaning: /home/casatest/casa6/casatestutils/nosedir/
27-Oct-2026 10:40:18 Tests: ['test_tool_agentflagger', 'test_tool_calanalysis', 'test_tool_calibrater', 'test_tool_componentlist', 'test_tool_coordsys', 'test_tool_image', 'test_tool_image_collapse', 'test_tool_image_deviation', 'test_tool_image_fitprofile', 'test_tool_image_pbcor', 'test_tool_image_pv', 'test_tool_image_rebin', 'test_tool_image_regrid', 'test_tool_image_statistics', 'test_tool_image_subimage', 'test_tool_image_transpose', 'test_tool_imagepol', 'test_tool_linearmosaic', 'test_tool_logsink', 'test_tool_measures', 'test_tool_ms', 'test_tool_ms_createmultims', 'test_tool_ms_statwt', 'test_tool_msmetadata', 'test_tool_msuvbinner', 'test_tool_quanta', 'test_tool_regionmanager', 'test_tool_sdm', 'test_tool_sdm_toms', 'test_tool_simulator', 'test_tool_synthesisutils', 'test_tool_table', 'test_tool_vpmanager']
27-Oct-2026 10:40:18 Fetching Repository: casa6
27-Oct-2026 10:40:18         Running:  git clone https://open-bitbucket.nrao.edu/scm/casa/casa6
27-Oct-2026 10:40:18         Running:  git checkout origin/master
27-Oct-2026 10:40:18
27-Oct-2026 10:40:18 Fetching Repository: casampi
27-Oct-2026 10:40:18         Running:  git clone https://open-bitbucket.nrao.edu/scm/casa/casampi
27-Oct-2026 10:40:18         Tag: tags/0.6.0
27-Oct-2026 10:40:18         Running:  git checkout tags/0.6.0
27-Oct-2026 10:40:18
27-Oct-2026 10:40:18 Fetching Repository: casaplotms
27-Oct-2026 10:40:18         Running:  git clone https://open-bitbucket.nrao.edu/scm/casa/casaplotms
27-Oct-2026 10:40:18         Tag: tags/3.0.3
27-Oct-2026 10:40:18         Running:  git checkout tags/3.0.3
27-Oct-2026 10:40:18
27-Oct-2026 10:40:18 Fetching Repository: casaviewer
27-Oct-2026 10:40:18         Running:  git clone https://open-bitbucket.nrao.edu/scm/casa/casaviewer
27-Oct-2026 10:40:18         Tag: tags/2.5.1
27-Oct-2026 10:40:18         Running:  git checkout tags/2.5.1
27-Oct-2026 10:40:18 Directory Of Tests:  /home/casatest/casa6/casatestutils/nosedir/tests/
27-Oct-2026 10:40:18
27-Oct-2026 10:40:18 Setting Working Directory: /home/casatest/casa6/casatestutils/nosedir/test_tool_ms_createmultims/
27-Oct-2026 10:40:18 Test Directory: /home/casatest/casa6/casatestutils/nosedir/test_tool_ms_createmultims
27-Oct-2026 10:40:18
27-Oct-2026 10:40:18 Running Command: pytest --junitxml=/home/casatest/casa6/casatestutils/nosedir/xml/test_tool_ms_createmultims/nose.xml -s --disable-pytest-warnings --verbose -ra --tb=short /home/casatest/casa6/casatestutils/nosedir/test_tool_ms_createmultims/
27-Oct-2026 10:40:18
27-Oct-2026 10:40:18 Setting Working Directory: /home/casatest/casa6/casatestutils/nosedir/test_tool_quanta/
27-Oct-2026 10:40:18 Test Directory: /home/casatest/casa6/casatestutils/nosedir/test_tool_quanta
27-Oct-2026 10:40:18
27-Oct-2026 10:40:18 Running Command: pytest --junitxml=/home/casatest/casa6/casatestutils/nosedir/xml/test_tool_quanta/nose.xml -s --disable-pytest-warnings --verbose -ra --tb=short /home/casatest/casa6/casatestutils/nosedir/test_tool_quanta/
27-Oct-2026 10:40:18
27-Oct-2026 10:40:18 Setting Working Directory: /home/casatest/casa6/casatestutils/nosedir/test_tool_calibrater/
27-Oct-2026 10:40:18 Test Directory: /home/casatest/casa6/casatestutils/nosedir/test_tool_calibrater
27-Oct-2026 10:40:18
27-Oct-2026 10:40:18 Running Command: pytest --junitxml=/home/casatest/casa6/casatestutils/nosedir/xml/test_tool_calibrater/nose.xml -s --disable-pytest-warnings --verbose -ra --tb=short /home/casatest/casa6/casatestutils/nosedir/test_tool_calibrater/
27-Oct-2026 10:40:18
27-Oct-2026 10:40:18 Setting Working Directory: /home/casatest/casa6/casatestutils/nosedir/test_tool_vpmanager/
27-Oct-2026 10:40:18 Test Directory: /home/casatest/casa6/casatestutils/nosedir/test_tool_vpmanager
27-Oct-2026 10:40:18
27-Oct-2026 10:40:18 Running Command: pytest --junitxml=/home/casatest/casa6/casatestutils/nosedir/xml/test_tool_vpmanager/nose.xml -s --disable-pytest-warnings --verbose -ra --tb=short /home/casatest/casa6/casatestutils/nosedir/test_tool_vpmanager/
27-Oct-2026 10:40:18 total 77688
27-Oct-2026 10:40:18 -rw-r--r-- 1 casaci 15001   161004 Oct 27 14:37 casatestutils-6.8.0.1-py3-none-any.whl
27-Oct-2026 10:40:18 -rw-r--r-- 1 casaci 15001 79357178 Oct 27 14:37 casatools-6.8.0.1-cp312-cp312-manylinux_2_28_x86_64.whl
27-Oct-2026 10:40:18 -rw-r--r-- 1 casaci root     13891 Oct 27 14:40 test_tool_calibrater.xml
27-Oct-2026 10:40:18 -rw-r--r-- 1 casaci root       367 Oct 27 14:40 test_tool_ms_createmultims.xml
27-Oct-2026 10:40:18 -rw-r--r-- 1 casaci root      1171 Oct 27 14:40 test_tool_quanta.xml
27-Oct-2026 10:40:18 -rw-r--r-- 1 casaci root       902 Oct 27 14:40 test_tool_vpmanager.xml
27-Oct-2026 10:40:18 Finished task 'Test wheel' with result: Success
27-Oct-2026 10:40:18
Substituting variable: ${bamboo.python_version} with 3.12
27-Oct-2026 10:40:18
Substituting variable: ${bamboo.agentId} with 153550852
27-Oct-2026 10:40:18
Substituting variable: ${bamboo.agentId} with 153550852
27-Oct-2026 10:40:18
Substituting variable: ${bamboo.agentId} with 153550852
27-Oct-2026 10:40:18
Substituting variable: ${bamboo.agentId} with 153550852
27-Oct-2026 10:40:18 Starting task 'Tar work directory' of type 'com.atlassian.bamboo.plugins.scripttask:task.builder.script'
27-Oct-2026 10:40:18
Beginning to execute external process for build 'CASASPECS - Master Test 3.12 with NRAO IERS - Test Tools Many Linux 2.28 Rocky 8.10 Py3.12 #10 (CASASPECS-MASTERTESTNRAOIERSPY312-TTOMLNRAOIERSPY312-10)'
... running command line:
/opt/ci_workspace/casa/bamboo/agent4/temp/CASASPECS-MASTERTESTNRAOIERSPY312-TTOMLNRAOIERSPY312-10-ScriptBuildTask-12606908286186367912.sh
... in: /opt/ci_workspace/casa/bamboo/agent4/xml-data/build-dir/CASASPECS-MASTERTESTNRAOIERSPY312-TTOMLNRAOIERSPY312
27-Oct-2026 10:40:18 Package working directory
27-Oct-2026 10:40:18 tar: nosedir: Cannot stat: No such file or directory
27-Oct-2026 10:40:18 tar: Exiting with failure status due to previous errors
27-Oct-2026 10:40:18 total 77692
27-Oct-2026 10:40:18 -rw-r--r-- 1 casaci 15001   161004 Oct 27 14:37 casatestutils-6.8.0.1-py3-none-any.whl
27-Oct-2026 10:40:18 -rw-r--r-- 1 casaci 15001 79357178 Oct 27 14:37 casatools-6.8.0.1-cp312-cp312-manylinux_2_28_x86_64.whl
27-Oct-2026 10:40:18 -rw-r--r-- 1 casaci root     13891 Oct 27 14:40 test_tool_calibrater.xml
27-Oct-2026 10:40:18 -rw-r--r-- 1 casaci root       367 Oct 27 14:40 test_tool_ms_createmultims.xml
27-Oct-2026 10:40:18 -rw-r--r-- 1 casaci root      1171 Oct 27 14:40 test_tool_quanta.xml
27-Oct-2026 10:40:18 -rw-r--r-- 1 casaci root       902 Oct 27 14:40 test_tool_vpmanager.xml
27-Oct-2026 10:40:18 -rw-r--r-- 1 casaci root        45 Oct 27 14:40 work-manylinux228-3.12.tar.gz
27-Oct-2026 10:40:18 Done packaging working directory
27-Oct-2026 10:40:18 Finished task 'Tar work directory' with result: Success
27-Oct-2026 10:40:18 Starting task 'Parse tests' of type 'com.atlassian.bamboo.plugins.testresultparser:task.testresultparser.junit'
27-Oct-2026 10:40:18 Parsing test results under /opt/ci_workspace/casa/bamboo/agent4/xml-data/build-dir/CASASPECS-MASTERTESTNRAOIERSPY312-TTOMLNRAOIERSPY312...
27-Oct-2026 10:40:18 Failing task since 21 failing test cases were found.
27-Oct-2026 10:40:18 Finished task 'Parse tests' with result: Failed
27-Oct-2026 10:40:18 Running post build plugin 'Docker Container Cleanup'
27-Oct-2026 10:40:18
Beginning to execute external process for build 'CASASPECS - Master Test 3.12 with NRAO IERS - Test Tools Many Linux 2.28 Rocky 8.10 Py3.12 #10 (CASASPECS-MASTERTESTNRAOIERSPY312-TTOMLNRAOIERSPY312-10)'
... running command line:
/usr/bin/docker rm -f wheel-container-test-153550852
... in: /opt/ci_workspace/casa/bamboo/agent4/xml-data/build-dir/CASASPECS-MASTERTESTNRAOIERSPY312-TTOMLNRAOIERSPY312
27-Oct-2026 10:40:20 wheel-container-test-153550852
27-Oct-2026 10:40:20 Running post build plugin 'NCover Results Collector'
27-Oct-2026 10:40:20 Running post build plugin 'Build Results Label Collector'
27-Oct-2026 10:40:20 Running post build plugin 'Clover Results Collector'
27-Oct-2026 10:40:20 Running post build plugin 'npm Cache Cleanup'
27-Oct-2026 10:40:20 Running post build plugin 'Artifact Copier'
27-Oct-2026 10:40:20 Publishing an artifact: Workdir
27-Oct-2026 10:40:20 Finished publishing of artifact Non required job artifact Http Compression On : [Workdir], patterns: [work*.tar.gz] anchored at: [wheeldirectory/] in 101.7 ms
27-Oct-2026 10:40:20 Publishing an artifact: XML Directories
27-Oct-2026 10:40:20 Finished publishing of artifact Non required job artifact Http Compression On : [XML Directories], patterns: [**/*.xml] anchored at: [wheeldirectory/] in 21.81 ms
27-Oct-2026 10:40:20 Finalising the build...
27-Oct-2026 10:40:20 Stopping timer.
27-Oct-2026 10:40:20 Build CASASPECS-MASTERTESTNRAOIERSPY312-TTOMLNRAOIERSPY312-10 completed.
27-Oct-2026 10:40:20 Running on server: post build plugin 'Build Hanging Detection Configuration'
27-Oct-2026 10:40:20 Running on server: post build plugin 'NCover Results Collector'
27-Oct-2026 10:40:20 Running on server: post build plugin 'Build Labeller'
27-Oct-2026 10:40:20 Running on server: post build plugin 'Clover Delta Calculator'
27-Oct-2026 10:40:20 Running on server: post build plugin 'Maven Dependencies Postprocessor'
27-Oct-2026 10:40:20 All post build plugins have finished
27-Oct-2026 10:40:20 Generating build results summary...
27-Oct-2026 10:40:20 Saving build results to disk...
27-Oct-2026 10:40:20 Store variable context...
27-Oct-2026 10:40:20 Finished building CASASPECS-MASTERTESTNRAOIERSPY312-TTOMLNRAOIERSPY312-10.