Test Tools and Tasks using measures at go (dot) nrao (dot) edu (slash)iers

Build: #10 failed

Job: Test Tools Many Linux 2.28 Rocky 8.10 Py3.12 failed

Job result summary

Completed
Duration
4 minutes
Agent
casaci-4.cv.nrao.edu test agent4
Revision
07b93ae4691683e42ffeb80be149a8fa5ebcf9f9
Total tests
35

Tests

  • 35 tests in total
  • 21 tests failed
  • 21 failures are new
  • 8 seconds taken in total.
New test failures 21
Status Test Duration
Collapse Failed test_tool_calibrater calibrater_test.test_activityRecord
< 1 sec
RuntimeError: Error in Calibrater::initialize()
test_tool_calibrater.py:111: in test_activityRecord
    cb.open(self._vis)
../../../../venv/lib/python3.12/site-packages/casatools/calibrater.py:30: in open
    return self._swigobj.open(filename, compress, addcorr, addmodel)
           ^^^^^^^^^^^^^^^^^^^^^^^^^^^^^^^^^^^^^^^^^^^^^^^^^^^^^^^^^
../../../../venv/lib/python3.12/site-packages/casatools/__casac__/calibrater.py:143: in open
    return _calibrater.calibrater_open(self, *args, **kwargs)
(2 more lines...)
Collapse Failed test_tool_calibrater calibrater_test.test_corruptCal
< 1 sec
RuntimeError: Error in Calibrater::corrupt2.
test_tool_calibrater.py:631: in test_corruptCal
    cb.corrupt()
../../../../venv/lib/python3.12/site-packages/casatools/calibrater.py:501: in corrupt
    return self._swigobj.corrupt()
           ^^^^^^^^^^^^^^^^^^^^^^^
../../../../venv/lib/python3.12/site-packages/casatools/__casac__/calibrater.py:1200: in corrupt
    return _calibrater.calibrater_corrupt(self)
(2 more lines...)
Collapse Failed test_tool_calibrater calibrater_test.test_done
< 1 sec
AssertionError: False is not true : The cache is not empty to begin with
test_tool_calibrater.py:165: in test_done
    self.assertTrue(len(tb.showcache()) == 0, msg="The cache is not empty to begin with")
E   AssertionError: False is not true : The cache is not empty to begin with
Collapse Failed test_tool_calibrater calibrater_test.test_reinitModel
< 1 sec
RuntimeError: Error in Calibrater::initialize()
test_tool_calibrater.py:178: in test_reinitModel
    cb.open(self._vis)
../../../../venv/lib/python3.12/site-packages/casatools/calibrater.py:30: in open
    return self._swigobj.open(filename, compress, addcorr, addmodel)
           ^^^^^^^^^^^^^^^^^^^^^^^^^^^^^^^^^^^^^^^^^^^^^^^^^^^^^^^^^
../../../../venv/lib/python3.12/site-packages/casatools/__casac__/calibrater.py:143: in open
    return _calibrater.calibrater_open(self, *args, **kwargs)
(2 more lines...)
Collapse Failed test_tool_calibrater calibrater_test.test_returnDict
< 1 sec
RuntimeError: Measures directory specified which does not contain the IERS data: /home/casatest/data/measures
test_tool_calibrater.py:654: in test_returnDict
    res = cb.returndict()
          ^^^^^^^^^^^^^^^
../../../../venv/lib/python3.12/site-packages/casatools/calibrater.py:431: in returndict
    return self._swigobj.returndict()
           ^^^^^^^^^^^^^^^^^^^^^^^^^^
../../../../venv/lib/python3.12/site-packages/casatools/__casac__/calibrater.py:937: in returndict
(3 more lines...)
Collapse Failed test_tool_calibrater calibrater_test.test_selectVisBaseline
< 1 sec
RuntimeError: Error in Calibrater::correct.
test_tool_calibrater.py:508: in test_selectVisBaseline
    cb.correct()
../../../../venv/lib/python3.12/site-packages/casatools/calibrater.py:493: in correct
    return self._swigobj.correct(applymode)
           ^^^^^^^^^^^^^^^^^^^^^^^^^^^^^^^^
../../../../venv/lib/python3.12/site-packages/casatools/__casac__/calibrater.py:1168: in correct
    return _calibrater.calibrater_correct(self, *args, **kwargs)
(2 more lines...)
Collapse Failed test_tool_calibrater calibrater_test.test_selectVisField
< 1 sec
RuntimeError: Error in Calibrater::correct.
test_tool_calibrater.py:361: in test_selectVisField
    cb.correct()
../../../../venv/lib/python3.12/site-packages/casatools/calibrater.py:493: in correct
    return self._swigobj.correct(applymode)
           ^^^^^^^^^^^^^^^^^^^^^^^^^^^^^^^^
../../../../venv/lib/python3.12/site-packages/casatools/__casac__/calibrater.py:1168: in correct
    return _calibrater.calibrater_correct(self, *args, **kwargs)
(2 more lines...)
Collapse Failed test_tool_calibrater calibrater_test.test_selectVisIntent
< 1 sec
RuntimeError: Error in Calibrater::correct.
test_tool_calibrater.py:410: in test_selectVisIntent
    cb.correct()
../../../../venv/lib/python3.12/site-packages/casatools/calibrater.py:493: in correct
    return self._swigobj.correct(applymode)
           ^^^^^^^^^^^^^^^^^^^^^^^^^^^^^^^^
../../../../venv/lib/python3.12/site-packages/casatools/__casac__/calibrater.py:1168: in correct
    return _calibrater.calibrater_correct(self, *args, **kwargs)
(2 more lines...)
Collapse Failed test_tool_calibrater calibrater_test.test_selectVisObs
< 1 sec
RuntimeError: Error in Calibrater::correct.
test_tool_calibrater.py:447: in test_selectVisObs
    cb.correct()
../../../../venv/lib/python3.12/site-packages/casatools/calibrater.py:493: in correct
    return self._swigobj.correct(applymode)
           ^^^^^^^^^^^^^^^^^^^^^^^^^^^^^^^^
../../../../venv/lib/python3.12/site-packages/casatools/__casac__/calibrater.py:1168: in correct
    return _calibrater.calibrater_correct(self, *args, **kwargs)
(2 more lines...)
Collapse Failed test_tool_calibrater calibrater_test.test_selectVisScan
< 1 sec
RuntimeError: Error in Calibrater::correct.
test_tool_calibrater.py:317: in test_selectVisScan
    cb.correct()
../../../../venv/lib/python3.12/site-packages/casatools/calibrater.py:493: in correct
    return self._swigobj.correct(applymode)
           ^^^^^^^^^^^^^^^^^^^^^^^^^^^^^^^^
../../../../venv/lib/python3.12/site-packages/casatools/__casac__/calibrater.py:1168: in correct
    return _calibrater.calibrater_correct(self, *args, **kwargs)
(2 more lines...)
Collapse Failed test_tool_calibrater calibrater_test.test_selectVisSpw
< 1 sec
RuntimeError: Error in Calibrater::correct.
test_tool_calibrater.py:249: in test_selectVisSpw
    cb.correct()
../../../../venv/lib/python3.12/site-packages/casatools/calibrater.py:493: in correct
    return self._swigobj.correct(applymode)
           ^^^^^^^^^^^^^^^^^^^^^^^^^^^^^^^^
../../../../venv/lib/python3.12/site-packages/casatools/__casac__/calibrater.py:1168: in correct
    return _calibrater.calibrater_correct(self, *args, **kwargs)
(2 more lines...)
Collapse Failed test_tool_calibrater calibrater_test.test_selectVisTime
< 1 sec
RuntimeError: Error in Calibrater::correct.
test_tool_calibrater.py:285: in test_selectVisTime
    cb.correct()
../../../../venv/lib/python3.12/site-packages/casatools/calibrater.py:493: in correct
    return self._swigobj.correct(applymode)
           ^^^^^^^^^^^^^^^^^^^^^^^^^^^^^^^^
../../../../venv/lib/python3.12/site-packages/casatools/__casac__/calibrater.py:1168: in correct
    return _calibrater.calibrater_correct(self, *args, **kwargs)
(2 more lines...)
Collapse Failed test_tool_calibrater calibrater_test.test_selectVisUVrange
< 1 sec
RuntimeError: Error in Calibrater::correct.
test_tool_calibrater.py:468: in test_selectVisUVrange
    cb.correct()
../../../../venv/lib/python3.12/site-packages/casatools/calibrater.py:493: in correct
    return self._swigobj.correct(applymode)
           ^^^^^^^^^^^^^^^^^^^^^^^^^^^^^^^^
../../../../venv/lib/python3.12/site-packages/casatools/__casac__/calibrater.py:1168: in correct
    return _calibrater.calibrater_correct(self, *args, **kwargs)
(2 more lines...)
Collapse Failed test_tool_calibrater calibrater_test.test_setCalLib
< 1 sec
RuntimeError: Error in Calibrater::corrupt2.
test_tool_calibrater.py:542: in test_setCalLib
    cb.corrupt()
../../../../venv/lib/python3.12/site-packages/casatools/calibrater.py:501: in corrupt
    return self._swigobj.corrupt()
           ^^^^^^^^^^^^^^^^^^^^^^^
../../../../venv/lib/python3.12/site-packages/casatools/__casac__/calibrater.py:1200: in corrupt
    return _calibrater.calibrater_corrupt(self)
(2 more lines...)
Collapse Failed test_tool_calibrater calibrater_test.test_smoothedCalTables
< 1 sec
RuntimeError: Error in Calibrater::initialize()
test_tool_calibrater.py:596: in test_smoothedCalTables
    cb.open(self._bandvis)
../../../../venv/lib/python3.12/site-packages/casatools/calibrater.py:30: in open
    return self._swigobj.open(filename, compress, addcorr, addmodel)
           ^^^^^^^^^^^^^^^^^^^^^^^^^^^^^^^^^^^^^^^^^^^^^^^^^^^^^^^^^
../../../../venv/lib/python3.12/site-packages/casatools/__casac__/calibrater.py:143: in open
    return _calibrater.calibrater_open(self, *args, **kwargs)
(2 more lines...)
Collapse Failed test_tool_calibrater calibrater_test.test_solveBandpass
< 1 sec
RuntimeError: Error in Calibrater::initialize()
test_tool_calibrater.py:566: in test_solveBandpass
    cb.open(self._bandvis)
../../../../venv/lib/python3.12/site-packages/casatools/calibrater.py:30: in open
    return self._swigobj.open(filename, compress, addcorr, addmodel)
           ^^^^^^^^^^^^^^^^^^^^^^^^^^^^^^^^^^^^^^^^^^^^^^^^^^^^^^^^^
../../../../venv/lib/python3.12/site-packages/casatools/__casac__/calibrater.py:143: in open
    return _calibrater.calibrater_open(self, *args, **kwargs)
(2 more lines...)
Collapse Failed test_tool_calibrater calibrater_test.test_solveGainspline
< 1 sec
RuntimeError: Error in Calibrater::initialize()
test_tool_calibrater.py:577: in test_solveGainspline
    cb.open(self._bandvis)
../../../../venv/lib/python3.12/site-packages/casatools/calibrater.py:30: in open
    return self._swigobj.open(filename, compress, addcorr, addmodel)
           ^^^^^^^^^^^^^^^^^^^^^^^^^^^^^^^^^^^^^^^^^^^^^^^^^^^^^^^^^
../../../../venv/lib/python3.12/site-packages/casatools/__casac__/calibrater.py:143: in open
    return _calibrater.calibrater_open(self, *args, **kwargs)
(2 more lines...)
Collapse Failed test_tool_calibrater calibrater_test.test_standardPath
< 1 sec
RuntimeError: Error in Calibrater::initialize()
test_tool_calibrater.py:122: in test_standardPath
    cb.open(self._vis)
../../../../venv/lib/python3.12/site-packages/casatools/calibrater.py:30: in open
    return self._swigobj.open(filename, compress, addcorr, addmodel)
           ^^^^^^^^^^^^^^^^^^^^^^^^^^^^^^^^^^^^^^^^^^^^^^^^^^^^^^^^^
../../../../venv/lib/python3.12/site-packages/casatools/__casac__/calibrater.py:143: in open
    return _calibrater.calibrater_open(self, *args, **kwargs)
(2 more lines...)
Collapse Failed test_tool_calibrater calibrater_test.test_takesMs
< 1 sec
AssertionError: False is not true
test_tool_calibrater.py:105: in test_takesMs
    self.assertTrue(len(cache) == 0)
E   AssertionError: False is not true
Collapse Failed test_tool_calibrater calibrater_test.test_writeToCorrected
< 1 sec
AssertionError: True is not false
test_tool_calibrater.py:147: in test_writeToCorrected
    self.assertFalse('CORRECTED_DATA' in columns)
E   AssertionError: True is not false
Collapse Failed unnamed test suite test_tool_vpmanager
< 1 sec
collection failure
test_tool_vpmanager.py:42: in <module>
    _vp = vptool( )
          ^^^^^^^^^
../../../../venv/lib/python3.12/site-packages/casatools/vpmanager.py:21: in __init__
    self._swigobj = _vpmanager()
                    ^^^^^^^^^^^^
../../../../venv/lib/python3.12/site-packages/casatools/__casac__/vpmanager.py:109: in __init__
(3 more lines...)

Error summary

The build generated some errors. See the full build log for more details.

Error response from daemon: No such container: wheel-container-test-153550852
Error response from daemon: No such container: wheel-container-test-153550852
2026-10-27 14:40:17        SEVERE                Exception Reported: Error in Calibrater::initialize()
2026-10-27 14:40:17        WARN        calibrater::setvi(bool,bool)        Forcing use of NEW VisibilityIterator.
2026-10-27 14:40:17        INFO        calibrater::open        ****Using NEW VI2-driven calibrater tool****
2026-10-27 14:40:17        INFO        calibrater::open        Opening MS: gaincaltest2.ms for calibration.
2026-10-27 14:40:17        INFO        Calibrater::        Initializing nominal selection to the whole MS.
2026-10-27 14:40:17        INFO        calibrater::specifycal        Beginning specifycal-----------------------
2026-10-27 14:40:17        INFO                Creating G Jones table from specified parameters.
2026-10-27 14:40:17        INFO                Generating 'G' corrections.
2026-10-27 14:40:17        INFO                Specified parameter(s) (per spw and pol) repeated on all antennas.
2026-10-27 14:40:17        INFO                Specified parameter(s) (per spw and antenna) repeated on all polarizations.
2026-10-27 14:40:17        INFO                spwId=1 antId=<all> polId=<all> parameter= 3   (ip0,ip1 = [0, 0, 0],[1, 0, 9])
2026-10-27 14:40:17        INFO                Writing solutions to table: testcalout.cal
2026-10-27 14:40:17        WARN        calibrater::setvi(bool,bool)        Already using NEW VisibilityIterator.
2026-10-27 14:40:17        WARN        calibrater::setvi(bool,bool)        Forcing use of OLD VisibilityIterator.
2026-10-27 14:40:17        INFO        calibrater::open        ****Using OLD VI-driven calibrater tool****
2026-10-27 14:40:17        INFO        calibrater::open        Opening MS: gaincaltest2.ms for calibration.
2026-10-27 14:40:17        INFO        Calibrater::        Initializing nominal selection to the whole MS.
2026-10-27 14:40:17        SEVERE        Calibrater::initialize (file /source/casa6/casatools/src/code/synthesis/MeasurementComponents/Calibrater.cc, line 5881)        Caught exception: Measures directory specified which does not contain the IERS data: /home/casatest/data/measures
2026-10-27 14:40:17        SEVERE                Exception Reported: Error in Calibrater::initialize()
2026-10-27 14:40:17        WARN        calibrater::setvi(bool,bool)        Forcing use of NEW VisibilityIterator.
2026-10-27 14:40:17        INFO        calibrater::open        ****Using NEW VI2-driven calibrater tool****
2026-10-27 14:40:17        INFO        calibrater::open        Opening MS: gaincaltest2.ms for calibration.
2026-10-27 14:40:17        INFO        Calibrater::        Initializing nominal selection to the whole MS.
2026-10-27 14:40:17        INFO        name::        No table opened.
2026-10-27 14:40:17        INFO        showcache::        The Table Cache has the following 30 entries:
2026-10-27 14:40:17        INFO        showcache::            0: "/home/casatest/casa6/casatestutils/nosedir/test_tool_calibrater/gaincaltest2.ms"
2026-10-27 14:40:17        INFO        showcache::            1: "/home/casatest/casa6/casatestutils/nosedir/test_tool_calibrater/gaincaltest2.ms/ANTENNA"
2026-10-27 14:40:17        INFO        showcache::            2: "/home/casatest/casa6/casatestutils/nosedir/test_tool_calibrater/gaincaltest2.ms/DATA_DESCRIPTION"
2026-10-27 14:40:17        INFO        showcache::            3: "/home/casatest/casa6/casatestutils/nosedir/test_tool_calibrater/gaincaltest2.ms/FEED"
2026-10-27 14:40:17        INFO        showcache::            4: "/home/casatest/casa6/casatestutils/nosedir/test_tool_calibrater/gaincaltest2.ms/FIELD"
2026-10-27 14:40:17        INFO        showcache::            5: "/home/casatest/casa6/casatestutils/nosedir/test_tool_calibrater/gaincaltest2.ms/FLAG_CMD"
2026-10-27 14:40:17        INFO        showcache::            6: "/home/casatest/casa6/casatestutils/nosedir/test_tool_calibrater/gaincaltest2.ms/HISTORY"
2026-10-27 14:40:17        INFO        showcache::            7: "/home/casatest/casa6/casatestutils/nosedir/test_tool_calibrater/gaincaltest2.ms/OBSERVATION"
2026-10-27 14:40:17        INFO        showcache::            8: "/home/casatest/casa6/casatestutils/nosedir/test_tool_calibrater/gaincaltest2.ms/POINTING"
2026-10-27 14:40:17        INFO        showcache::            9: "/home/casatest/casa6/casatestutils/nosedir/test_tool_calibrater/gaincaltest2.ms/POLARIZATION"
2026-10-27 14:40:17        INFO        showcache::            10: "/home/casatest/casa6/casatestutils/nosedir/test_tool_calibrater/gaincaltest2.ms/PROCESSOR"
2026-10-27 14:40:17        INFO        showcache::            11: "/home/casatest/casa6/casatestutils/nosedir/test_tool_calibrater/gaincaltest2.ms/SOURCE"
2026-10-27 14:40:17        INFO        showcache::            12: "/home/casatest/casa6/casatestutils/nosedir/test_tool_calibrater/gaincaltest2.ms/SPECTRAL_WINDOW"
2026-10-27 14:40:17        INFO        showcache::            13: "/home/casatest/casa6/casatestutils/nosedir/test_tool_calibrater/gaincaltest2.ms/STATE"
2026-10-27 14:40:17        INFO        showcache::            14: "/home/casatest/casa6/casatestutils/nosedir/test_tool_calibrater/gaincaltest2.ms/SYSCAL"
2026-10-27 14:40:17        INFO        showcache::            15: "/home/casatest/casa6/casatestutils/nosedir/test_tool_calibrater/gaincaltest2.ms/WEATHER"
2026-10-27 14:40:17        INFO        showcache::            16: "/home/casatest/casa6/casatestutils/nosedir/test_tool_calibrater/ngc5921.ms"
2026-10-27 14:40:17        INFO        showcache::            17: "/home/casatest/casa6/casatestutils/nosedir/test_tool_calibrater/ngc5921.ms/ANTENNA"
2026-10-27 14:40:17        INFO        showcache::            18: "/home/casatest/casa6/casatestutils/nosedir/test_tool_calibrater/ngc5921.ms/DATA_DESCRIPTION"
2026-10-27 14:40:17        INFO        showcache::            19: "/home/casatest/casa6/casatestutils/nosedir/test_tool_calibrater/ngc5921.ms/FEED"
2026-10-27 14:40:17        INFO        showcache::            20: "/home/casatest/casa6/casatestutils/nosedir/test_tool_calibrater/ngc5921.ms/FIELD"
2026-10-27 14:40:17        INFO        showcache::            21: "/home/casatest/casa6/casatestutils/nosedir/test_tool_calibrater/ngc5921.ms/FLAG_CMD"
2026-10-27 14:40:17        INFO        showcache::            22: "/home/casatest/casa6/casatestutils/nosedir/test_tool_calibrater/ngc5921.ms/HISTORY"
2026-10-27 14:40:17        INFO        showcache::            23: "/home/casatest/casa6/casatestutils/nosedir/test_tool_calibrater/ngc5921.ms/OBSERVATION"
2026-10-27 14:40:17        INFO        showcache::            24: "/home/casatest/casa6/casatestutils/nosedir/test_tool_calibrater/ngc5921.ms/POINTING"
2026-10-27 14:40:17        INFO        showcache::            25: "/home/casatest/casa6/casatestutils/nosedir/test_tool_calibrater/ngc5921.ms/POLARIZATION"
2026-10-27 14:40:17        INFO        showcache::            26: "/home/casatest/casa6/casatestutils/nosedir/test_tool_calibrater/ngc5921.ms/PROCESSOR"
2026-10-27 14:40:17        INFO        showcache::            27: "/home/casatest/casa6/casatestutils/nosedir/test_tool_calibrater/ngc5921.ms/SOURCE"
2026-10-27 14:40:17        INFO        showcache::            28: "/home/casatest/casa6/casatestutils/nosedir/test_tool_calibrater/ngc5921.ms/SPECTRAL_WINDOW"
2026-10-27 14:40:17        INFO        showcache::            29: "/home/casatest/casa6/casatestutils/nosedir/test_tool_calibrater/ngc5921.ms/STATE"
2026-10-27 14:40:17        INFO        name::        No table opened.
2026-10-27 14:40:17        INFO        showcache::        The Table Cache has the following 30 entries:
2026-10-27 14:40:17        INFO        showcache::            0: "/home/casatest/casa6/casatestutils/nosedir/test_tool_calibrater/gaincaltest2.ms"
2026-10-27 14:40:17        INFO        showcache::            1: "/home/casatest/casa6/casatestutils/nosedir/test_tool_calibrater/gaincaltest2.ms/ANTENNA"
2026-10-27 14:40:17        INFO        showcache::            2: "/home/casatest/casa6/casatestutils/nosedir/test_tool_calibrater/gaincaltest2.ms/DATA_DESCRIPTION"
2026-10-27 14:40:17        INFO        showcache::            3: "/home/casatest/casa6/casatestutils/nosedir/test_tool_calibrater/gaincaltest2.ms/FEED"
2026-10-27 14:40:17        INFO        showcache::            4: "/home/casatest/casa6/casatestutils/nosedir/test_tool_calibrater/gaincaltest2.ms/FIELD"
2026-10-27 14:40:17        INFO        showcache::            5: "/home/casatest/casa6/casatestutils/nosedir/test_tool_calibrater/gaincaltest2.ms/FLAG_CMD"
2026-10-27 14:40:17        INFO        showcache::            6: "/home/casatest/casa6/casatestutils/nosedir/test_tool_calibrater/gaincaltest2.ms/HISTORY"
2026-10-27 14:40:17        INFO        showcache::            7: "/home/casatest/casa6/casatestutils/nosedir/test_tool_calibrater/gaincaltest2.ms/OBSERVATION"
2026-10-27 14:40:17        INFO        showcache::            8: "/home/casatest/casa6/casatestutils/nosedir/test_tool_calibrater/gaincaltest2.ms/POINTING"
2026-10-27 14:40:17        INFO        showcache::            9: "/home/casatest/casa6/casatestutils/nosedir/test_tool_calibrater/gaincaltest2.ms/POLARIZATION"
2026-10-27 14:40:17        INFO        showcache::            10: "/home/casatest/casa6/casatestutils/nosedir/test_tool_calibrater/gaincaltest2.ms/PROCESSOR"
2026-10-27 14:40:17        INFO        showcache::            11: "/home/casatest/casa6/casatestutils/nosedir/test_tool_calibrater/gaincaltest2.ms/SOURCE"
2026-10-27 14:40:17        INFO        showcache::            12: "/home/casatest/casa6/casatestutils/nosedir/test_tool_calibrater/gaincaltest2.ms/SPECTRAL_WINDOW"
2026-10-27 14:40:17        INFO        showcache::            13: "/home/casatest/casa6/casatestutils/nosedir/test_tool_calibrater/gaincaltest2.ms/STATE"
2026-10-27 14:40:17        INFO        showcache::            14: "/home/casatest/casa6/casatestutils/nosedir/test_tool_calibrater/gaincaltest2.ms/SYSCAL"
2026-10-27 14:40:17        INFO        showcache::            15: "/home/casatest/casa6/casatestutils/nosedir/test_tool_calibrater/gaincaltest2.ms/WEATHER"
2026-10-27 14:40:17        INFO        showcache::            16: "/home/casatest/casa6/casatestutils/nosedir/test_tool_calibrater/ngc5921.ms"
2026-10-27 14:40:17        INFO        showcache::            17: "/home/casatest/casa6/casatestutils/nosedir/test_tool_calibrater/ngc5921.ms/ANTENNA"
2026-10-27 14:40:17        INFO        showcache::            18: "/home/casatest/casa6/casatestutils/nosedir/test_tool_calibrater/ngc5921.ms/DATA_DESCRIPTION"
2026-10-27 14:40:17        INFO        showcache::            19: "/home/casatest/casa6/casatestutils/nosedir/test_tool_calibrater/ngc5921.ms/FEED"
2026-10-27 14:40:17        INFO        showcache::            20: "/home/casatest/casa6/casatestutils/nosedir/test_tool_calibrater/ngc5921.ms/FIELD"
2026-10-27 14:40:17        INFO        showcache::            21: "/home/casatest/casa6/casatestutils/nosedir/test_tool_calibrater/ngc5921.ms/FLAG_CMD"
2026-10-27 14:40:17        INFO        showcache::            22: "/home/casatest/casa6/casatestutils/nosedir/test_tool_calibrater/ngc5921.ms/HISTORY"
2026-10-27 14:40:17        INFO        showcache::            23: "/home/casatest/casa6/casatestutils/nosedir/test_tool_calibrater/ngc5921.ms/OBSERVATION"
2026-10-27 14:40:17        INFO        showcache::            24: "/home/casatest/casa6/casatestutils/nosedir/test_tool_calibrater/ngc5921.ms/POINTING"
2026-10-27 14:40:17        INFO        showcache::            25: "/home/casatest/casa6/casatestutils/nosedir/test_tool_calibrater/ngc5921.ms/POLARIZATION"
2026-10-27 14:40:17        INFO        showcache::            26: "/home/casatest/casa6/casatestutils/nosedir/test_tool_calibrater/ngc5921.ms/PROCESSOR"
2026-10-27 14:40:17        INFO        showcache::            27: "/home/casatest/casa6/casatestutils/nosedir/test_tool_calibrater/ngc5921.ms/SOURCE"
2026-10-27 14:40:17        INFO        showcache::            28: "/home/casatest/casa6/casatestutils/nosedir/test_tool_calibrater/ngc5921.ms/SPECTRAL_WINDOW"
2026-10-27 14:40:17        INFO        showcache::            29: "/home/casatest/casa6/casatestutils/nosedir/test_tool_calibrater/ngc5921.ms/STATE"
2026-10-27 14:40:17        WARN        calibrater::setvi(bool,bool)        Already using NEW VisibilityIterator.
2026-10-27 14:40:18        WARN        calibrater::setvi(bool,bool)        Already using NEW VisibilityIterator.
Traceback (most recent call last):
  File "/home/casatest/casa6/casatestutils/runtest.py", line 1526, in <module>
    run(
  File "/home/casatest/casa6/casatestutils/runtest.py", line 1135, in run
    setup_and_run(cmd, workdir, workpath, dirname, DRY_RUN , pytest_args)
  File "/home/casatest/casa6/casatestutils/runtest.py", line 1016, in setup_and_run
    update_xml(xmlfile, result, name=os.getcwd().split("/")[-1])
  File "/home/casatest/casa6/casatestutils/runtest.py", line 581, in update_xml
    testclass = element.attrib["classname"].split(".")[1]
                ~~~~~~~~~~~~~~~~~~~~~~~~~~~~~~~~~~~~~~^^^
IndexError: list index out of range
tar: nosedir: Cannot stat: No such file or directory
tar: Exiting with failure status due to previous errors