Test Tools and Tasks using measures at go (dot) nrao (dot) edu (slash)iers

Build: #10 failed Manual run by Akeem Wells

Build result summary

Details

Completed
Queue duration
1 second
Duration
18 minutes
Labels
None
Revisions
CASA6
07b93ae4691683e42ffeb80be149a8fa5ebcf9f9
OPEN-CASA-PKG
e5285e68467f01199807a1f1a978aec8a4781be7
Total tests
285

Tests

Responsible

No one has taken responsibility for this failure

Tests

New test failures 129
Status Test View job Duration
Collapse Failed test_task_bandpass bandpass2_test.test1b
Test Tasks Many Linux 2.28 Rocky 8.10 Py3.12 < 1 sec
RuntimeError: Measures directory specified which does not contain the IERS data: /home/casatest/data/measures
../../../../venv/lib/python3.12/site-packages/casatasks/private/task_bandpass.py:134: in bandpass
    mycb.solve()
../../../../venv/lib/python3.12/site-packages/casatools/calibrater.py:485: in solve
    return self._swigobj.solve()
           ^^^^^^^^^^^^^^^^^^^^^
../../../../venv/lib/python3.12/site-packages/casatools/__casac__/calibrater.py:1133: in solve
    return _calibrater.calibrater_solve(self)
(19 more lines...)
Collapse Failed test_task_bandpass bandpass1_test.test_dictOutputAntennaFlag
Test Tasks Many Linux 2.28 Rocky 8.10 Py3.12 < 1 sec
RuntimeError: Measures directory specified which does not contain the IERS data: /home/casatest/data/measures
test_task_bandpass.py:137: in test_dictOutputAntennaFlag
    flagdata(vis=self.msfile, antenna='0')
../../../../venv/lib/python3.12/site-packages/casatasks/flagdata.py:1136: in __call__
    task_result = _flagdata_t( _pc.document['vis'], _pc.document['mode'], _pc.document['autocorr'], _pc.document['inpfile'], _pc.document['reason'], _pc.document['tbuff'], _pc.document['spw'], _pc.document['field'], _pc.document['antenna'], _pc.document['uvrange'], _pc.document['timerange'], _pc.document['correlation'], _pc.document['scan'], _pc.document['intent'], _pc.document['array'], _pc.document['observation'], _pc.document['feed'], _pc.document['clipminmax'], _pc.document['datacolumn'], _pc.document['clipoutside'], _pc.document['channelavg'], _pc.document['chanbin'], _pc.document['timeavg'], _pc.document['timebin'], _pc.document['clipzeros'], _pc.document['quackinterval'], _pc.document['quackmode'], _pc.document['quackincrement'], _pc.document['tolerance'], _pc.document['addantenna'], _pc.document['lowerlimit'], _pc.document['upperlimit'], _pc.document['ntime'], _pc.document['combinescans'], _pc.document['timecutoff'], _pc.document['freqcutoff'], _pc.document['timefit'], _pc.document['freqfit'], _pc.document['maxnpieces'], _pc.document['flagdimension'], _pc.document['usewindowstats'], _pc.document['halfwin'], _pc.document['extendflags'], _pc.document['winsize'], _pc.document['timedev'], _pc.document['freqdev'], _pc.document['timedevscale'], _pc.document['freqdevscale'], _pc.document['spectralmax'], _pc.document['spectralmin'], _pc.document['antint_ref_antenna'], _pc.document['minchanfrac'], _pc.document['verbose'], _pc.document['extendpols'], _pc.document['growtime'], _pc.document['growfreq'], _pc.document['growaround'], _pc.document['flagneartime'], _pc.document['flagnearfreq'], _pc.document['minrel'], _pc.document['maxrel'], _pc.document['minabs'], _pc.document['maxabs'], _pc.document['spwchan'], _pc.document['spwcorr'], _pc.document['basecnt'], _pc.document['fieldcnt'], _pc.document['name'], _pc.document['action'], _pc.document['display'], _pc.document['flagbackup'], _pc.document['savepars'], _pc.document['cmdreason'], _pc.document['outfile'], _pc.document['overwrite'], _pc.document['writeflags'] )
                  ^^^^^^^^^^^^^^^^^^^^^^^^^^^^^^^^^^^^^^^^^^^^^^^^^^^^^^^^^^^^^^^^^^^^^^^^^^^^^^^^^^^^^^^^^^^^^^^^^^^^^^^^^^^^^^^^^^^^^^^^^^^^^^^^^^^^^^^^^^^^^^^^^^^^^^^^^^^^^^^^^^^^^^^^^^^^^^^^^^^^^^^^^^^^^^^^^^^^^^^^^^^^^^^^^^^^^^^^^^^^^^^^^^^^^^^^^^^^^^^^^^^^^^^^^^^^^^^^^^^^^^^^^^^^^^^^^^^^^^^^^^^^^^^^^^^^^^^^^^^^^^^^^^^^^^^^^^^^^^^^^^^^^^^^^^^^^^^^^^^^^^^^^^^^^^^^^^^^^^^^^^^^^^^^^^^^^^^^^^^^^^^^^^^^^^^^^^^^^^^^^^^^^^^^^^^^^^^^^^^^^^^^^^^^^^^^^^^^^^^^^^^^^^^^^^^^^^^^^^^^^^^^^^^^^^^^^^^^^^^^^^^^^^^^^^^^^^^^^^^^^^^^^^^^^^^^^^^^^^^^^^^^^^^^^^^^^^^^^^^^^^^^^^^^^^^^^^^^^^^^^^^^^^^^^^^^^^^^^^^^^^^^^^^^^^^^^^^^^^^^^^^^^^^^^^^^^^^^^^^^^^^^^^^^^^^^^^^^^^^^^^^^^^^^^^^^^^^^^^^^^^^^^^^^^^^^^^^^^^^^^^^^^^^^^^^^^^^^^^^^^^^^^^^^^^^^^^^^^^^^^^^^^^^^^^^^^^^^^^^^^^^^^^^^^^^^^^^^^^^^^^^^^^^^^^^^^^^^^^^^^^^^^^^^^^^^^^^^^^^^^^^^^^^^^^^^^^^^^^^^^^^^^^^^^^^^^^^^^^^^^^^^^^^^^^^^^^^^^^^^^^^^^^^^^^^^^^^^^^^^^^^^^^^^^^^^^^^^^^^^^^^^^^^^^^^^^^^^^^^^^^^^^^^^^^^^^^^^^^^^^^^^^^^^^^^^^^^^^^^^^^^^^^^^^^^^^^^^^^^^^^^^^^^^^^^^^^^^^^^^^^^^^^^^^^^^^^^^^^^^^^^^^^^^^^^^^^^^^^^^^^^^^^^^^^^^^^^^^^^^^^^^^^^^^^^^^^^^^^^^^^^^^^^^^^^^^^^^^^^^^^^^^^^^^^^^^^^^^^^^^^^^^^^^^^^^^^^^^^^^^^^^^^^^^^^^^^^^^^^^^^^^^^^^^^^^^^^^^^^^^^^^^^^^^^^^^^^^^^^^^^^^^^^^^^^^^^^^^^^^^^^^^^^^^^^^^^^^^^^^^^^^^^^^^^^^^^^^^^^^^^^^^^^^^^^^^^^^^^^^^^^^^^^^^^^^^^^^^^^^^^^^^^^^^^^^^^^^^^^^^^^^^^^^^^^^^^^^^^^^^^^^^^^^^^^^^^^^^^^^^^^^^^^^^^^^^^^^^^^^^^^^^^^^^^^^^^^^^^^^^^^^^^^^^^^^^^^^^^^^^^^^^^^^^^^^^^^^^^^^^^^^^^^^^^^^^^^^^^^^^^^^^^^^^^^^^^^^^^^^^^^^^^^^^^^^^^^^^^^^^^^^^^^^^^^^^^^^^^^^^^^^^^^^^^^^^^^^^^^^^^^^^^^^^^^^^^^^^^^^^^^^^^^^^^^^^^^^^^^^^^^^^^^^^^^^^^^^^^^^^^^^^^^^^^^^^^^^^^^^^^^^^^^^^^^^^^^^^^^^^^^^^^^^^^^^^^^^^^^^^^^^^^^^^^^^^^^^^^^^^^^^^^^^^^^^^^^^^^^^^^^^^^^^^^^^^^^^^^^^^^^^^^^^^^^^^^^^^^^^^^^^^^^^^^^^^^^^^^^^^^^^^^^^^^^^^^^^^^^^^^^^^^^^^^^^^^^^^^^^^^^^^^^^^^^^^^^^^^^^^^^^^^^^^^^^^^^^^^^^^^^^^^^^^^^^^^^^^^^^^^^^^^^^^^^^^^^^^^^^^^^^^^^^^^^^^^^^^^^^^^^^^^^^^^^^^^^^^^^^^^^^^^^^^^^^^^^^^^^^^^^^^^^^^^^^^^^^^^^^^^^^^^^^^^^^^^^^^^^^^^^^^^^^^^^^^^^^^^^^^^^^^^^^^^^^^^^^^^^^^^^^
../../../../venv/lib/python3.12/site-packages/casatasks/private/task_flagdata.py:696: in flagdata
    summary_stats_list = aflocal.run(writeflags, True)
(8 more lines...)
Collapse Failed test_task_bandpass bandpass1_test.test_returnDict
Test Tasks Many Linux 2.28 Rocky 8.10 Py3.12 < 1 sec
RuntimeError: Measures directory specified which does not contain the IERS data: /home/casatest/data/measures
../../../../venv/lib/python3.12/site-packages/casatasks/private/task_bandpass.py:134: in bandpass
    mycb.solve()
../../../../venv/lib/python3.12/site-packages/casatools/calibrater.py:485: in solve
    return self._swigobj.solve()
           ^^^^^^^^^^^^^^^^^^^^^
../../../../venv/lib/python3.12/site-packages/casatools/__casac__/calibrater.py:1133: in solve
    return _calibrater.calibrater_solve(self)
(20 more lines...)
Collapse Failed test_task_bandpass bandpass1_test.test_dictBelowMinBl
Test Tasks Many Linux 2.28 Rocky 8.10 Py3.12 < 1 sec
RuntimeError: Measures directory specified which does not contain the IERS data: /home/casatest/data/measures
test_task_bandpass.py:149: in test_dictBelowMinBl
    flagdata(vis=self.msfile, antenna='0~24')
../../../../venv/lib/python3.12/site-packages/casatasks/flagdata.py:1136: in __call__
    task_result = _flagdata_t( _pc.document['vis'], _pc.document['mode'], _pc.document['autocorr'], _pc.document['inpfile'], _pc.document['reason'], _pc.document['tbuff'], _pc.document['spw'], _pc.document['field'], _pc.document['antenna'], _pc.document['uvrange'], _pc.document['timerange'], _pc.document['correlation'], _pc.document['scan'], _pc.document['intent'], _pc.document['array'], _pc.document['observation'], _pc.document['feed'], _pc.document['clipminmax'], _pc.document['datacolumn'], _pc.document['clipoutside'], _pc.document['channelavg'], _pc.document['chanbin'], _pc.document['timeavg'], _pc.document['timebin'], _pc.document['clipzeros'], _pc.document['quackinterval'], _pc.document['quackmode'], _pc.document['quackincrement'], _pc.document['tolerance'], _pc.document['addantenna'], _pc.document['lowerlimit'], _pc.document['upperlimit'], _pc.document['ntime'], _pc.document['combinescans'], _pc.document['timecutoff'], _pc.document['freqcutoff'], _pc.document['timefit'], _pc.document['freqfit'], _pc.document['maxnpieces'], _pc.document['flagdimension'], _pc.document['usewindowstats'], _pc.document['halfwin'], _pc.document['extendflags'], _pc.document['winsize'], _pc.document['timedev'], _pc.document['freqdev'], _pc.document['timedevscale'], _pc.document['freqdevscale'], _pc.document['spectralmax'], _pc.document['spectralmin'], _pc.document['antint_ref_antenna'], _pc.document['minchanfrac'], _pc.document['verbose'], _pc.document['extendpols'], _pc.document['growtime'], _pc.document['growfreq'], _pc.document['growaround'], _pc.document['flagneartime'], _pc.document['flagnearfreq'], _pc.document['minrel'], _pc.document['maxrel'], _pc.document['minabs'], _pc.document['maxabs'], _pc.document['spwchan'], _pc.document['spwcorr'], _pc.document['basecnt'], _pc.document['fieldcnt'], _pc.document['name'], _pc.document['action'], _pc.document['display'], _pc.document['flagbackup'], _pc.document['savepars'], _pc.document['cmdreason'], _pc.document['outfile'], _pc.document['overwrite'], _pc.document['writeflags'] )
                  ^^^^^^^^^^^^^^^^^^^^^^^^^^^^^^^^^^^^^^^^^^^^^^^^^^^^^^^^^^^^^^^^^^^^^^^^^^^^^^^^^^^^^^^^^^^^^^^^^^^^^^^^^^^^^^^^^^^^^^^^^^^^^^^^^^^^^^^^^^^^^^^^^^^^^^^^^^^^^^^^^^^^^^^^^^^^^^^^^^^^^^^^^^^^^^^^^^^^^^^^^^^^^^^^^^^^^^^^^^^^^^^^^^^^^^^^^^^^^^^^^^^^^^^^^^^^^^^^^^^^^^^^^^^^^^^^^^^^^^^^^^^^^^^^^^^^^^^^^^^^^^^^^^^^^^^^^^^^^^^^^^^^^^^^^^^^^^^^^^^^^^^^^^^^^^^^^^^^^^^^^^^^^^^^^^^^^^^^^^^^^^^^^^^^^^^^^^^^^^^^^^^^^^^^^^^^^^^^^^^^^^^^^^^^^^^^^^^^^^^^^^^^^^^^^^^^^^^^^^^^^^^^^^^^^^^^^^^^^^^^^^^^^^^^^^^^^^^^^^^^^^^^^^^^^^^^^^^^^^^^^^^^^^^^^^^^^^^^^^^^^^^^^^^^^^^^^^^^^^^^^^^^^^^^^^^^^^^^^^^^^^^^^^^^^^^^^^^^^^^^^^^^^^^^^^^^^^^^^^^^^^^^^^^^^^^^^^^^^^^^^^^^^^^^^^^^^^^^^^^^^^^^^^^^^^^^^^^^^^^^^^^^^^^^^^^^^^^^^^^^^^^^^^^^^^^^^^^^^^^^^^^^^^^^^^^^^^^^^^^^^^^^^^^^^^^^^^^^^^^^^^^^^^^^^^^^^^^^^^^^^^^^^^^^^^^^^^^^^^^^^^^^^^^^^^^^^^^^^^^^^^^^^^^^^^^^^^^^^^^^^^^^^^^^^^^^^^^^^^^^^^^^^^^^^^^^^^^^^^^^^^^^^^^^^^^^^^^^^^^^^^^^^^^^^^^^^^^^^^^^^^^^^^^^^^^^^^^^^^^^^^^^^^^^^^^^^^^^^^^^^^^^^^^^^^^^^^^^^^^^^^^^^^^^^^^^^^^^^^^^^^^^^^^^^^^^^^^^^^^^^^^^^^^^^^^^^^^^^^^^^^^^^^^^^^^^^^^^^^^^^^^^^^^^^^^^^^^^^^^^^^^^^^^^^^^^^^^^^^^^^^^^^^^^^^^^^^^^^^^^^^^^^^^^^^^^^^^^^^^^^^^^^^^^^^^^^^^^^^^^^^^^^^^^^^^^^^^^^^^^^^^^^^^^^^^^^^^^^^^^^^^^^^^^^^^^^^^^^^^^^^^^^^^^^^^^^^^^^^^^^^^^^^^^^^^^^^^^^^^^^^^^^^^^^^^^^^^^^^^^^^^^^^^^^^^^^^^^^^^^^^^^^^^^^^^^^^^^^^^^^^^^^^^^^^^^^^^^^^^^^^^^^^^^^^^^^^^^^^^^^^^^^^^^^^^^^^^^^^^^^^^^^^^^^^^^^^^^^^^^^^^^^^^^^^^^^^^^^^^^^^^^^^^^^^^^^^^^^^^^^^^^^^^^^^^^^^^^^^^^^^^^^^^^^^^^^^^^^^^^^^^^^^^^^^^^^^^^^^^^^^^^^^^^^^^^^^^^^^^^^^^^^^^^^^^^^^^^^^^^^^^^^^^^^^^^^^^^^^^^^^^^^^^^^^^^^^^^^^^^^^^^^^^^^^^^^^^^^^^^^^^^^^^^^^^^^^^^^^^^^^^^^^^^^^^^^^^^^^^^^^^^^^^^^^^^^^^^^^^^^^^^^^^^^^^^^^^^^^^^^^^^^^^^^^^^^^^^^^^^^^^^^^^^^^^^^^^^^^^^^^^^^^^^^^^^^^^^^^^^^^^^^^^^^^^^^^^^^^^^^^^^^^^^^^^^^^^^^^^^^^^^^^^^^^^^^^^^^^^^^^^^^^^^^^^^^^^^^^^^^^^^^^^^^^^^^^^^^^^^^^^^^^^^^^^^^^^^^^^^^^^^^^^^^^^^^^^^^^^^^^^^^^^^^^^^^^^^^^^^^^^^^^^^^^^^^^^^^^^^^^^^^^^^^^^^^^^^^^^^^^^^^^^^^^^^^^^^^^^^^^^^^^^^^^^^^^^^^^^^^^^^^^^^^^^^^^^^^^^^^^^^^^^^^^^^^^^^^^^^^^^^
../../../../venv/lib/python3.12/site-packages/casatasks/private/task_flagdata.py:696: in flagdata
    summary_stats_list = aflocal.run(writeflags, True)
(8 more lines...)
Collapse Failed test_task_bandpass bandpass1_test.test1a
Test Tasks Many Linux 2.28 Rocky 8.10 Py3.12 < 1 sec
RuntimeError: Measures directory specified which does not contain the IERS data: /home/casatest/data/measures
../../../../venv/lib/python3.12/site-packages/casatasks/private/task_bandpass.py:134: in bandpass
    mycb.solve()
../../../../venv/lib/python3.12/site-packages/casatools/calibrater.py:485: in solve
    return self._swigobj.solve()
           ^^^^^^^^^^^^^^^^^^^^^
../../../../venv/lib/python3.12/site-packages/casatools/__casac__/calibrater.py:1133: in solve
    return _calibrater.calibrater_solve(self)
(19 more lines...)
Collapse Failed test_task_bandpass bandpass1_test.test_dictOutputFlagged
Test Tasks Many Linux 2.28 Rocky 8.10 Py3.12 < 1 sec
RuntimeError: Measures directory specified which does not contain the IERS data: /home/casatest/data/measures
test_task_bandpass.py:124: in test_dictOutputFlagged
    flagdata(vis=self.msfile, spw='0')
../../../../venv/lib/python3.12/site-packages/casatasks/flagdata.py:1136: in __call__
    task_result = _flagdata_t( _pc.document['vis'], _pc.document['mode'], _pc.document['autocorr'], _pc.document['inpfile'], _pc.document['reason'], _pc.document['tbuff'], _pc.document['spw'], _pc.document['field'], _pc.document['antenna'], _pc.document['uvrange'], _pc.document['timerange'], _pc.document['correlation'], _pc.document['scan'], _pc.document['intent'], _pc.document['array'], _pc.document['observation'], _pc.document['feed'], _pc.document['clipminmax'], _pc.document['datacolumn'], _pc.document['clipoutside'], _pc.document['channelavg'], _pc.document['chanbin'], _pc.document['timeavg'], _pc.document['timebin'], _pc.document['clipzeros'], _pc.document['quackinterval'], _pc.document['quackmode'], _pc.document['quackincrement'], _pc.document['tolerance'], _pc.document['addantenna'], _pc.document['lowerlimit'], _pc.document['upperlimit'], _pc.document['ntime'], _pc.document['combinescans'], _pc.document['timecutoff'], _pc.document['freqcutoff'], _pc.document['timefit'], _pc.document['freqfit'], _pc.document['maxnpieces'], _pc.document['flagdimension'], _pc.document['usewindowstats'], _pc.document['halfwin'], _pc.document['extendflags'], _pc.document['winsize'], _pc.document['timedev'], _pc.document['freqdev'], _pc.document['timedevscale'], _pc.document['freqdevscale'], _pc.document['spectralmax'], _pc.document['spectralmin'], _pc.document['antint_ref_antenna'], _pc.document['minchanfrac'], _pc.document['verbose'], _pc.document['extendpols'], _pc.document['growtime'], _pc.document['growfreq'], _pc.document['growaround'], _pc.document['flagneartime'], _pc.document['flagnearfreq'], _pc.document['minrel'], _pc.document['maxrel'], _pc.document['minabs'], _pc.document['maxabs'], _pc.document['spwchan'], _pc.document['spwcorr'], _pc.document['basecnt'], _pc.document['fieldcnt'], _pc.document['name'], _pc.document['action'], _pc.document['display'], _pc.document['flagbackup'], _pc.document['savepars'], _pc.document['cmdreason'], _pc.document['outfile'], _pc.document['overwrite'], _pc.document['writeflags'] )
                  ^^^^^^^^^^^^^^^^^^^^^^^^^^^^^^^^^^^^^^^^^^^^^^^^^^^^^^^^^^^^^^^^^^^^^^^^^^^^^^^^^^^^^^^^^^^^^^^^^^^^^^^^^^^^^^^^^^^^^^^^^^^^^^^^^^^^^^^^^^^^^^^^^^^^^^^^^^^^^^^^^^^^^^^^^^^^^^^^^^^^^^^^^^^^^^^^^^^^^^^^^^^^^^^^^^^^^^^^^^^^^^^^^^^^^^^^^^^^^^^^^^^^^^^^^^^^^^^^^^^^^^^^^^^^^^^^^^^^^^^^^^^^^^^^^^^^^^^^^^^^^^^^^^^^^^^^^^^^^^^^^^^^^^^^^^^^^^^^^^^^^^^^^^^^^^^^^^^^^^^^^^^^^^^^^^^^^^^^^^^^^^^^^^^^^^^^^^^^^^^^^^^^^^^^^^^^^^^^^^^^^^^^^^^^^^^^^^^^^^^^^^^^^^^^^^^^^^^^^^^^^^^^^^^^^^^^^^^^^^^^^^^^^^^^^^^^^^^^^^^^^^^^^^^^^^^^^^^^^^^^^^^^^^^^^^^^^^^^^^^^^^^^^^^^^^^^^^^^^^^^^^^^^^^^^^^^^^^^^^^^^^^^^^^^^^^^^^^^^^^^^^^^^^^^^^^^^^^^^^^^^^^^^^^^^^^^^^^^^^^^^^^^^^^^^^^^^^^^^^^^^^^^^^^^^^^^^^^^^^^^^^^^^^^^^^^^^^^^^^^^^^^^^^^^^^^^^^^^^^^^^^^^^^^^^^^^^^^^^^^^^^^^^^^^^^^^^^^^^^^^^^^^^^^^^^^^^^^^^^^^^^^^^^^^^^^^^^^^^^^^^^^^^^^^^^^^^^^^^^^^^^^^^^^^^^^^^^^^^^^^^^^^^^^^^^^^^^^^^^^^^^^^^^^^^^^^^^^^^^^^^^^^^^^^^^^^^^^^^^^^^^^^^^^^^^^^^^^^^^^^^^^^^^^^^^^^^^^^^^^^^^^^^^^^^^^^^^^^^^^^^^^^^^^^^^^^^^^^^^^^^^^^^^^^^^^^^^^^^^^^^^^^^^^^^^^^^^^^^^^^^^^^^^^^^^^^^^^^^^^^^^^^^^^^^^^^^^^^^^^^^^^^^^^^^^^^^^^^^^^^^^^^^^^^^^^^^^^^^^^^^^^^^^^^^^^^^^^^^^^^^^^^^^^^^^^^^^^^^^^^^^^^^^^^^^^^^^^^^^^^^^^^^^^^^^^^^^^^^^^^^^^^^^^^^^^^^^^^^^^^^^^^^^^^^^^^^^^^^^^^^^^^^^^^^^^^^^^^^^^^^^^^^^^^^^^^^^^^^^^^^^^^^^^^^^^^^^^^^^^^^^^^^^^^^^^^^^^^^^^^^^^^^^^^^^^^^^^^^^^^^^^^^^^^^^^^^^^^^^^^^^^^^^^^^^^^^^^^^^^^^^^^^^^^^^^^^^^^^^^^^^^^^^^^^^^^^^^^^^^^^^^^^^^^^^^^^^^^^^^^^^^^^^^^^^^^^^^^^^^^^^^^^^^^^^^^^^^^^^^^^^^^^^^^^^^^^^^^^^^^^^^^^^^^^^^^^^^^^^^^^^^^^^^^^^^^^^^^^^^^^^^^^^^^^^^^^^^^^^^^^^^^^^^^^^^^^^^^^^^^^^^^^^^^^^^^^^^^^^^^^^^^^^^^^^^^^^^^^^^^^^^^^^^^^^^^^^^^^^^^^^^^^^^^^^^^^^^^^^^^^^^^^^^^^^^^^^^^^^^^^^^^^^^^^^^^^^^^^^^^^^^^^^^^^^^^^^^^^^^^^^^^^^^^^^^^^^^^^^^^^^^^^^^^^^^^^^^^^^^^^^^^^^^^^^^^^^^^^^^^^^^^^^^^^^^^^^^^^^^^^^^^^^^^^^^^^^^^^^^^^^^^^^^^^^^^^^^^^^^^^^^^^^^^^^^^^^^^^^^^^^^^^^^^^^^^^^^^^^^^^^^^^^^^^^^^^^^^^^^^^^^^^^^^^^^^^^^^^^^^^^^^^^^^^^^^^^^^^^^^^^^^^^^^^^^^^^^^^^^^^^^^^^^^^^^^^^^^^^^^^^^^^^^^^^^^^^^^^^^^^^^^^^^^^^^^^^^^^^^^^^^^^^^^^^^^^^^^^^^^^^^^
../../../../venv/lib/python3.12/site-packages/casatasks/private/task_flagdata.py:696: in flagdata
    summary_stats_list = aflocal.run(writeflags, True)
(8 more lines...)
Collapse Failed test_task_flagdata SomeClass.test_task_flagdata
Test Tasks Many Linux 2.28 Rocky 8.10 Py3.12 < 1 sec
Killed
Killed
Collapse Failed test_task_initweights initweights_tsys_map.testTsysMapLL
Test Tasks Many Linux 2.28 Rocky 8.10 Py3.12 < 1 sec
RuntimeError: Error in Calibrater::initWeights.
test_task_initweights.py:463: in testTsysMapLL
    self._runTest('tsys', False, [1,3,5,7,9,11,15], 'linear,linear',self.spwmap)
test_task_initweights.py:162: in _runTest
    initweights(vis=self.inputms,wtmode=wtmode,
../../../../venv/lib/python3.12/site-packages/casatasks/initweights.py:133: in __call__
    task_result = _initweights_t( _pc.document['vis'], _pc.document['wtmode'], _pc.document['tsystable'], _pc.document['gainfield'], _pc.document['interp'], _pc.document['spwmap'], _pc.document['dowtsp'] )
                  ^^^^^^^^^^^^^^^^^^^^^^^^^^^^^^^^^^^^^^^^^^^^^^^^^^^^^^^^^^^^^^^^^^^^^^^^^^^^^^^^^^^^^^^^^^^^^^^^^^^^^^^^^^^^^^^^^^^^^^^^^^^^^^^^^^^^^^^^^^^^^^^^^^^^^^^^^^^^^^^^^^^^^^^^^^^^^^^^^^^^^^^^^^^
(9 more lines...)
Collapse Failed test_task_initweights initweights_base.testNyq
Test Tasks Many Linux 2.28 Rocky 8.10 Py3.12 < 1 sec
RuntimeError: Error in Calibrater::initWeights.
test_task_initweights.py:561: in testNyq
    self._runTest('nyq', False, self.valid_spw)
test_task_initweights.py:162: in _runTest
    initweights(vis=self.inputms,wtmode=wtmode,
../../../../venv/lib/python3.12/site-packages/casatasks/initweights.py:133: in __call__
    task_result = _initweights_t( _pc.document['vis'], _pc.document['wtmode'], _pc.document['tsystable'], _pc.document['gainfield'], _pc.document['interp'], _pc.document['spwmap'], _pc.document['dowtsp'] )
                  ^^^^^^^^^^^^^^^^^^^^^^^^^^^^^^^^^^^^^^^^^^^^^^^^^^^^^^^^^^^^^^^^^^^^^^^^^^^^^^^^^^^^^^^^^^^^^^^^^^^^^^^^^^^^^^^^^^^^^^^^^^^^^^^^^^^^^^^^^^^^^^^^^^^^^^^^^^^^^^^^^^^^^^^^^^^^^^^^^^^^^^^^^^^
(9 more lines...)
Collapse Failed test_task_initweights initweights_tsys_map.testTinttsysMapNN
Test Tasks Many Linux 2.28 Rocky 8.10 Py3.12 < 1 sec
RuntimeError: Error in Calibrater::initWeights.
test_task_initweights.py:471: in testTinttsysMapNN
    self._runTest('tinttsys', False, [1,3,5,7,15], 'nearest,nearest',self.spwmap)
test_task_initweights.py:162: in _runTest
    initweights(vis=self.inputms,wtmode=wtmode,
../../../../venv/lib/python3.12/site-packages/casatasks/initweights.py:133: in __call__
    task_result = _initweights_t( _pc.document['vis'], _pc.document['wtmode'], _pc.document['tsystable'], _pc.document['gainfield'], _pc.document['interp'], _pc.document['spwmap'], _pc.document['dowtsp'] )
                  ^^^^^^^^^^^^^^^^^^^^^^^^^^^^^^^^^^^^^^^^^^^^^^^^^^^^^^^^^^^^^^^^^^^^^^^^^^^^^^^^^^^^^^^^^^^^^^^^^^^^^^^^^^^^^^^^^^^^^^^^^^^^^^^^^^^^^^^^^^^^^^^^^^^^^^^^^^^^^^^^^^^^^^^^^^^^^^^^^^^^^^^^^^^
(9 more lines...)
Collapse Failed test_task_initweights initweights_base.testOnesSp
Test Tasks Many Linux 2.28 Rocky 8.10 Py3.12 < 1 sec
RuntimeError: Error in Calibrater::initWeights.
test_task_initweights.py:557: in testOnesSp
    self._runTest('ones', True, self.valid_spw)
test_task_initweights.py:162: in _runTest
    initweights(vis=self.inputms,wtmode=wtmode,
../../../../venv/lib/python3.12/site-packages/casatasks/initweights.py:133: in __call__
    task_result = _initweights_t( _pc.document['vis'], _pc.document['wtmode'], _pc.document['tsystable'], _pc.document['gainfield'], _pc.document['interp'], _pc.document['spwmap'], _pc.document['dowtsp'] )
                  ^^^^^^^^^^^^^^^^^^^^^^^^^^^^^^^^^^^^^^^^^^^^^^^^^^^^^^^^^^^^^^^^^^^^^^^^^^^^^^^^^^^^^^^^^^^^^^^^^^^^^^^^^^^^^^^^^^^^^^^^^^^^^^^^^^^^^^^^^^^^^^^^^^^^^^^^^^^^^^^^^^^^^^^^^^^^^^^^^^^^^^^^^^^
(9 more lines...)
Collapse Failed test_task_initweights initweights_base.testSigmaSp
Test Tasks Many Linux 2.28 Rocky 8.10 Py3.12 < 1 sec
RuntimeError: Error in Calibrater::initWeights.
test_task_initweights.py:573: in testSigmaSp
    self._runTest('sigma', True, self.valid_spw)
test_task_initweights.py:162: in _runTest
    initweights(vis=self.inputms,wtmode=wtmode,
../../../../venv/lib/python3.12/site-packages/casatasks/initweights.py:133: in __call__
    task_result = _initweights_t( _pc.document['vis'], _pc.document['wtmode'], _pc.document['tsystable'], _pc.document['gainfield'], _pc.document['interp'], _pc.document['spwmap'], _pc.document['dowtsp'] )
                  ^^^^^^^^^^^^^^^^^^^^^^^^^^^^^^^^^^^^^^^^^^^^^^^^^^^^^^^^^^^^^^^^^^^^^^^^^^^^^^^^^^^^^^^^^^^^^^^^^^^^^^^^^^^^^^^^^^^^^^^^^^^^^^^^^^^^^^^^^^^^^^^^^^^^^^^^^^^^^^^^^^^^^^^^^^^^^^^^^^^^^^^^^^^
(9 more lines...)
Collapse Failed test_task_initweights initweights_tsys_map.testTinttsysMapLC
Test Tasks Many Linux 2.28 Rocky 8.10 Py3.12 < 1 sec
RuntimeError: Error in Calibrater::initWeights.
test_task_initweights.py:479: in testTinttsysMapLC
    self._runTest('tinttsys', False, [1,3,5,7,9,11,13,15], 'linear,cspline',self.spwmap)
test_task_initweights.py:162: in _runTest
    initweights(vis=self.inputms,wtmode=wtmode,
../../../../venv/lib/python3.12/site-packages/casatasks/initweights.py:133: in __call__
    task_result = _initweights_t( _pc.document['vis'], _pc.document['wtmode'], _pc.document['tsystable'], _pc.document['gainfield'], _pc.document['interp'], _pc.document['spwmap'], _pc.document['dowtsp'] )
                  ^^^^^^^^^^^^^^^^^^^^^^^^^^^^^^^^^^^^^^^^^^^^^^^^^^^^^^^^^^^^^^^^^^^^^^^^^^^^^^^^^^^^^^^^^^^^^^^^^^^^^^^^^^^^^^^^^^^^^^^^^^^^^^^^^^^^^^^^^^^^^^^^^^^^^^^^^^^^^^^^^^^^^^^^^^^^^^^^^^^^^^^^^^^
(9 more lines...)
Collapse Failed test_task_initweights initweights_tsys_base.testTinttsysLLSp
Test Tasks Many Linux 2.28 Rocky 8.10 Py3.12 < 1 sec
RuntimeError: Error in Calibrater::initWeights.
test_task_initweights.py:395: in testTinttsysLLSp
    self._runTest('tinttsys', True, self.tsys_funcs.keys(), 'nearest,nearest')
test_task_initweights.py:162: in _runTest
    initweights(vis=self.inputms,wtmode=wtmode,
../../../../venv/lib/python3.12/site-packages/casatasks/initweights.py:133: in __call__
    task_result = _initweights_t( _pc.document['vis'], _pc.document['wtmode'], _pc.document['tsystable'], _pc.document['gainfield'], _pc.document['interp'], _pc.document['spwmap'], _pc.document['dowtsp'] )
                  ^^^^^^^^^^^^^^^^^^^^^^^^^^^^^^^^^^^^^^^^^^^^^^^^^^^^^^^^^^^^^^^^^^^^^^^^^^^^^^^^^^^^^^^^^^^^^^^^^^^^^^^^^^^^^^^^^^^^^^^^^^^^^^^^^^^^^^^^^^^^^^^^^^^^^^^^^^^^^^^^^^^^^^^^^^^^^^^^^^^^^^^^^^^
(9 more lines...)
Collapse Failed test_task_initweights initweights_tsys_base.testTsysNN
Test Tasks Many Linux 2.28 Rocky 8.10 Py3.12 < 1 sec
RuntimeError: Error in Calibrater::initWeights.
test_task_initweights.py:355: in testTsysNN
    self._runTest('tsys', False, self.tsys_funcs.keys(), 'nearest,nearest')
test_task_initweights.py:162: in _runTest
    initweights(vis=self.inputms,wtmode=wtmode,
../../../../venv/lib/python3.12/site-packages/casatasks/initweights.py:133: in __call__
    task_result = _initweights_t( _pc.document['vis'], _pc.document['wtmode'], _pc.document['tsystable'], _pc.document['gainfield'], _pc.document['interp'], _pc.document['spwmap'], _pc.document['dowtsp'] )
                  ^^^^^^^^^^^^^^^^^^^^^^^^^^^^^^^^^^^^^^^^^^^^^^^^^^^^^^^^^^^^^^^^^^^^^^^^^^^^^^^^^^^^^^^^^^^^^^^^^^^^^^^^^^^^^^^^^^^^^^^^^^^^^^^^^^^^^^^^^^^^^^^^^^^^^^^^^^^^^^^^^^^^^^^^^^^^^^^^^^^^^^^^^^^
(9 more lines...)
Collapse Failed test_task_initweights initweights_base.testOnes
Test Tasks Many Linux 2.28 Rocky 8.10 Py3.12 < 1 sec
RuntimeError: Error in Calibrater::initWeights.
test_task_initweights.py:553: in testOnes
    self._runTest('ones', False, self.valid_spw)
test_task_initweights.py:162: in _runTest
    initweights(vis=self.inputms,wtmode=wtmode,
../../../../venv/lib/python3.12/site-packages/casatasks/initweights.py:133: in __call__
    task_result = _initweights_t( _pc.document['vis'], _pc.document['wtmode'], _pc.document['tsystable'], _pc.document['gainfield'], _pc.document['interp'], _pc.document['spwmap'], _pc.document['dowtsp'] )
                  ^^^^^^^^^^^^^^^^^^^^^^^^^^^^^^^^^^^^^^^^^^^^^^^^^^^^^^^^^^^^^^^^^^^^^^^^^^^^^^^^^^^^^^^^^^^^^^^^^^^^^^^^^^^^^^^^^^^^^^^^^^^^^^^^^^^^^^^^^^^^^^^^^^^^^^^^^^^^^^^^^^^^^^^^^^^^^^^^^^^^^^^^^^^
(9 more lines...)
Collapse Failed test_task_initweights initweights_tsys_base.testTsysNNSp
Test Tasks Many Linux 2.28 Rocky 8.10 Py3.12 < 1 sec
RuntimeError: Error in Calibrater::initWeights.
test_task_initweights.py:379: in testTsysNNSp
    self._runTest('tsys', True, self.tsys_funcs.keys(), 'nearest,nearest')
test_task_initweights.py:162: in _runTest
    initweights(vis=self.inputms,wtmode=wtmode,
../../../../venv/lib/python3.12/site-packages/casatasks/initweights.py:133: in __call__
    task_result = _initweights_t( _pc.document['vis'], _pc.document['wtmode'], _pc.document['tsystable'], _pc.document['gainfield'], _pc.document['interp'], _pc.document['spwmap'], _pc.document['dowtsp'] )
                  ^^^^^^^^^^^^^^^^^^^^^^^^^^^^^^^^^^^^^^^^^^^^^^^^^^^^^^^^^^^^^^^^^^^^^^^^^^^^^^^^^^^^^^^^^^^^^^^^^^^^^^^^^^^^^^^^^^^^^^^^^^^^^^^^^^^^^^^^^^^^^^^^^^^^^^^^^^^^^^^^^^^^^^^^^^^^^^^^^^^^^^^^^^^
(9 more lines...)
Collapse Failed test_task_initweights initweights_tsys_base.testTsysLL
Test Tasks Many Linux 2.28 Rocky 8.10 Py3.12 < 1 sec
RuntimeError: Error in Calibrater::initWeights.
test_task_initweights.py:359: in testTsysLL
    self._runTest('tsys', False, self.tsys_funcs.keys(), 'linear,linear')
test_task_initweights.py:162: in _runTest
    initweights(vis=self.inputms,wtmode=wtmode,
../../../../venv/lib/python3.12/site-packages/casatasks/initweights.py:133: in __call__
    task_result = _initweights_t( _pc.document['vis'], _pc.document['wtmode'], _pc.document['tsystable'], _pc.document['gainfield'], _pc.document['interp'], _pc.document['spwmap'], _pc.document['dowtsp'] )
                  ^^^^^^^^^^^^^^^^^^^^^^^^^^^^^^^^^^^^^^^^^^^^^^^^^^^^^^^^^^^^^^^^^^^^^^^^^^^^^^^^^^^^^^^^^^^^^^^^^^^^^^^^^^^^^^^^^^^^^^^^^^^^^^^^^^^^^^^^^^^^^^^^^^^^^^^^^^^^^^^^^^^^^^^^^^^^^^^^^^^^^^^^^^^
(9 more lines...)
Collapse Failed test_task_initweights initweights_tsys_base.testTinttsysNNSp
Test Tasks Many Linux 2.28 Rocky 8.10 Py3.12 < 1 sec
RuntimeError: Error in Calibrater::initWeights.
test_task_initweights.py:391: in testTinttsysNNSp
    self._runTest('tinttsys', True, self.tsys_funcs.keys(), 'nearest,nearest')
test_task_initweights.py:162: in _runTest
    initweights(vis=self.inputms,wtmode=wtmode,
../../../../venv/lib/python3.12/site-packages/casatasks/initweights.py:133: in __call__
    task_result = _initweights_t( _pc.document['vis'], _pc.document['wtmode'], _pc.document['tsystable'], _pc.document['gainfield'], _pc.document['interp'], _pc.document['spwmap'], _pc.document['dowtsp'] )
                  ^^^^^^^^^^^^^^^^^^^^^^^^^^^^^^^^^^^^^^^^^^^^^^^^^^^^^^^^^^^^^^^^^^^^^^^^^^^^^^^^^^^^^^^^^^^^^^^^^^^^^^^^^^^^^^^^^^^^^^^^^^^^^^^^^^^^^^^^^^^^^^^^^^^^^^^^^^^^^^^^^^^^^^^^^^^^^^^^^^^^^^^^^^^
(9 more lines...)
Collapse Failed test_task_initweights initweights_base.testSigma
Test Tasks Many Linux 2.28 Rocky 8.10 Py3.12 < 1 sec
RuntimeError: Error in Calibrater::initWeights.
test_task_initweights.py:569: in testSigma
    self._runTest('sigma', False, self.valid_spw)
test_task_initweights.py:162: in _runTest
    initweights(vis=self.inputms,wtmode=wtmode,
../../../../venv/lib/python3.12/site-packages/casatasks/initweights.py:133: in __call__
    task_result = _initweights_t( _pc.document['vis'], _pc.document['wtmode'], _pc.document['tsystable'], _pc.document['gainfield'], _pc.document['interp'], _pc.document['spwmap'], _pc.document['dowtsp'] )
                  ^^^^^^^^^^^^^^^^^^^^^^^^^^^^^^^^^^^^^^^^^^^^^^^^^^^^^^^^^^^^^^^^^^^^^^^^^^^^^^^^^^^^^^^^^^^^^^^^^^^^^^^^^^^^^^^^^^^^^^^^^^^^^^^^^^^^^^^^^^^^^^^^^^^^^^^^^^^^^^^^^^^^^^^^^^^^^^^^^^^^^^^^^^^
(9 more lines...)
Collapse Failed test_task_initweights initweights_tsys_base.testTinttsysLC
Test Tasks Many Linux 2.28 Rocky 8.10 Py3.12 < 1 sec
RuntimeError: Error in Calibrater::initWeights.
test_task_initweights.py:375: in testTinttsysLC
    self._runTest('tinttsys', False, self.tsys_funcs.keys(), 'nearest,nearest')
test_task_initweights.py:162: in _runTest
    initweights(vis=self.inputms,wtmode=wtmode,
../../../../venv/lib/python3.12/site-packages/casatasks/initweights.py:133: in __call__
    task_result = _initweights_t( _pc.document['vis'], _pc.document['wtmode'], _pc.document['tsystable'], _pc.document['gainfield'], _pc.document['interp'], _pc.document['spwmap'], _pc.document['dowtsp'] )
                  ^^^^^^^^^^^^^^^^^^^^^^^^^^^^^^^^^^^^^^^^^^^^^^^^^^^^^^^^^^^^^^^^^^^^^^^^^^^^^^^^^^^^^^^^^^^^^^^^^^^^^^^^^^^^^^^^^^^^^^^^^^^^^^^^^^^^^^^^^^^^^^^^^^^^^^^^^^^^^^^^^^^^^^^^^^^^^^^^^^^^^^^^^^^
(9 more lines...)
Collapse Failed test_task_initweights initweights_tsys_map.testTsysMapNN
Test Tasks Many Linux 2.28 Rocky 8.10 Py3.12 < 1 sec
RuntimeError: Error in Calibrater::initWeights.
test_task_initweights.py:459: in testTsysMapNN
    self._runTest('tsys', False, [1,3,5,7,9,15], 'nearest,nearest',self.spwmap)
test_task_initweights.py:162: in _runTest
    initweights(vis=self.inputms,wtmode=wtmode,
../../../../venv/lib/python3.12/site-packages/casatasks/initweights.py:133: in __call__
    task_result = _initweights_t( _pc.document['vis'], _pc.document['wtmode'], _pc.document['tsystable'], _pc.document['gainfield'], _pc.document['interp'], _pc.document['spwmap'], _pc.document['dowtsp'] )
                  ^^^^^^^^^^^^^^^^^^^^^^^^^^^^^^^^^^^^^^^^^^^^^^^^^^^^^^^^^^^^^^^^^^^^^^^^^^^^^^^^^^^^^^^^^^^^^^^^^^^^^^^^^^^^^^^^^^^^^^^^^^^^^^^^^^^^^^^^^^^^^^^^^^^^^^^^^^^^^^^^^^^^^^^^^^^^^^^^^^^^^^^^^^^
(9 more lines...)
Collapse Failed test_task_initweights initweights_tsys_base.testTinttsysNN
Test Tasks Many Linux 2.28 Rocky 8.10 Py3.12 < 1 sec
RuntimeError: Error in Calibrater::initWeights.
test_task_initweights.py:367: in testTinttsysNN
    self._runTest('tinttsys', False, self.tsys_funcs.keys(), 'nearest,nearest')
test_task_initweights.py:162: in _runTest
    initweights(vis=self.inputms,wtmode=wtmode,
../../../../venv/lib/python3.12/site-packages/casatasks/initweights.py:133: in __call__
    task_result = _initweights_t( _pc.document['vis'], _pc.document['wtmode'], _pc.document['tsystable'], _pc.document['gainfield'], _pc.document['interp'], _pc.document['spwmap'], _pc.document['dowtsp'] )
                  ^^^^^^^^^^^^^^^^^^^^^^^^^^^^^^^^^^^^^^^^^^^^^^^^^^^^^^^^^^^^^^^^^^^^^^^^^^^^^^^^^^^^^^^^^^^^^^^^^^^^^^^^^^^^^^^^^^^^^^^^^^^^^^^^^^^^^^^^^^^^^^^^^^^^^^^^^^^^^^^^^^^^^^^^^^^^^^^^^^^^^^^^^^^
(9 more lines...)
Collapse Failed test_task_initweights initweights_tsys_base.testTinttsysLL
Test Tasks Many Linux 2.28 Rocky 8.10 Py3.12 < 1 sec
RuntimeError: Error in Calibrater::initWeights.
test_task_initweights.py:371: in testTinttsysLL
    self._runTest('tinttsys', False, self.tsys_funcs.keys(), 'nearest,nearest')
test_task_initweights.py:162: in _runTest
    initweights(vis=self.inputms,wtmode=wtmode,
../../../../venv/lib/python3.12/site-packages/casatasks/initweights.py:133: in __call__
    task_result = _initweights_t( _pc.document['vis'], _pc.document['wtmode'], _pc.document['tsystable'], _pc.document['gainfield'], _pc.document['interp'], _pc.document['spwmap'], _pc.document['dowtsp'] )
                  ^^^^^^^^^^^^^^^^^^^^^^^^^^^^^^^^^^^^^^^^^^^^^^^^^^^^^^^^^^^^^^^^^^^^^^^^^^^^^^^^^^^^^^^^^^^^^^^^^^^^^^^^^^^^^^^^^^^^^^^^^^^^^^^^^^^^^^^^^^^^^^^^^^^^^^^^^^^^^^^^^^^^^^^^^^^^^^^^^^^^^^^^^^^
(9 more lines...)
Collapse Failed test_task_initweights initweights_tsys_base.testTsysLLSp
Test Tasks Many Linux 2.28 Rocky 8.10 Py3.12 < 1 sec
RuntimeError: Error in Calibrater::initWeights.
test_task_initweights.py:383: in testTsysLLSp
    self._runTest('tsys', True, self.tsys_funcs.keys(), 'linear,linear')
test_task_initweights.py:162: in _runTest
    initweights(vis=self.inputms,wtmode=wtmode,
../../../../venv/lib/python3.12/site-packages/casatasks/initweights.py:133: in __call__
    task_result = _initweights_t( _pc.document['vis'], _pc.document['wtmode'], _pc.document['tsystable'], _pc.document['gainfield'], _pc.document['interp'], _pc.document['spwmap'], _pc.document['dowtsp'] )
                  ^^^^^^^^^^^^^^^^^^^^^^^^^^^^^^^^^^^^^^^^^^^^^^^^^^^^^^^^^^^^^^^^^^^^^^^^^^^^^^^^^^^^^^^^^^^^^^^^^^^^^^^^^^^^^^^^^^^^^^^^^^^^^^^^^^^^^^^^^^^^^^^^^^^^^^^^^^^^^^^^^^^^^^^^^^^^^^^^^^^^^^^^^^^
(9 more lines...)
Collapse Failed test_task_initweights initweights_tsys_map.testTinttsysMapLL
Test Tasks Many Linux 2.28 Rocky 8.10 Py3.12 < 1 sec
RuntimeError: Error in Calibrater::initWeights.
test_task_initweights.py:475: in testTinttsysMapLL
    self._runTest('tinttsys', False, [1,3,5,7,9,11,15], 'linear,linear',self.spwmap)
test_task_initweights.py:162: in _runTest
    initweights(vis=self.inputms,wtmode=wtmode,
../../../../venv/lib/python3.12/site-packages/casatasks/initweights.py:133: in __call__
    task_result = _initweights_t( _pc.document['vis'], _pc.document['wtmode'], _pc.document['tsystable'], _pc.document['gainfield'], _pc.document['interp'], _pc.document['spwmap'], _pc.document['dowtsp'] )
                  ^^^^^^^^^^^^^^^^^^^^^^^^^^^^^^^^^^^^^^^^^^^^^^^^^^^^^^^^^^^^^^^^^^^^^^^^^^^^^^^^^^^^^^^^^^^^^^^^^^^^^^^^^^^^^^^^^^^^^^^^^^^^^^^^^^^^^^^^^^^^^^^^^^^^^^^^^^^^^^^^^^^^^^^^^^^^^^^^^^^^^^^^^^^
(9 more lines...)
Collapse Failed test_task_initweights initweights_tsys_map.testTinttsysMapNNSp
Test Tasks Many Linux 2.28 Rocky 8.10 Py3.12 < 1 sec
RuntimeError: Error in Calibrater::initWeights.
test_task_initweights.py:495: in testTinttsysMapNNSp
    self._runTest('tinttsys', True, [1,3,5,7,9,15], 'nearest,nearest',self.spwmap)
test_task_initweights.py:162: in _runTest
    initweights(vis=self.inputms,wtmode=wtmode,
../../../../venv/lib/python3.12/site-packages/casatasks/initweights.py:133: in __call__
    task_result = _initweights_t( _pc.document['vis'], _pc.document['wtmode'], _pc.document['tsystable'], _pc.document['gainfield'], _pc.document['interp'], _pc.document['spwmap'], _pc.document['dowtsp'] )
                  ^^^^^^^^^^^^^^^^^^^^^^^^^^^^^^^^^^^^^^^^^^^^^^^^^^^^^^^^^^^^^^^^^^^^^^^^^^^^^^^^^^^^^^^^^^^^^^^^^^^^^^^^^^^^^^^^^^^^^^^^^^^^^^^^^^^^^^^^^^^^^^^^^^^^^^^^^^^^^^^^^^^^^^^^^^^^^^^^^^^^^^^^^^^
(9 more lines...)
Collapse Failed test_task_initweights initweights_base.testNyqSp
Test Tasks Many Linux 2.28 Rocky 8.10 Py3.12 < 1 sec
RuntimeError: Error in Calibrater::initWeights.
test_task_initweights.py:565: in testNyqSp
    self._runTest('nyq', True, self.valid_spw)
test_task_initweights.py:162: in _runTest
    initweights(vis=self.inputms,wtmode=wtmode,
../../../../venv/lib/python3.12/site-packages/casatasks/initweights.py:133: in __call__
    task_result = _initweights_t( _pc.document['vis'], _pc.document['wtmode'], _pc.document['tsystable'], _pc.document['gainfield'], _pc.document['interp'], _pc.document['spwmap'], _pc.document['dowtsp'] )
                  ^^^^^^^^^^^^^^^^^^^^^^^^^^^^^^^^^^^^^^^^^^^^^^^^^^^^^^^^^^^^^^^^^^^^^^^^^^^^^^^^^^^^^^^^^^^^^^^^^^^^^^^^^^^^^^^^^^^^^^^^^^^^^^^^^^^^^^^^^^^^^^^^^^^^^^^^^^^^^^^^^^^^^^^^^^^^^^^^^^^^^^^^^^^
(9 more lines...)
Collapse Failed test_task_initweights initweights_tsys_map.testTsysMapLLSp
Test Tasks Many Linux 2.28 Rocky 8.10 Py3.12 < 1 sec
RuntimeError: Error in Calibrater::initWeights.
test_task_initweights.py:487: in testTsysMapLLSp
    self._runTest('tsys', True, [1,3,5,7,9,11,15], 'linear,linear',self.spwmap)
test_task_initweights.py:162: in _runTest
    initweights(vis=self.inputms,wtmode=wtmode,
../../../../venv/lib/python3.12/site-packages/casatasks/initweights.py:133: in __call__
    task_result = _initweights_t( _pc.document['vis'], _pc.document['wtmode'], _pc.document['tsystable'], _pc.document['gainfield'], _pc.document['interp'], _pc.document['spwmap'], _pc.document['dowtsp'] )
                  ^^^^^^^^^^^^^^^^^^^^^^^^^^^^^^^^^^^^^^^^^^^^^^^^^^^^^^^^^^^^^^^^^^^^^^^^^^^^^^^^^^^^^^^^^^^^^^^^^^^^^^^^^^^^^^^^^^^^^^^^^^^^^^^^^^^^^^^^^^^^^^^^^^^^^^^^^^^^^^^^^^^^^^^^^^^^^^^^^^^^^^^^^^^
(9 more lines...)
Collapse Failed test_task_initweights initweights_tsys_base.testTinttsysLCSp
Test Tasks Many Linux 2.28 Rocky 8.10 Py3.12 < 1 sec
RuntimeError: Error in Calibrater::initWeights.
test_task_initweights.py:399: in testTinttsysLCSp
    self._runTest('tinttsys', True, self.tsys_funcs.keys(), 'nearest,nearest')
test_task_initweights.py:162: in _runTest
    initweights(vis=self.inputms,wtmode=wtmode,
../../../../venv/lib/python3.12/site-packages/casatasks/initweights.py:133: in __call__
    task_result = _initweights_t( _pc.document['vis'], _pc.document['wtmode'], _pc.document['tsystable'], _pc.document['gainfield'], _pc.document['interp'], _pc.document['spwmap'], _pc.document['dowtsp'] )
                  ^^^^^^^^^^^^^^^^^^^^^^^^^^^^^^^^^^^^^^^^^^^^^^^^^^^^^^^^^^^^^^^^^^^^^^^^^^^^^^^^^^^^^^^^^^^^^^^^^^^^^^^^^^^^^^^^^^^^^^^^^^^^^^^^^^^^^^^^^^^^^^^^^^^^^^^^^^^^^^^^^^^^^^^^^^^^^^^^^^^^^^^^^^^
(9 more lines...)
Collapse Failed test_task_initweights initweights_tsys_map.testTinttsysMapLLSp
Test Tasks Many Linux 2.28 Rocky 8.10 Py3.12 < 1 sec
RuntimeError: Error in Calibrater::initWeights.
test_task_initweights.py:499: in testTinttsysMapLLSp
    self._runTest('tinttsys', True, [1,3,5,7,9,11,15], 'linear,linear',self.spwmap)
test_task_initweights.py:162: in _runTest
    initweights(vis=self.inputms,wtmode=wtmode,
../../../../venv/lib/python3.12/site-packages/casatasks/initweights.py:133: in __call__
    task_result = _initweights_t( _pc.document['vis'], _pc.document['wtmode'], _pc.document['tsystable'], _pc.document['gainfield'], _pc.document['interp'], _pc.document['spwmap'], _pc.document['dowtsp'] )
                  ^^^^^^^^^^^^^^^^^^^^^^^^^^^^^^^^^^^^^^^^^^^^^^^^^^^^^^^^^^^^^^^^^^^^^^^^^^^^^^^^^^^^^^^^^^^^^^^^^^^^^^^^^^^^^^^^^^^^^^^^^^^^^^^^^^^^^^^^^^^^^^^^^^^^^^^^^^^^^^^^^^^^^^^^^^^^^^^^^^^^^^^^^^^
(9 more lines...)
Collapse Failed test_task_initweights initweights_tsys_map.testTsysMapLC
Test Tasks Many Linux 2.28 Rocky 8.10 Py3.12 < 1 sec
RuntimeError: Error in Calibrater::initWeights.
test_task_initweights.py:467: in testTsysMapLC
    self._runTest('tsys', False, [1,3,5,7,9,11,13,15], 'linear,cspline',self.spwmap)
test_task_initweights.py:162: in _runTest
    initweights(vis=self.inputms,wtmode=wtmode,
../../../../venv/lib/python3.12/site-packages/casatasks/initweights.py:133: in __call__
    task_result = _initweights_t( _pc.document['vis'], _pc.document['wtmode'], _pc.document['tsystable'], _pc.document['gainfield'], _pc.document['interp'], _pc.document['spwmap'], _pc.document['dowtsp'] )
                  ^^^^^^^^^^^^^^^^^^^^^^^^^^^^^^^^^^^^^^^^^^^^^^^^^^^^^^^^^^^^^^^^^^^^^^^^^^^^^^^^^^^^^^^^^^^^^^^^^^^^^^^^^^^^^^^^^^^^^^^^^^^^^^^^^^^^^^^^^^^^^^^^^^^^^^^^^^^^^^^^^^^^^^^^^^^^^^^^^^^^^^^^^^^
(9 more lines...)
Collapse Failed test_task_initweights initweights_base.testWeightSp
Test Tasks Many Linux 2.28 Rocky 8.10 Py3.12 < 1 sec
RuntimeError: Error in Calibrater::initWeights.
test_task_initweights.py:591: in testWeightSp
    self._runTest('weight', True, self.valid_spw)
test_task_initweights.py:162: in _runTest
    initweights(vis=self.inputms,wtmode=wtmode,
../../../../venv/lib/python3.12/site-packages/casatasks/initweights.py:133: in __call__
    task_result = _initweights_t( _pc.document['vis'], _pc.document['wtmode'], _pc.document['tsystable'], _pc.document['gainfield'], _pc.document['interp'], _pc.document['spwmap'], _pc.document['dowtsp'] )
                  ^^^^^^^^^^^^^^^^^^^^^^^^^^^^^^^^^^^^^^^^^^^^^^^^^^^^^^^^^^^^^^^^^^^^^^^^^^^^^^^^^^^^^^^^^^^^^^^^^^^^^^^^^^^^^^^^^^^^^^^^^^^^^^^^^^^^^^^^^^^^^^^^^^^^^^^^^^^^^^^^^^^^^^^^^^^^^^^^^^^^^^^^^^^
(9 more lines...)
Collapse Failed test_task_initweights initweights_tsys_map.testTsysMapLCSp
Test Tasks Many Linux 2.28 Rocky 8.10 Py3.12 < 1 sec
RuntimeError: Error in Calibrater::initWeights.
test_task_initweights.py:491: in testTsysMapLCSp
    self._runTest('tsys', True, [1,3,5,7,9,11,13,15], 'linear,cspline',self.spwmap)
test_task_initweights.py:162: in _runTest
    initweights(vis=self.inputms,wtmode=wtmode,
../../../../venv/lib/python3.12/site-packages/casatasks/initweights.py:133: in __call__
    task_result = _initweights_t( _pc.document['vis'], _pc.document['wtmode'], _pc.document['tsystable'], _pc.document['gainfield'], _pc.document['interp'], _pc.document['spwmap'], _pc.document['dowtsp'] )
                  ^^^^^^^^^^^^^^^^^^^^^^^^^^^^^^^^^^^^^^^^^^^^^^^^^^^^^^^^^^^^^^^^^^^^^^^^^^^^^^^^^^^^^^^^^^^^^^^^^^^^^^^^^^^^^^^^^^^^^^^^^^^^^^^^^^^^^^^^^^^^^^^^^^^^^^^^^^^^^^^^^^^^^^^^^^^^^^^^^^^^^^^^^^^
(9 more lines...)
Collapse Failed test_task_initweights initweights_tsys_map.testTinttsysMapLCSp
Test Tasks Many Linux 2.28 Rocky 8.10 Py3.12 < 1 sec
RuntimeError: Error in Calibrater::initWeights.
test_task_initweights.py:503: in testTinttsysMapLCSp
    self._runTest('tinttsys', True, [1,3,5,7,9,11,13,15], 'linear,cspline',self.spwmap)
test_task_initweights.py:162: in _runTest
    initweights(vis=self.inputms,wtmode=wtmode,
../../../../venv/lib/python3.12/site-packages/casatasks/initweights.py:133: in __call__
    task_result = _initweights_t( _pc.document['vis'], _pc.document['wtmode'], _pc.document['tsystable'], _pc.document['gainfield'], _pc.document['interp'], _pc.document['spwmap'], _pc.document['dowtsp'] )
                  ^^^^^^^^^^^^^^^^^^^^^^^^^^^^^^^^^^^^^^^^^^^^^^^^^^^^^^^^^^^^^^^^^^^^^^^^^^^^^^^^^^^^^^^^^^^^^^^^^^^^^^^^^^^^^^^^^^^^^^^^^^^^^^^^^^^^^^^^^^^^^^^^^^^^^^^^^^^^^^^^^^^^^^^^^^^^^^^^^^^^^^^^^^^
(9 more lines...)
Collapse Failed test_task_initweights initweights_tsys_base.testTsysLCSp
Test Tasks Many Linux 2.28 Rocky 8.10 Py3.12 < 1 sec
RuntimeError: Error in Calibrater::initWeights.
test_task_initweights.py:387: in testTsysLCSp
    self._runTest('tsys', True, self.tsys_funcs.keys(), 'linear,cspline')
test_task_initweights.py:162: in _runTest
    initweights(vis=self.inputms,wtmode=wtmode,
../../../../venv/lib/python3.12/site-packages/casatasks/initweights.py:133: in __call__
    task_result = _initweights_t( _pc.document['vis'], _pc.document['wtmode'], _pc.document['tsystable'], _pc.document['gainfield'], _pc.document['interp'], _pc.document['spwmap'], _pc.document['dowtsp'] )
                  ^^^^^^^^^^^^^^^^^^^^^^^^^^^^^^^^^^^^^^^^^^^^^^^^^^^^^^^^^^^^^^^^^^^^^^^^^^^^^^^^^^^^^^^^^^^^^^^^^^^^^^^^^^^^^^^^^^^^^^^^^^^^^^^^^^^^^^^^^^^^^^^^^^^^^^^^^^^^^^^^^^^^^^^^^^^^^^^^^^^^^^^^^^^
(9 more lines...)
Collapse Failed test_task_initweights initweights_tsys_map.testTsysMapNNSp
Test Tasks Many Linux 2.28 Rocky 8.10 Py3.12 < 1 sec
RuntimeError: Error in Calibrater::initWeights.
test_task_initweights.py:483: in testTsysMapNNSp
    self._runTest('tsys', True, [1,3,5,7,9,15], 'nearest,nearest',self.spwmap)
test_task_initweights.py:162: in _runTest
    initweights(vis=self.inputms,wtmode=wtmode,
../../../../venv/lib/python3.12/site-packages/casatasks/initweights.py:133: in __call__
    task_result = _initweights_t( _pc.document['vis'], _pc.document['wtmode'], _pc.document['tsystable'], _pc.document['gainfield'], _pc.document['interp'], _pc.document['spwmap'], _pc.document['dowtsp'] )
                  ^^^^^^^^^^^^^^^^^^^^^^^^^^^^^^^^^^^^^^^^^^^^^^^^^^^^^^^^^^^^^^^^^^^^^^^^^^^^^^^^^^^^^^^^^^^^^^^^^^^^^^^^^^^^^^^^^^^^^^^^^^^^^^^^^^^^^^^^^^^^^^^^^^^^^^^^^^^^^^^^^^^^^^^^^^^^^^^^^^^^^^^^^^^
(9 more lines...)
Collapse Failed test_task_initweights initweights_tsys_base.testTsysLC
Test Tasks Many Linux 2.28 Rocky 8.10 Py3.12 < 1 sec
RuntimeError: Error in Calibrater::initWeights.
test_task_initweights.py:363: in testTsysLC
    self._runTest('tsys', False, self.tsys_funcs.keys(), 'linear,cspline')
test_task_initweights.py:162: in _runTest
    initweights(vis=self.inputms,wtmode=wtmode,
../../../../venv/lib/python3.12/site-packages/casatasks/initweights.py:133: in __call__
    task_result = _initweights_t( _pc.document['vis'], _pc.document['wtmode'], _pc.document['tsystable'], _pc.document['gainfield'], _pc.document['interp'], _pc.document['spwmap'], _pc.document['dowtsp'] )
                  ^^^^^^^^^^^^^^^^^^^^^^^^^^^^^^^^^^^^^^^^^^^^^^^^^^^^^^^^^^^^^^^^^^^^^^^^^^^^^^^^^^^^^^^^^^^^^^^^^^^^^^^^^^^^^^^^^^^^^^^^^^^^^^^^^^^^^^^^^^^^^^^^^^^^^^^^^^^^^^^^^^^^^^^^^^^^^^^^^^^^^^^^^^^
(9 more lines...)
Collapse Failed test_task_pccor pccor_test_parse.test_parseSpw
Test Tasks Many Linux 2.28 Rocky 8.10 Py3.12 < 1 sec
RuntimeError: Error in Calibrater::solve.
test_task_pccor.py:139: in test_parseSpw
    ret_dict = run_pccor(spw=f'!{bad_spw}')
               ^^^^^^^^^^^^^^^^^^^^^^^^^^^^
test_task_pccor.py:43: in run_pccor
    ret_dict = pccor(
../../../../venv/lib/python3.12/site-packages/casatasks/pccor.py:62: in __call__
    task_result = _pccor_t( _pc.document['vis'], _pc.document['pccor_caltable'], _pc.document['refant'], _pc.document['timerange'], _pc.document['scan'], _pc.document['spw'], _pc.document['antenna'], _pc.document['cablecal_correction'], _pc.document['ff_table'] )
(18 more lines...)
Collapse Failed test_task_pccor pccor_test_missing.test_missingPcDataUseFringefit
Test Tasks Many Linux 2.28 Rocky 8.10 Py3.12 < 1 sec
RuntimeError: Error in Calibrater::solve.
test_task_pccor.py:310: in test_missingPcDataUseFringefit
    ret_data = run_pccor()
               ^^^^^^^^^^^
test_task_pccor.py:43: in run_pccor
    ret_dict = pccor(
../../../../venv/lib/python3.12/site-packages/casatasks/pccor.py:62: in __call__
    task_result = _pccor_t( _pc.document['vis'], _pc.document['pccor_caltable'], _pc.document['refant'], _pc.document['timerange'], _pc.document['scan'], _pc.document['spw'], _pc.document['antenna'], _pc.document['cablecal_correction'], _pc.document['ff_table'] )
(18 more lines...)
Collapse Failed test_task_pccor pccor_test_parse.test_parseAntenna
Test Tasks Many Linux 2.28 Rocky 8.10 Py3.12 3 secs
RuntimeError: Error in Calibrater::solve.
test_task_pccor.py:105: in test_parseAntenna
    ret_dict = run_pccor(antenna=f'!{bad_ant}')
               ^^^^^^^^^^^^^^^^^^^^^^^^^^^^^^^^
test_task_pccor.py:43: in run_pccor
    ret_dict = pccor(
../../../../venv/lib/python3.12/site-packages/casatasks/pccor.py:62: in __call__
    task_result = _pccor_t( _pc.document['vis'], _pc.document['pccor_caltable'], _pc.document['refant'], _pc.document['timerange'], _pc.document['scan'], _pc.document['spw'], _pc.document['antenna'], _pc.document['cablecal_correction'], _pc.document['ff_table'] )
(18 more lines...)
Collapse Failed test_task_pccor pccor_test_parse.test_parseAntenna_antennas_specified
Test Tasks Many Linux 2.28 Rocky 8.10 Py3.12 < 1 sec
RuntimeError: Error in Calibrater::solve.
test_task_pccor.py:116: in test_parseAntenna_antennas_specified
    ret_dict = run_pccor(antenna=f','.join(ant_list))
               ^^^^^^^^^^^^^^^^^^^^^^^^^^^^^^^^^^^^^^
test_task_pccor.py:43: in run_pccor
    ret_dict = pccor(
../../../../venv/lib/python3.12/site-packages/casatasks/pccor.py:62: in __call__
    task_result = _pccor_t( _pc.document['vis'], _pc.document['pccor_caltable'], _pc.document['refant'], _pc.document['timerange'], _pc.document['scan'], _pc.document['spw'], _pc.document['antenna'], _pc.document['cablecal_correction'], _pc.document['ff_table'] )
(18 more lines...)
Collapse Failed test_task_pccor pccor_test_missing.test_missingPhaseCalSubtable
Test Tasks Many Linux 2.28 Rocky 8.10 Py3.12 < 1 sec
failed on teardown with "FileNotFoundError: [Errno 2] No such file or directory: 'pccor_test.pccor'"
test_task_pccor.py:301: in tearDownClass
    shutil.rmtree(def_pccor_caltable)
/usr/local/lib/python3.12/shutil.py:759: in rmtree
    _rmtree_safe_fd(stack, onexc)
/usr/local/lib/python3.12/shutil.py:703: in _rmtree_safe_fd
    onexc(func, path, err)
/usr/local/lib/python3.12/shutil.py:669: in _rmtree_safe_fd
(3 more lines...)
Collapse Failed test_task_pccor pccor_test_solutionValues.test_solutionValues
Test Tasks Many Linux 2.28 Rocky 8.10 Py3.12 3 secs
RuntimeError: Error in Calibrater::solve.
test_task_pccor.py:277: in test_solutionValues
    run_pccor()
test_task_pccor.py:43: in run_pccor
    ret_dict = pccor(
../../../../venv/lib/python3.12/site-packages/casatasks/pccor.py:62: in __call__
    task_result = _pccor_t( _pc.document['vis'], _pc.document['pccor_caltable'], _pc.document['refant'], _pc.document['timerange'], _pc.document['scan'], _pc.document['spw'], _pc.document['antenna'], _pc.document['cablecal_correction'], _pc.document['ff_table'] )
                  ^^^^^^^^^^^^^^^^^^^^^^^^^^^^^^^^^^^^^^^^^^^^^^^^^^^^^^^^^^^^^^^^^^^^^^^^^^^^^^^^^^^^^^^^^^^^^^^^^^^^^^^^^^^^^^^^^^^^^^^^^^^^^^^^^^^^^^^^^^^^^^^^^^^^^^^^^^^^^^^^^^^^^^^^^^^^^^^^^^^^^^^^^^^^^^^^^^^^^^^^^^^^^^^^^^^^^^^^^^^^^^^^^^^^^^^^^^^^^^^^^^^^^
(17 more lines...)
Collapse Failed test_task_pccor pccor_test_splitMses.test_splitMses_contiguous_ms
Test Tasks Many Linux 2.28 Rocky 8.10 Py3.12 < 1 sec
AssertionError: False is not true : pccor should not throw exceptions with a contigous split ms
test_task_pccor.py:352: in test_splitMses_contiguous_ms
    self.assertTrue(passed, 'pccor should not throw exceptions with a contigous split ms')
E   AssertionError: False is not true : pccor should not throw exceptions with a contigous split ms
Collapse Failed test_task_pccor pccor_test_parse.test_provideFringeFitTable_equal
Test Tasks Many Linux 2.28 Rocky 8.10 Py3.12 < 1 sec
RuntimeError: Error in Calibrater::solve.
test_task_pccor.py:233: in test_provideFringeFitTable_equal
    fringefit(vis=def_ms,
../../../../venv/lib/python3.12/site-packages/casatasks/fringefit.py:211: in __call__
    task_result = _fringefit_t( _pc.document['vis'], _pc.document['caltable'], _pc.document['field'], _pc.document['spw'], _pc.document['intent'], _pc.document['selectdata'], _pc.document['timerange'], _pc.document['uvrange'], _pc.document['antenna'], _pc.document['scan'], _pc.document['observation'], _pc.document['msselect'], _pc.document['solint'], _pc.document['combine'], _pc.document['refant'], _pc.document['minsnr'], _pc.document['zerorates'], _pc.document['globalsolve'], _pc.document['niter'], _pc.document['delaywindow'], _pc.document['ratewindow'], _pc.document['append'], _pc.document['corrdepflags'], _pc.document['corrcomb'], _pc.document['docallib'], _pc.document['callib'], _pc.document['gaintable'], _pc.document['gainfield'], _pc.document['interp'], _pc.document['spwmap'], _pc.document['paramactive'], _pc.document['concatspws'], _pc.document['parang'] )
                  ^^^^^^^^^^^^^^^^^^^^^^^^^^^^^^^^^^^^^^^^^^^^^^^^^^^^^^^^^^^^^^^^^^^^^^^^^^^^^^^^^^^^^^^^^^^^^^^^^^^^^^^^^^^^^^^^^^^^^^^^^^^^^^^^^^^^^^^^^^^^^^^^^^^^^^^^^^^^^^^^^^^^^^^^^^^^^^^^^^^^^^^^^^^^^^^^^^^^^^^^^^^^^^^^^^^^^^^^^^^^^^^^^^^^^^^^^^^^^^^^^^^^^^^^^^^^^^^^^^^^^^^^^^^^^^^^^^^^^^^^^^^^^^^^^^^^^^^^^^^^^^^^^^^^^^^^^^^^^^^^^^^^^^^^^^^^^^^^^^^^^^^^^^^^^^^^^^^^^^^^^^^^^^^^^^^^^^^^^^^^^^^^^^^^^^^^^^^^^^^^^^^^^^^^^^^^^^^^^^^^^^^^^^^^^^^^^^^^^^^^^^^^^^^^^^^^^^^^^^^^^^^^^^^^^^^^^^^^^^^^^^^^^^^^^^^^^^^^^^^^^^^^^^^^^^^^^^^^^^^^^^^^^^^^^^^^^^^^^^^^^^^^^^^^^^^^^^^^^^^^^^^^^^^^^^^^^^^^^^^^^^^^^^^^^^^^^^^^^^^^^^^^^^^^^^^^^^^^^^^^^^^^^^^^^^^^^^^^^^^^^^^^^^^^^^^^^^^^^^^^^^^^^^^^^^^^^^^^^^^^^^^^^^^^^^^^^^^^^^^^^^^^^^^^^^^^^^^^^^^^^^^^^^^^^^^^^^^^^^^^^^^^^^^^^^^^^^^^^^^^^^^^^^^^^^^^^^^^^^^^^^^^^^^^^^^^^^^^^^^^^^^^^^^^^^^^^^^^^^^^^^^^^^^^^^^^^^^^^^^^^^^^^^^^^^^^^^^^^
../../../../venv/lib/python3.12/site-packages/casatasks/private/task_fringefit.py:133: in fringefit
    mycb.solve()
(7 more lines...)
Collapse Failed test_task_pccor pccor_test_splitMses.test_splitMses_non_contiguous_ms
Test Tasks Many Linux 2.28 Rocky 8.10 Py3.12 < 1 sec
AssertionError: False is not true : pccor should not throw exceptions with a non contigous split ms
test_task_pccor.py:360: in test_splitMses_non_contiguous_ms
    self.assertTrue(passed, 'pccor should not throw exceptions with a non contigous split ms')
E   AssertionError: False is not true : pccor should not throw exceptions with a non contigous split ms
Collapse Failed test_task_phaseshift phaseshift_test.test_intentSelect
Test Tasks Many Linux 2.28 Rocky 8.10 Py3.12 < 1 sec
RuntimeError: Measures directory specified which does not contain the IERS data: /home/casatest/data/measures
test_task_phaseshift.py:249: in test_intentSelect
    phaseshift(
../../../../venv/lib/python3.12/site-packages/casatasks/phaseshift.py:153: in __call__
    task_result = _phaseshift_t( _pc.document['vis'], _pc.document['outputvis'], _pc.document['keepmms'], _pc.document['field'], _pc.document['spw'], _pc.document['scan'], _pc.document['intent'], _pc.document['array'], _pc.document['observation'], _pc.document['datacolumn'], _pc.document['phasecenter'] )
                  ^^^^^^^^^^^^^^^^^^^^^^^^^^^^^^^^^^^^^^^^^^^^^^^^^^^^^^^^^^^^^^^^^^^^^^^^^^^^^^^^^^^^^^^^^^^^^^^^^^^^^^^^^^^^^^^^^^^^^^^^^^^^^^^^^^^^^^^^^^^^^^^^^^^^^^^^^^^^^^^^^^^^^^^^^^^^^^^^^^^^^^^^^^^^^^^^^^^^^^^^^^^^^^^^^^^^^^^^^^^^^^^^^^^^^^^^^^^^^^^^^^^^^^^^^^^^^^^^^^^^^^^^^^^^^^^^^^^^^^^^^^^^^^^
../../../../venv/lib/python3.12/site-packages/casatasks/private/task_phaseshift.py:99: in phaseshift
    mtlocal.open()
(7 more lines...)
Collapse Failed test_task_phaseshift phaseshift_test.test_takesVis
Test Tasks Many Linux 2.28 Rocky 8.10 Py3.12 < 1 sec
RuntimeError: Measures directory specified which does not contain the IERS data: /home/casatest/data/measures
test_task_phaseshift.py:200: in test_takesVis
    result = phaseshift(
../../../../venv/lib/python3.12/site-packages/casatasks/phaseshift.py:153: in __call__
    task_result = _phaseshift_t( _pc.document['vis'], _pc.document['outputvis'], _pc.document['keepmms'], _pc.document['field'], _pc.document['spw'], _pc.document['scan'], _pc.document['intent'], _pc.document['array'], _pc.document['observation'], _pc.document['datacolumn'], _pc.document['phasecenter'] )
                  ^^^^^^^^^^^^^^^^^^^^^^^^^^^^^^^^^^^^^^^^^^^^^^^^^^^^^^^^^^^^^^^^^^^^^^^^^^^^^^^^^^^^^^^^^^^^^^^^^^^^^^^^^^^^^^^^^^^^^^^^^^^^^^^^^^^^^^^^^^^^^^^^^^^^^^^^^^^^^^^^^^^^^^^^^^^^^^^^^^^^^^^^^^^^^^^^^^^^^^^^^^^^^^^^^^^^^^^^^^^^^^^^^^^^^^^^^^^^^^^^^^^^^^^^^^^^^^^^^^^^^^^^^^^^^^^^^^^^^^^^^^^^^^^
../../../../venv/lib/python3.12/site-packages/casatasks/private/task_phaseshift.py:99: in phaseshift
    mtlocal.open()
(7 more lines...)
Collapse Failed test_task_phaseshift phaseshift_test.test_spwSelect
Test Tasks Many Linux 2.28 Rocky 8.10 Py3.12 < 1 sec
RuntimeError: Measures directory specified which does not contain the IERS data: /home/casatest/data/measures
test_task_phaseshift.py:235: in test_spwSelect
    phaseshift(
../../../../venv/lib/python3.12/site-packages/casatasks/phaseshift.py:153: in __call__
    task_result = _phaseshift_t( _pc.document['vis'], _pc.document['outputvis'], _pc.document['keepmms'], _pc.document['field'], _pc.document['spw'], _pc.document['scan'], _pc.document['intent'], _pc.document['array'], _pc.document['observation'], _pc.document['datacolumn'], _pc.document['phasecenter'] )
                  ^^^^^^^^^^^^^^^^^^^^^^^^^^^^^^^^^^^^^^^^^^^^^^^^^^^^^^^^^^^^^^^^^^^^^^^^^^^^^^^^^^^^^^^^^^^^^^^^^^^^^^^^^^^^^^^^^^^^^^^^^^^^^^^^^^^^^^^^^^^^^^^^^^^^^^^^^^^^^^^^^^^^^^^^^^^^^^^^^^^^^^^^^^^^^^^^^^^^^^^^^^^^^^^^^^^^^^^^^^^^^^^^^^^^^^^^^^^^^^^^^^^^^^^^^^^^^^^^^^^^^^^^^^^^^^^^^^^^^^^^^^^^^^^
../../../../venv/lib/python3.12/site-packages/casatasks/private/task_phaseshift.py:99: in phaseshift
    mtlocal.open()
(7 more lines...)