Test Tools and Tasks using measures at go (dot) nrao (dot) edu (slash)iers

Build: #10 failed

Job: Test Tasks Many Linux 2.28 Rocky 8.10 Py3.12 failed

Build log

The build generated 7,158 lines of output.   The output is too long and has been truncated to the last 1,000 lines. Download or view full build log.

27-Oct-2026 10:54:10 ============================= test session starts ==============================
27-Oct-2026 10:54:10 platform linux -- Python 3.12.9, pytest-9.1.1, pluggy-1.7.0 -- /home/casatest/venv/bin/python3.12
27-Oct-2026 10:54:10 cachedir: .pytest_cache
27-Oct-2026 10:54:10 rootdir: /home/casatest/casa6/casatestutils/nosedir/test_task_sdgaincal
27-Oct-2026 10:54:10 configfile: pytest.ini
27-Oct-2026 10:54:11 collecting ... 2026-10-27 14:54:11        WARN        ObsInfo::setTelescope (file /source/casa6/casatools/casacore/coordinates/Coordinates/ObsInfo.cc, line 124)        Cannot read table of Observatories, continuing without telescope position in ObsInfo
27-Oct-2026 10:54:11 collected 13 items
27-Oct-2026 10:54:11
27-Oct-2026 10:54:11
27-Oct-2026 10:54:11 test_task_sdgaincal.py::sdgaincal_fail_test::test_fail01
27-Oct-2026 10:54:11 test_fail01: infile not exist.
27-Oct-2026 10:54:11 PASSED
27-Oct-2026 10:54:11
27-Oct-2026 10:54:11 test_task_sdgaincal.py::sdgaincal_fail_test::test_fail02 2026-10-27 14:54:11        SEVERE        sdgaincal::::casa        Traceback (most recent call last):
27-Oct-2026 10:54:11 2026-10-27 14:54:11        SEVERE        sdgaincal::::casa+                     ^^^^^^^^^^^^^^^^^^^^^
27-Oct-2026 10:54:11 2026-10-27 14:54:11        SEVERE        sdgaincal::::casa+          File "/home/casatest/venv/lib/python3.12/site-packages/casatasks/private/task_sdgaincal.py", line 74, in sdgaincal
27-Oct-2026 10:54:11 2026-10-27 14:54:11        SEVERE        sdgaincal::::casa+            raise RuntimeError(outfile + ' exists.')
27-Oct-2026 10:54:11 2026-10-27 14:54:11        SEVERE        sdgaincal::::casa+        RuntimeError: sdgaincal_fail_test.sdgain.caltable exists.
27-Oct-2026 10:54:11 2026-10-27 14:54:11        SEVERE        sdgaincal::::casa        sdgaincal_fail_test.sdgain.caltable exists.
27-Oct-2026 10:54:11 2026-10-27 14:54:11        SEVERE        sdgaincal::::casa        Task sdgaincal raised an exception of class RuntimeError with the following message: sdgaincal_fail_test.sdgain.caltable exists.
27-Oct-2026 10:54:11
27-Oct-2026 10:54:11 test_fail02: not overwrite existing outfile.
27-Oct-2026 10:54:11 PASSED
27-Oct-2026 10:54:11
27-Oct-2026 10:54:11 test_task_sdgaincal.py::sdgaincal_fail_test::test_fail03
27-Oct-2026 10:54:11 test_fail03: wrong calibration mode.
27-Oct-2026 10:54:11 PASSED
27-Oct-2026 10:54:11
27-Oct-2026 10:54:11 test_task_sdgaincal.py::sdgaincal_fail_test::test_fail04 2026-10-27 14:54:11        SEVERE        sdgaincal::Calibrater::initialize (file /source/casa6/casatools/src/code/synthesis/MeasurementComponents/Calibrater.cc, line 433)        Caught exception: Measures directory specified which does not contain the IERS data: /home/casatest/data/measures
27-Oct-2026 10:54:11 2026-10-27 14:54:11        SEVERE        sdgaincal::::        Exception Reported: Error in Calibrater::initialize()
27-Oct-2026 10:54:11 2026-10-27 14:54:11        SEVERE        sdgaincal::::casa        Traceback (most recent call last):
27-Oct-2026 10:54:11 2026-10-27 14:54:11        SEVERE        sdgaincal::::casa+                     ^^^^^^^^^^^^^^^^^^^^^
27-Oct-2026 10:54:11 2026-10-27 14:54:11        SEVERE        sdgaincal::::casa+          File "/home/casatest/venv/lib/python3.12/site-packages/casatasks/private/task_sdgaincal.py", line 80, in sdgaincal
27-Oct-2026 10:54:11 2026-10-27 14:54:11        SEVERE        sdgaincal::::casa+            with calibrater_manager(infile) as mycb:
27-Oct-2026 10:54:11 2026-10-27 14:54:11        SEVERE        sdgaincal::::casa+                 ^^^^^^^^^^^^^^^^^^^^^^^^^^
27-Oct-2026 10:54:11 2026-10-27 14:54:11        SEVERE        sdgaincal::::casa+          File "/usr/local/lib/python3.12/contextlib.py", line 137, in __enter__
27-Oct-2026 10:54:11 2026-10-27 14:54:11        SEVERE        sdgaincal::::casa+            return next(self.gen)
27-Oct-2026 10:54:11 2026-10-27 14:54:11        SEVERE        sdgaincal::::casa+                   ^^^^^^^^^^^^^^
27-Oct-2026 10:54:11 2026-10-27 14:54:11        SEVERE        sdgaincal::::casa+          File "/home/casatest/venv/lib/python3.12/site-packages/casatasks/private/sdutil.py", line 49, in tool_manager
27-Oct-2026 10:54:11 2026-10-27 14:54:11        SEVERE        sdgaincal::::casa+            tool.open(vis, *args, **kwargs)
27-Oct-2026 10:54:11 2026-10-27 14:54:11        SEVERE        sdgaincal::::casa+          File "/home/casatest/venv/lib/python3.12/site-packages/casatools/calibrater.py", line 30, in open
27-Oct-2026 10:54:11 2026-10-27 14:54:11        SEVERE        sdgaincal::::casa+            return self._swigobj.open(filename, compress, addcorr, addmodel)
27-Oct-2026 10:54:11 2026-10-27 14:54:11        SEVERE        sdgaincal::::casa+                   ^^^^^^^^^^^^^^^^^^^^^^^^^^^^^^^^^^^^^^^^^^^^^^^^^^^^^^^^^
27-Oct-2026 10:54:11 2026-10-27 14:54:11        SEVERE        sdgaincal::::casa+          File "/home/casatest/venv/lib/python3.12/site-packages/casatools/__casac__/calibrater.py", line 143, in open
27-Oct-2026 10:54:11 2026-10-27 14:54:11        SEVERE        sdgaincal::::casa+            return _calibrater.calibrater_open(self, *args, **kwargs)
27-Oct-2026 10:54:11 2026-10-27 14:54:11        SEVERE        sdgaincal::::casa+                   ^^^^^^^^^^^^^^^^^^^^^^^^^^^^^^^^^^^^^^^^^^^^^^^^^^
27-Oct-2026 10:54:11 2026-10-27 14:54:11        SEVERE        sdgaincal::::casa+        RuntimeError: Error in Calibrater::initialize()
27-Oct-2026 10:54:11 2026-10-27 14:54:11        SEVERE        sdgaincal::::casa        Error in Calibrater::initialize()
27-Oct-2026 10:54:11 2026-10-27 14:54:11        SEVERE        sdgaincal::::casa        Task sdgaincal raised an exception of class RuntimeError with the following message: Error in Calibrater::initialize()
27-Oct-2026 10:54:11
27-Oct-2026 10:54:11 test_fail04: negative radius.
27-Oct-2026 10:54:11 PASSED
27-Oct-2026 10:54:11
27-Oct-2026 10:54:11 test_task_sdgaincal.py::sdgaincal_const_test::test_const01 2026-10-27 14:54:11        SEVERE        Calibrater::solve        Caught exception: Measures directory specified which does not contain the IERS data: /home/casatest/data/measures
27-Oct-2026 10:54:11 2026-10-27 14:54:11        SEVERE                Exception Reported: Error in Calibrater::solve.
27-Oct-2026 10:54:11 2026-10-27 14:54:11        SEVERE        sdgaincal::::casa        Traceback (most recent call last):
27-Oct-2026 10:54:11 2026-10-27 14:54:11        SEVERE        sdgaincal::::casa+                     ^^^^^^^^^^^^^^^^^^^^^
27-Oct-2026 10:54:11 2026-10-27 14:54:11        SEVERE        sdgaincal::::casa+          File "/home/casatest/venv/lib/python3.12/site-packages/casatasks/private/task_sdgaincal.py", line 132, in sdgaincal
27-Oct-2026 10:54:11 2026-10-27 14:54:11        SEVERE        sdgaincal::::casa+            mycb.solve()
27-Oct-2026 10:54:11 2026-10-27 14:54:11        SEVERE        sdgaincal::::casa+          File "/home/casatest/venv/lib/python3.12/site-packages/casatools/calibrater.py", line 485, in solve
27-Oct-2026 10:54:11 2026-10-27 14:54:11        SEVERE        sdgaincal::::casa+            return self._swigobj.solve()
27-Oct-2026 10:54:11 2026-10-27 14:54:11        SEVERE        sdgaincal::::casa+                   ^^^^^^^^^^^^^^^^^^^^^
27-Oct-2026 10:54:11 2026-10-27 14:54:11        SEVERE        sdgaincal::::casa+          File "/home/casatest/venv/lib/python3.12/site-packages/casatools/__casac__/calibrater.py", line 1133, in solve
27-Oct-2026 10:54:11 2026-10-27 14:54:11        SEVERE        sdgaincal::::casa+            return _calibrater.calibrater_solve(self)
27-Oct-2026 10:54:11 2026-10-27 14:54:11        SEVERE        sdgaincal::::casa+                   ^^^^^^^^^^^^^^^^^^^^^^^^^^^^^^^^^^
27-Oct-2026 10:54:11 2026-10-27 14:54:11        SEVERE        sdgaincal::::casa+        RuntimeError: Error in Calibrater::solve.
27-Oct-2026 10:54:11 2026-10-27 14:54:11        SEVERE        sdgaincal::::casa        Error in Calibrater::solve.
27-Oct-2026 10:54:11 2026-10-27 14:54:11        SEVERE        sdgaincal::::casa        Task sdgaincal raised an exception of class RuntimeError with the following message: Error in Calibrater::solve.
27-Oct-2026 10:54:11
27-Oct-2026 10:54:11 test_const01: too narrow central region, empty caltable is created.
27-Oct-2026 10:54:11 FAILED
27-Oct-2026 10:54:11
27-Oct-2026 10:54:11 test_task_sdgaincal.py::sdgaincal_const_test::test_const02 2026-10-27 14:54:11        SEVERE        Calibrater::solve        Caught exception: Measures directory specified which does not contain the IERS data: /home/casatest/data/measures
27-Oct-2026 10:54:11 2026-10-27 14:54:11        SEVERE                Exception Reported: Error in Calibrater::solve.
27-Oct-2026 10:54:11 2026-10-27 14:54:11        SEVERE        sdgaincal::::casa        Traceback (most recent call last):
27-Oct-2026 10:54:11 2026-10-27 14:54:11        SEVERE        sdgaincal::::casa+                     ^^^^^^^^^^^^^^^^^^^^^
27-Oct-2026 10:54:11 2026-10-27 14:54:11        SEVERE        sdgaincal::::casa+          File "/home/casatest/venv/lib/python3.12/site-packages/casatasks/private/task_sdgaincal.py", line 132, in sdgaincal
27-Oct-2026 10:54:11 2026-10-27 14:54:11        SEVERE        sdgaincal::::casa+            mycb.solve()
27-Oct-2026 10:54:11 2026-10-27 14:54:11        SEVERE        sdgaincal::::casa+          File "/home/casatest/venv/lib/python3.12/site-packages/casatools/calibrater.py", line 485, in solve
27-Oct-2026 10:54:11 2026-10-27 14:54:11        SEVERE        sdgaincal::::casa+            return self._swigobj.solve()
27-Oct-2026 10:54:11 2026-10-27 14:54:11        SEVERE        sdgaincal::::casa+                   ^^^^^^^^^^^^^^^^^^^^^
27-Oct-2026 10:54:11 2026-10-27 14:54:11        SEVERE        sdgaincal::::casa+          File "/home/casatest/venv/lib/python3.12/site-packages/casatools/__casac__/calibrater.py", line 1133, in solve
27-Oct-2026 10:54:11 2026-10-27 14:54:11        SEVERE        sdgaincal::::casa+            return _calibrater.calibrater_solve(self)
27-Oct-2026 10:54:11 2026-10-27 14:54:11        SEVERE        sdgaincal::::casa+                   ^^^^^^^^^^^^^^^^^^^^^^^^^^^^^^^^^^
27-Oct-2026 10:54:11 2026-10-27 14:54:11        SEVERE        sdgaincal::::casa+        RuntimeError: Error in Calibrater::solve.
27-Oct-2026 10:54:11 2026-10-27 14:54:11        SEVERE        sdgaincal::::casa        Error in Calibrater::solve.
27-Oct-2026 10:54:11 2026-10-27 14:54:11        SEVERE        sdgaincal::::casa        Task sdgaincal raised an exception of class RuntimeError with the following message: Error in Calibrater::solve.
27-Oct-2026 10:54:11
27-Oct-2026 10:54:11 test_const02: valid caltable is created. gain factor is all 1.0.
27-Oct-2026 10:54:11 FAILED
27-Oct-2026 10:54:11
27-Oct-2026 10:54:11 test_task_sdgaincal.py::sdgaincal_const_test::test_const03 2026-10-27 14:54:11        SEVERE        Calibrater::solve        Caught exception: Measures directory specified which does not contain the IERS data: /home/casatest/data/measures
27-Oct-2026 10:54:11 2026-10-27 14:54:11        SEVERE                Exception Reported: Error in Calibrater::solve.
27-Oct-2026 10:54:11 2026-10-27 14:54:11        SEVERE        sdgaincal::::casa        Traceback (most recent call last):
27-Oct-2026 10:54:11 2026-10-27 14:54:11        SEVERE        sdgaincal::::casa+                     ^^^^^^^^^^^^^^^^^^^^^
27-Oct-2026 10:54:11 2026-10-27 14:54:11        SEVERE        sdgaincal::::casa+          File "/home/casatest/venv/lib/python3.12/site-packages/casatasks/private/task_sdgaincal.py", line 132, in sdgaincal
27-Oct-2026 10:54:11 2026-10-27 14:54:11        SEVERE        sdgaincal::::casa+            mycb.solve()
27-Oct-2026 10:54:11 2026-10-27 14:54:11        SEVERE        sdgaincal::::casa+          File "/home/casatest/venv/lib/python3.12/site-packages/casatools/calibrater.py", line 485, in solve
27-Oct-2026 10:54:11 2026-10-27 14:54:11        SEVERE        sdgaincal::::casa+            return self._swigobj.solve()
27-Oct-2026 10:54:11 2026-10-27 14:54:11        SEVERE        sdgaincal::::casa+                   ^^^^^^^^^^^^^^^^^^^^^
27-Oct-2026 10:54:11 2026-10-27 14:54:11        SEVERE        sdgaincal::::casa+          File "/home/casatest/venv/lib/python3.12/site-packages/casatools/__casac__/calibrater.py", line 1133, in solve
27-Oct-2026 10:54:11 2026-10-27 14:54:11        SEVERE        sdgaincal::::casa+            return _calibrater.calibrater_solve(self)
27-Oct-2026 10:54:11 2026-10-27 14:54:11        SEVERE        sdgaincal::::casa+                   ^^^^^^^^^^^^^^^^^^^^^^^^^^^^^^^^^^
27-Oct-2026 10:54:11 2026-10-27 14:54:11        SEVERE        sdgaincal::::casa+        RuntimeError: Error in Calibrater::solve.
27-Oct-2026 10:54:11 2026-10-27 14:54:11        SEVERE        sdgaincal::::casa        Error in Calibrater::solve.
27-Oct-2026 10:54:11 2026-10-27 14:54:11        SEVERE        sdgaincal::::casa        Task sdgaincal raised an exception of class RuntimeError with the following message: Error in Calibrater::solve.
27-Oct-2026 10:54:11
27-Oct-2026 10:54:11 test_const03: overwrite existing file.
27-Oct-2026 10:54:11 FAILED
27-Oct-2026 10:54:11
27-Oct-2026 10:54:11 test_task_sdgaincal.py::sdgaincal_variable_test::test_variable01 2026-10-27 14:54:12        SEVERE        sdgaincal::Calibrater::initialize (file /source/casa6/casatools/src/code/synthesis/MeasurementComponents/Calibrater.cc, line 433)        Caught exception: Measures directory specified which does not contain the IERS data: /home/casatest/data/measures
27-Oct-2026 10:54:11 2026-10-27 14:54:12        SEVERE        sdgaincal::::        Exception Reported: Error in Calibrater::initialize()
27-Oct-2026 10:54:11 2026-10-27 14:54:12        SEVERE        sdgaincal::::casa        Traceback (most recent call last):
27-Oct-2026 10:54:11 2026-10-27 14:54:12        SEVERE        sdgaincal::::casa+                     ^^^^^^^^^^^^^^^^^^^^^
27-Oct-2026 10:54:11 2026-10-27 14:54:12        SEVERE        sdgaincal::::casa+          File "/home/casatest/venv/lib/python3.12/site-packages/casatasks/private/task_sdgaincal.py", line 80, in sdgaincal
27-Oct-2026 10:54:11 2026-10-27 14:54:12        SEVERE        sdgaincal::::casa+            with calibrater_manager(infile) as mycb:
27-Oct-2026 10:54:11 2026-10-27 14:54:12        SEVERE        sdgaincal::::casa+                 ^^^^^^^^^^^^^^^^^^^^^^^^^^
27-Oct-2026 10:54:11 2026-10-27 14:54:12        SEVERE        sdgaincal::::casa+          File "/usr/local/lib/python3.12/contextlib.py", line 137, in __enter__
27-Oct-2026 10:54:11 2026-10-27 14:54:12        SEVERE        sdgaincal::::casa+            return next(self.gen)
27-Oct-2026 10:54:11 2026-10-27 14:54:12        SEVERE        sdgaincal::::casa+                   ^^^^^^^^^^^^^^
27-Oct-2026 10:54:11 2026-10-27 14:54:12        SEVERE        sdgaincal::::casa+          File "/home/casatest/venv/lib/python3.12/site-packages/casatasks/private/sdutil.py", line 49, in tool_manager
27-Oct-2026 10:54:11 2026-10-27 14:54:12        SEVERE        sdgaincal::::casa+            tool.open(vis, *args, **kwargs)
27-Oct-2026 10:54:11 2026-10-27 14:54:12        SEVERE        sdgaincal::::casa+          File "/home/casatest/venv/lib/python3.12/site-packages/casatools/calibrater.py", line 30, in open
27-Oct-2026 10:54:11 2026-10-27 14:54:12        SEVERE        sdgaincal::::casa+            return self._swigobj.open(filename, compress, addcorr, addmodel)
27-Oct-2026 10:54:11 2026-10-27 14:54:12        SEVERE        sdgaincal::::casa+                   ^^^^^^^^^^^^^^^^^^^^^^^^^^^^^^^^^^^^^^^^^^^^^^^^^^^^^^^^^
27-Oct-2026 10:54:11 2026-10-27 14:54:12        SEVERE        sdgaincal::::casa+          File "/home/casatest/venv/lib/python3.12/site-packages/casatools/__casac__/calibrater.py", line 143, in open
27-Oct-2026 10:54:11 2026-10-27 14:54:12        SEVERE        sdgaincal::::casa+            return _calibrater.calibrater_open(self, *args, **kwargs)
27-Oct-2026 10:54:11 2026-10-27 14:54:12        SEVERE        sdgaincal::::casa+                   ^^^^^^^^^^^^^^^^^^^^^^^^^^^^^^^^^^^^^^^^^^^^^^^^^^
27-Oct-2026 10:54:11 2026-10-27 14:54:12        SEVERE        sdgaincal::::casa+        RuntimeError: Error in Calibrater::initialize()
27-Oct-2026 10:54:11 2026-10-27 14:54:12        SEVERE        sdgaincal::::casa        Error in Calibrater::initialize()
27-Oct-2026 10:54:11 2026-10-27 14:54:12        SEVERE        sdgaincal::::casa        Task sdgaincal raised an exception of class RuntimeError with the following message: Error in Calibrater::initialize()
27-Oct-2026 10:54:11
27-Oct-2026 10:54:11 test_variable01: valid caltable is created.
27-Oct-2026 10:54:11 FAILED
27-Oct-2026 10:54:11
27-Oct-2026 10:54:11 test_task_sdgaincal.py::sdgaincal_preapply_test::test_preapply01 2026-10-27 14:54:12        WARN        sdcal::calibrater::setvi(bool,bool)        Forcing use of OLD VisibilityIterator.
27-Oct-2026 10:54:11 2026-10-27 14:54:12        SEVERE        sdcal::Calibrater::initialize (file /source/casa6/casatools/src/code/synthesis/MeasurementComponents/Calibrater.cc, line 5881)        Caught exception: Measures directory specified which does not contain the IERS data: /home/casatest/data/measures
27-Oct-2026 10:54:11 2026-10-27 14:54:12        SEVERE        sdcal::::        Exception Reported: Error in Calibrater::initialize()
27-Oct-2026 10:54:11 2026-10-27 14:54:12        SEVERE        sdcal::::casa        Traceback (most recent call last):
27-Oct-2026 10:54:11 2026-10-27 14:54:12        SEVERE        sdcal::::casa+                     ^^^^^^^^^^^^^^^^^^^^^
27-Oct-2026 10:54:11 2026-10-27 14:54:12        SEVERE        sdcal::::casa+          File "/home/casatest/venv/lib/python3.12/site-packages/casatasks/private/task_sdcal.py", line 45, in sdcal
27-Oct-2026 10:54:11 2026-10-27 14:54:12        SEVERE        sdcal::::casa+            cb.open(filename=infile, compress=False, addcorr=addcorr, addmodel=False)
27-Oct-2026 10:54:11 2026-10-27 14:54:12        SEVERE        sdcal::::casa+          File "/home/casatest/venv/lib/python3.12/site-packages/casatools/calibrater.py", line 30, in open
27-Oct-2026 10:54:11 2026-10-27 14:54:12        SEVERE        sdcal::::casa+            return self._swigobj.open(filename, compress, addcorr, addmodel)
27-Oct-2026 10:54:11 2026-10-27 14:54:12        SEVERE        sdcal::::casa+                   ^^^^^^^^^^^^^^^^^^^^^^^^^^^^^^^^^^^^^^^^^^^^^^^^^^^^^^^^^
27-Oct-2026 10:54:11 2026-10-27 14:54:12        SEVERE        sdcal::::casa+          File "/home/casatest/venv/lib/python3.12/site-packages/casatools/__casac__/calibrater.py", line 143, in open
27-Oct-2026 10:54:11 2026-10-27 14:54:12        SEVERE        sdcal::::casa+            return _calibrater.calibrater_open(self, *args, **kwargs)
27-Oct-2026 10:54:11 2026-10-27 14:54:12        SEVERE        sdcal::::casa+                   ^^^^^^^^^^^^^^^^^^^^^^^^^^^^^^^^^^^^^^^^^^^^^^^^^^
27-Oct-2026 10:54:11 2026-10-27 14:54:12        SEVERE        sdcal::::casa+        RuntimeError: Error in Calibrater::initialize()
27-Oct-2026 10:54:11 2026-10-27 14:54:12        SEVERE        sdcal::::casa        Error in Calibrater::initialize()
27-Oct-2026 10:54:11 2026-10-27 14:54:12        SEVERE        sdcal::::casa        Task sdcal raised an exception of class RuntimeError with the following message: Error in Calibrater::initialize()
27-Oct-2026 10:54:11
27-Oct-2026 10:54:11 test_preapply01: only sky caltable is applied (resulting const factor).
27-Oct-2026 10:54:11 FAILED
27-Oct-2026 10:54:11
27-Oct-2026 10:54:11 test_task_sdgaincal.py::sdgaincal_preapply_test::test_preapply02 2026-10-27 14:54:12        WARN        sdcal::calibrater::setvi(bool,bool)        Already using OLD VisibilityIterator.
27-Oct-2026 10:54:11 2026-10-27 14:54:12        SEVERE        sdcal::Calibrater::initialize (file /source/casa6/casatools/src/code/synthesis/MeasurementComponents/Calibrater.cc, line 5881)        Caught exception: Measures directory specified which does not contain the IERS data: /home/casatest/data/measures
27-Oct-2026 10:54:11 2026-10-27 14:54:12        SEVERE        sdcal::::        Exception Reported: Error in Calibrater::initialize()
27-Oct-2026 10:54:11 2026-10-27 14:54:12        SEVERE        sdcal::::casa        Traceback (most recent call last):
27-Oct-2026 10:54:11 2026-10-27 14:54:12        SEVERE        sdcal::::casa+                     ^^^^^^^^^^^^^^^^^^^^^
27-Oct-2026 10:54:11 2026-10-27 14:54:12        SEVERE        sdcal::::casa+          File "/home/casatest/venv/lib/python3.12/site-packages/casatasks/private/task_sdcal.py", line 45, in sdcal
27-Oct-2026 10:54:11 2026-10-27 14:54:12        SEVERE        sdcal::::casa+            cb.open(filename=infile, compress=False, addcorr=addcorr, addmodel=False)
27-Oct-2026 10:54:11 2026-10-27 14:54:12        SEVERE        sdcal::::casa+          File "/home/casatest/venv/lib/python3.12/site-packages/casatools/calibrater.py", line 30, in open
27-Oct-2026 10:54:11 2026-10-27 14:54:12        SEVERE        sdcal::::casa+            return self._swigobj.open(filename, compress, addcorr, addmodel)
27-Oct-2026 10:54:11 2026-10-27 14:54:12        SEVERE        sdcal::::casa+                   ^^^^^^^^^^^^^^^^^^^^^^^^^^^^^^^^^^^^^^^^^^^^^^^^^^^^^^^^^
27-Oct-2026 10:54:11 2026-10-27 14:54:12        SEVERE        sdcal::::casa+          File "/home/casatest/venv/lib/python3.12/site-packages/casatools/__casac__/calibrater.py", line 143, in open
27-Oct-2026 10:54:11 2026-10-27 14:54:12        SEVERE        sdcal::::casa+            return _calibrater.calibrater_open(self, *args, **kwargs)
27-Oct-2026 10:54:11 2026-10-27 14:54:12        SEVERE        sdcal::::casa+                   ^^^^^^^^^^^^^^^^^^^^^^^^^^^^^^^^^^^^^^^^^^^^^^^^^^
27-Oct-2026 10:54:11 2026-10-27 14:54:12        SEVERE        sdcal::::casa+        RuntimeError: Error in Calibrater::initialize()
27-Oct-2026 10:54:11 2026-10-27 14:54:12        SEVERE        sdcal::::casa        Error in Calibrater::initialize()
27-Oct-2026 10:54:11 2026-10-27 14:54:12        SEVERE        sdcal::::casa        Task sdcal raised an exception of class RuntimeError with the following message: Error in Calibrater::initialize()
27-Oct-2026 10:54:11
27-Oct-2026 10:54:11 test_preapply02: only tsys caltable is applied (resulting variable factor).
27-Oct-2026 10:54:11 FAILED
27-Oct-2026 10:54:11
27-Oct-2026 10:54:11 test_task_sdgaincal.py::sdgaincal_preapply_test::test_preapply03 2026-10-27 14:54:12        WARN        sdcal::calibrater::setvi(bool,bool)        Already using OLD VisibilityIterator.
27-Oct-2026 10:54:11 2026-10-27 14:54:12        SEVERE        sdcal::Calibrater::initialize (file /source/casa6/casatools/src/code/synthesis/MeasurementComponents/Calibrater.cc, line 5881)        Caught exception: Measures directory specified which does not contain the IERS data: /home/casatest/data/measures
27-Oct-2026 10:54:11 2026-10-27 14:54:12        SEVERE        sdcal::::        Exception Reported: Error in Calibrater::initialize()
27-Oct-2026 10:54:11 2026-10-27 14:54:12        SEVERE        sdcal::::casa        Traceback (most recent call last):
27-Oct-2026 10:54:11 2026-10-27 14:54:12        SEVERE        sdcal::::casa+                     ^^^^^^^^^^^^^^^^^^^^^
27-Oct-2026 10:54:11 2026-10-27 14:54:12        SEVERE        sdcal::::casa+          File "/home/casatest/venv/lib/python3.12/site-packages/casatasks/private/task_sdcal.py", line 45, in sdcal
27-Oct-2026 10:54:11 2026-10-27 14:54:12        SEVERE        sdcal::::casa+            cb.open(filename=infile, compress=False, addcorr=addcorr, addmodel=False)
27-Oct-2026 10:54:11 2026-10-27 14:54:12        SEVERE        sdcal::::casa+          File "/home/casatest/venv/lib/python3.12/site-packages/casatools/calibrater.py", line 30, in open
27-Oct-2026 10:54:11 2026-10-27 14:54:12        SEVERE        sdcal::::casa+            return self._swigobj.open(filename, compress, addcorr, addmodel)
27-Oct-2026 10:54:11 2026-10-27 14:54:12        SEVERE        sdcal::::casa+                   ^^^^^^^^^^^^^^^^^^^^^^^^^^^^^^^^^^^^^^^^^^^^^^^^^^^^^^^^^
27-Oct-2026 10:54:11 2026-10-27 14:54:12        SEVERE        sdcal::::casa+          File "/home/casatest/venv/lib/python3.12/site-packages/casatools/__casac__/calibrater.py", line 143, in open
27-Oct-2026 10:54:11 2026-10-27 14:54:12        SEVERE        sdcal::::casa+            return _calibrater.calibrater_open(self, *args, **kwargs)
27-Oct-2026 10:54:11 2026-10-27 14:54:12        SEVERE        sdcal::::casa+                   ^^^^^^^^^^^^^^^^^^^^^^^^^^^^^^^^^^^^^^^^^^^^^^^^^^
27-Oct-2026 10:54:11 2026-10-27 14:54:12        SEVERE        sdcal::::casa+        RuntimeError: Error in Calibrater::initialize()
27-Oct-2026 10:54:11 2026-10-27 14:54:12        SEVERE        sdcal::::casa        Error in Calibrater::initialize()
27-Oct-2026 10:54:11 2026-10-27 14:54:12        SEVERE        sdcal::::casa        Task sdcal raised an exception of class RuntimeError with the following message: Error in Calibrater::initialize()
27-Oct-2026 10:54:11
27-Oct-2026 10:54:11 test_preapply03: both tsys and sky caltables are applied (resulting variable factor).
27-Oct-2026 10:54:11 FAILED
27-Oct-2026 10:54:11
27-Oct-2026 10:54:11 test_task_sdgaincal.py::sdgaincal_preapply_test::test_preapply04 2026-10-27 14:54:12        WARN        sdcal::calibrater::setvi(bool,bool)        Already using OLD VisibilityIterator.
27-Oct-2026 10:54:11 2026-10-27 14:54:12        SEVERE        sdcal::Calibrater::initialize (file /source/casa6/casatools/src/code/synthesis/MeasurementComponents/Calibrater.cc, line 5881)        Caught exception: Measures directory specified which does not contain the IERS data: /home/casatest/data/measures
27-Oct-2026 10:54:11 2026-10-27 14:54:12        SEVERE        sdcal::::        Exception Reported: Error in Calibrater::initialize()
27-Oct-2026 10:54:11 2026-10-27 14:54:12        SEVERE        sdcal::::casa        Traceback (most recent call last):
27-Oct-2026 10:54:11 2026-10-27 14:54:12        SEVERE        sdcal::::casa+                     ^^^^^^^^^^^^^^^^^^^^^
27-Oct-2026 10:54:11 2026-10-27 14:54:12        SEVERE        sdcal::::casa+          File "/home/casatest/venv/lib/python3.12/site-packages/casatasks/private/task_sdcal.py", line 45, in sdcal
27-Oct-2026 10:54:11 2026-10-27 14:54:12        SEVERE        sdcal::::casa+            cb.open(filename=infile, compress=False, addcorr=addcorr, addmodel=False)
27-Oct-2026 10:54:11 2026-10-27 14:54:12        SEVERE        sdcal::::casa+          File "/home/casatest/venv/lib/python3.12/site-packages/casatools/calibrater.py", line 30, in open
27-Oct-2026 10:54:11 2026-10-27 14:54:12        SEVERE        sdcal::::casa+            return self._swigobj.open(filename, compress, addcorr, addmodel)
27-Oct-2026 10:54:11 2026-10-27 14:54:12        SEVERE        sdcal::::casa+                   ^^^^^^^^^^^^^^^^^^^^^^^^^^^^^^^^^^^^^^^^^^^^^^^^^^^^^^^^^
27-Oct-2026 10:54:11 2026-10-27 14:54:12        SEVERE        sdcal::::casa+          File "/home/casatest/venv/lib/python3.12/site-packages/casatools/__casac__/calibrater.py", line 143, in open
27-Oct-2026 10:54:11 2026-10-27 14:54:12        SEVERE        sdcal::::casa+            return _calibrater.calibrater_open(self, *args, **kwargs)
27-Oct-2026 10:54:11 2026-10-27 14:54:12        SEVERE        sdcal::::casa+                   ^^^^^^^^^^^^^^^^^^^^^^^^^^^^^^^^^^^^^^^^^^^^^^^^^^
27-Oct-2026 10:54:11 2026-10-27 14:54:12        SEVERE        sdcal::::casa+        RuntimeError: Error in Calibrater::initialize()
27-Oct-2026 10:54:11 2026-10-27 14:54:12        SEVERE        sdcal::::casa        Error in Calibrater::initialize()
27-Oct-2026 10:54:11 2026-10-27 14:54:12        SEVERE        sdcal::::casa        Task sdcal raised an exception of class RuntimeError with the following message: Error in Calibrater::initialize()
27-Oct-2026 10:54:11
27-Oct-2026 10:54:11 test_preapply04: transfer Tsys from [2,3] to [0,1].
27-Oct-2026 10:54:11 FAILED
27-Oct-2026 10:54:11
27-Oct-2026 10:54:12 test_task_sdgaincal.py::sdgaincal_single_polarization_test::test_single_pol 2026-10-27 14:54:12        SEVERE        mstransform::::casa        Task mstransform raised an exception of class RuntimeError with the following message: Measures directory specified which does not contain the IERS data: /home/casatest/data/measures
27-Oct-2026 10:54:12
27-Oct-2026 10:54:12 test_single_pol: test single-polarization calibration (YY).
27-Oct-2026 10:54:12 FAILED
27-Oct-2026 10:54:12
27-Oct-2026 10:54:12 =================================== FAILURES ===================================
27-Oct-2026 10:54:12 ______________________ sdgaincal_const_test.test_const01 _______________________
27-Oct-2026 10:54:12 test_task_sdgaincal.py:272: in test_const01
27-Oct-2026 10:54:12     self.run_task(**params)
27-Oct-2026 10:54:12 test_task_sdgaincal.py:93: in run_task
27-Oct-2026 10:54:12     result = sdgaincal(**params)
27-Oct-2026 10:54:12              ^^^^^^^^^^^^^^^^^^^
27-Oct-2026 10:54:12 ../../../../venv/lib/python3.12/site-packages/casatasks/sdgaincal.py:203: in __call__
27-Oct-2026 10:54:12     task_result = _sdgaincal_t( _pc.document['infile'], _pc.document['calmode'], _pc.document['radius'], _pc.document['smooth'], _pc.document['antenna'], _pc.document['field'], _pc.document['spw'], _pc.document['scan'], _pc.document['intent'], _pc.document['applytable'], _pc.document['interp'], _pc.document['spwmap'], _pc.document['outfile'], _pc.document['overwrite'] )
27-Oct-2026 10:54:12                   ^^^^^^^^^^^^^^^^^^^^^^^^^^^^^^^^^^^^^^^^^^^^^^^^^^^^^^^^^^^^^^^^^^^^^^^^^^^^^^^^^^^^^^^^^^^^^^^^^^^^^^^^^^^^^^^^^^^^^^^^^^^^^^^^^^^^^^^^^^^^^^^^^^^^^^^^^^^^^^^^^^^^^^^^^^^^^^^^^^^^^^^^^^^^^^^^^^^^^^^^^^^^^^^^^^^^^^^^^^^^^^^^^^^^^^^^^^^^^^^^^^^^^^^^^^^^^^^^^^^^^^^^^^^^^^^^^^^^^^^^^^^^^^^^^^^^^^^^^^^^^^^^^^^^^^^^^^^^^^^^^^^^^^^^^^^^^^^^^^^^^^^^^^^^^^^^^^
27-Oct-2026 10:54:12 ../../../../venv/lib/python3.12/site-packages/casatasks/private/sdutil.py:129: in wrapper
27-Oct-2026 10:54:12     retval = func(*args, **kwargs)
27-Oct-2026 10:54:12              ^^^^^^^^^^^^^^^^^^^^^
27-Oct-2026 10:54:12 ../../../../venv/lib/python3.12/site-packages/casatasks/private/task_sdgaincal.py:132: in sdgaincal
27-Oct-2026 10:54:12     mycb.solve()
27-Oct-2026 10:54:12 ../../../../venv/lib/python3.12/site-packages/casatools/calibrater.py:485: in solve
27-Oct-2026 10:54:12     return self._swigobj.solve()
27-Oct-2026 10:54:12            ^^^^^^^^^^^^^^^^^^^^^
27-Oct-2026 10:54:12 ../../../../venv/lib/python3.12/site-packages/casatools/__casac__/calibrater.py:1133: in solve
27-Oct-2026 10:54:12     return _calibrater.calibrater_solve(self)
27-Oct-2026 10:54:12            ^^^^^^^^^^^^^^^^^^^^^^^^^^^^^^^^^^
27-Oct-2026 10:54:12 E   RuntimeError: Error in Calibrater::solve.
27-Oct-2026 10:54:12 ______________________ sdgaincal_const_test.test_const02 _______________________
27-Oct-2026 10:54:12 test_task_sdgaincal.py:279: in test_const02
27-Oct-2026 10:54:12     self.run_task(**params)
27-Oct-2026 10:54:12 test_task_sdgaincal.py:93: in run_task
27-Oct-2026 10:54:12     result = sdgaincal(**params)
27-Oct-2026 10:54:12              ^^^^^^^^^^^^^^^^^^^
27-Oct-2026 10:54:12 ../../../../venv/lib/python3.12/site-packages/casatasks/sdgaincal.py:203: in __call__
27-Oct-2026 10:54:12     task_result = _sdgaincal_t( _pc.document['infile'], _pc.document['calmode'], _pc.document['radius'], _pc.document['smooth'], _pc.document['antenna'], _pc.document['field'], _pc.document['spw'], _pc.document['scan'], _pc.document['intent'], _pc.document['applytable'], _pc.document['interp'], _pc.document['spwmap'], _pc.document['outfile'], _pc.document['overwrite'] )
27-Oct-2026 10:54:12                   ^^^^^^^^^^^^^^^^^^^^^^^^^^^^^^^^^^^^^^^^^^^^^^^^^^^^^^^^^^^^^^^^^^^^^^^^^^^^^^^^^^^^^^^^^^^^^^^^^^^^^^^^^^^^^^^^^^^^^^^^^^^^^^^^^^^^^^^^^^^^^^^^^^^^^^^^^^^^^^^^^^^^^^^^^^^^^^^^^^^^^^^^^^^^^^^^^^^^^^^^^^^^^^^^^^^^^^^^^^^^^^^^^^^^^^^^^^^^^^^^^^^^^^^^^^^^^^^^^^^^^^^^^^^^^^^^^^^^^^^^^^^^^^^^^^^^^^^^^^^^^^^^^^^^^^^^^^^^^^^^^^^^^^^^^^^^^^^^^^^^^^^^^^^^^^^^^^
27-Oct-2026 10:54:12 ../../../../venv/lib/python3.12/site-packages/casatasks/private/sdutil.py:129: in wrapper
27-Oct-2026 10:54:12     retval = func(*args, **kwargs)
27-Oct-2026 10:54:12              ^^^^^^^^^^^^^^^^^^^^^
27-Oct-2026 10:54:12 ../../../../venv/lib/python3.12/site-packages/casatasks/private/task_sdgaincal.py:132: in sdgaincal
27-Oct-2026 10:54:12     mycb.solve()
27-Oct-2026 10:54:12 ../../../../venv/lib/python3.12/site-packages/casatools/calibrater.py:485: in solve
27-Oct-2026 10:54:12     return self._swigobj.solve()
27-Oct-2026 10:54:12            ^^^^^^^^^^^^^^^^^^^^^
27-Oct-2026 10:54:12 ../../../../venv/lib/python3.12/site-packages/casatools/__casac__/calibrater.py:1133: in solve
27-Oct-2026 10:54:12     return _calibrater.calibrater_solve(self)
27-Oct-2026 10:54:12            ^^^^^^^^^^^^^^^^^^^^^^^^^^^^^^^^^^
27-Oct-2026 10:54:12 E   RuntimeError: Error in Calibrater::solve.
27-Oct-2026 10:54:12 ______________________ sdgaincal_const_test.test_const03 _______________________
27-Oct-2026 10:54:12 test_task_sdgaincal.py:290: in test_const03
27-Oct-2026 10:54:12     self.run_task(**params)
27-Oct-2026 10:54:12 test_task_sdgaincal.py:93: in run_task
27-Oct-2026 10:54:12     result = sdgaincal(**params)
27-Oct-2026 10:54:12              ^^^^^^^^^^^^^^^^^^^
27-Oct-2026 10:54:12 ../../../../venv/lib/python3.12/site-packages/casatasks/sdgaincal.py:203: in __call__
27-Oct-2026 10:54:12     task_result = _sdgaincal_t( _pc.document['infile'], _pc.document['calmode'], _pc.document['radius'], _pc.document['smooth'], _pc.document['antenna'], _pc.document['field'], _pc.document['spw'], _pc.document['scan'], _pc.document['intent'], _pc.document['applytable'], _pc.document['interp'], _pc.document['spwmap'], _pc.document['outfile'], _pc.document['overwrite'] )
27-Oct-2026 10:54:12                   ^^^^^^^^^^^^^^^^^^^^^^^^^^^^^^^^^^^^^^^^^^^^^^^^^^^^^^^^^^^^^^^^^^^^^^^^^^^^^^^^^^^^^^^^^^^^^^^^^^^^^^^^^^^^^^^^^^^^^^^^^^^^^^^^^^^^^^^^^^^^^^^^^^^^^^^^^^^^^^^^^^^^^^^^^^^^^^^^^^^^^^^^^^^^^^^^^^^^^^^^^^^^^^^^^^^^^^^^^^^^^^^^^^^^^^^^^^^^^^^^^^^^^^^^^^^^^^^^^^^^^^^^^^^^^^^^^^^^^^^^^^^^^^^^^^^^^^^^^^^^^^^^^^^^^^^^^^^^^^^^^^^^^^^^^^^^^^^^^^^^^^^^^^^^^^^^^^
27-Oct-2026 10:54:12 ../../../../venv/lib/python3.12/site-packages/casatasks/private/sdutil.py:129: in wrapper
27-Oct-2026 10:54:12     retval = func(*args, **kwargs)
27-Oct-2026 10:54:12              ^^^^^^^^^^^^^^^^^^^^^
27-Oct-2026 10:54:12 ../../../../venv/lib/python3.12/site-packages/casatasks/private/task_sdgaincal.py:132: in sdgaincal
27-Oct-2026 10:54:12     mycb.solve()
27-Oct-2026 10:54:12 ../../../../venv/lib/python3.12/site-packages/casatools/calibrater.py:485: in solve
27-Oct-2026 10:54:12     return self._swigobj.solve()
27-Oct-2026 10:54:12            ^^^^^^^^^^^^^^^^^^^^^
27-Oct-2026 10:54:12 ../../../../venv/lib/python3.12/site-packages/casatools/__casac__/calibrater.py:1133: in solve
27-Oct-2026 10:54:12     return _calibrater.calibrater_solve(self)
27-Oct-2026 10:54:12            ^^^^^^^^^^^^^^^^^^^^^^^^^^^^^^^^^^
27-Oct-2026 10:54:12 E   RuntimeError: Error in Calibrater::solve.
27-Oct-2026 10:54:12 ___________________ sdgaincal_variable_test.test_variable01 ____________________
27-Oct-2026 10:54:12 test_task_sdgaincal.py:333: in test_variable01
27-Oct-2026 10:54:12     self.run_task(**params)
27-Oct-2026 10:54:12 test_task_sdgaincal.py:93: in run_task
27-Oct-2026 10:54:12     result = sdgaincal(**params)
27-Oct-2026 10:54:12              ^^^^^^^^^^^^^^^^^^^
27-Oct-2026 10:54:12 ../../../../venv/lib/python3.12/site-packages/casatasks/sdgaincal.py:203: in __call__
27-Oct-2026 10:54:12     task_result = _sdgaincal_t( _pc.document['infile'], _pc.document['calmode'], _pc.document['radius'], _pc.document['smooth'], _pc.document['antenna'], _pc.document['field'], _pc.document['spw'], _pc.document['scan'], _pc.document['intent'], _pc.document['applytable'], _pc.document['interp'], _pc.document['spwmap'], _pc.document['outfile'], _pc.document['overwrite'] )
27-Oct-2026 10:54:12                   ^^^^^^^^^^^^^^^^^^^^^^^^^^^^^^^^^^^^^^^^^^^^^^^^^^^^^^^^^^^^^^^^^^^^^^^^^^^^^^^^^^^^^^^^^^^^^^^^^^^^^^^^^^^^^^^^^^^^^^^^^^^^^^^^^^^^^^^^^^^^^^^^^^^^^^^^^^^^^^^^^^^^^^^^^^^^^^^^^^^^^^^^^^^^^^^^^^^^^^^^^^^^^^^^^^^^^^^^^^^^^^^^^^^^^^^^^^^^^^^^^^^^^^^^^^^^^^^^^^^^^^^^^^^^^^^^^^^^^^^^^^^^^^^^^^^^^^^^^^^^^^^^^^^^^^^^^^^^^^^^^^^^^^^^^^^^^^^^^^^^^^^^^^^^^^^^^^
27-Oct-2026 10:54:12 ../../../../venv/lib/python3.12/site-packages/casatasks/private/sdutil.py:129: in wrapper
27-Oct-2026 10:54:12     retval = func(*args, **kwargs)
27-Oct-2026 10:54:12              ^^^^^^^^^^^^^^^^^^^^^
27-Oct-2026 10:54:12 ../../../../venv/lib/python3.12/site-packages/casatasks/private/task_sdgaincal.py:80: in sdgaincal
27-Oct-2026 10:54:12     with calibrater_manager(infile) as mycb:
27-Oct-2026 10:54:12          ^^^^^^^^^^^^^^^^^^^^^^^^^^
27-Oct-2026 10:54:12 /usr/local/lib/python3.12/contextlib.py:137: in __enter__
27-Oct-2026 10:54:12     return next(self.gen)
27-Oct-2026 10:54:12            ^^^^^^^^^^^^^^
27-Oct-2026 10:54:12 ../../../../venv/lib/python3.12/site-packages/casatasks/private/sdutil.py:49: in tool_manager
27-Oct-2026 10:54:12     tool.open(vis, *args, **kwargs)
27-Oct-2026 10:54:12 ../../../../venv/lib/python3.12/site-packages/casatools/calibrater.py:30: in open
27-Oct-2026 10:54:12     return self._swigobj.open(filename, compress, addcorr, addmodel)
27-Oct-2026 10:54:12            ^^^^^^^^^^^^^^^^^^^^^^^^^^^^^^^^^^^^^^^^^^^^^^^^^^^^^^^^^
27-Oct-2026 10:54:12 ../../../../venv/lib/python3.12/site-packages/casatools/__casac__/calibrater.py:143: in open
27-Oct-2026 10:54:12     return _calibrater.calibrater_open(self, *args, **kwargs)
27-Oct-2026 10:54:12            ^^^^^^^^^^^^^^^^^^^^^^^^^^^^^^^^^^^^^^^^^^^^^^^^^^
27-Oct-2026 10:54:12 E   RuntimeError: Error in Calibrater::initialize()
27-Oct-2026 10:54:12 ___________________ sdgaincal_preapply_test.test_preapply01 ____________________
27-Oct-2026 10:54:12 test_task_sdgaincal.py:363: in setUp
27-Oct-2026 10:54:12     self.generate()
27-Oct-2026 10:54:12 test_task_sdgaincal.py:429: in generate
27-Oct-2026 10:54:12     sdcal_cli(infile=self.infile, outfile=self.tsystable,
27-Oct-2026 10:54:12 ../../../../venv/lib/python3.12/site-packages/casatasks/sdcal.py:352: in __call__
27-Oct-2026 10:54:12     task_result = _sdcal_t( _pc.document['infile'], _pc.document['calmode'], _pc.document['fraction'], _pc.document['noff'], _pc.document['width'], _pc.document['elongated'], _pc.document['applytable'], _pc.document['interp'], _pc.document['spwmap'], _pc.document['outfile'], _pc.document['overwrite'], _pc.document['field'], _pc.document['spw'], _pc.document['scan'], **kwargs )
27-Oct-2026 10:54:12                   ^^^^^^^^^^^^^^^^^^^^^^^^^^^^^^^^^^^^^^^^^^^^^^^^^^^^^^^^^^^^^^^^^^^^^^^^^^^^^^^^^^^^^^^^^^^^^^^^^^^^^^^^^^^^^^^^^^^^^^^^^^^^^^^^^^^^^^^^^^^^^^^^^^^^^^^^^^^^^^^^^^^^^^^^^^^^^^^^^^^^^^^^^^^^^^^^^^^^^^^^^^^^^^^^^^^^^^^^^^^^^^^^^^^^^^^^^^^^^^^^^^^^^^^^^^^^^^^^^^^^^^^^^^^^^^^^^^^^^^^^^^^^^^^^^^^^^^^^^^^^^^^^^^^^^^^^^^^^^^^^^^^^^^^^^^^^^^^^^^^^^^^^^^^^^^^^^^^^^^^^^
27-Oct-2026 10:54:12 ../../../../venv/lib/python3.12/site-packages/casatasks/private/casaxmlutil.py:162: in wrapper
27-Oct-2026 10:54:12     retval = func(*args_, **kwargs_)
27-Oct-2026 10:54:12              ^^^^^^^^^^^^^^^^^^^^^^^
27-Oct-2026 10:54:12 ../../../../venv/lib/python3.12/site-packages/casatasks/private/sdutil.py:129: in wrapper
27-Oct-2026 10:54:12     retval = func(*args, **kwargs)
27-Oct-2026 10:54:12              ^^^^^^^^^^^^^^^^^^^^^
27-Oct-2026 10:54:12 ../../../../venv/lib/python3.12/site-packages/casatasks/private/task_sdcal.py:45: in sdcal
27-Oct-2026 10:54:12     cb.open(filename=infile, compress=False, addcorr=addcorr, addmodel=False)
27-Oct-2026 10:54:12 ../../../../venv/lib/python3.12/site-packages/casatools/calibrater.py:30: in open
27-Oct-2026 10:54:12     return self._swigobj.open(filename, compress, addcorr, addmodel)
27-Oct-2026 10:54:12            ^^^^^^^^^^^^^^^^^^^^^^^^^^^^^^^^^^^^^^^^^^^^^^^^^^^^^^^^^
27-Oct-2026 10:54:12 ../../../../venv/lib/python3.12/site-packages/casatools/__casac__/calibrater.py:143: in open
27-Oct-2026 10:54:12     return _calibrater.calibrater_open(self, *args, **kwargs)
27-Oct-2026 10:54:12            ^^^^^^^^^^^^^^^^^^^^^^^^^^^^^^^^^^^^^^^^^^^^^^^^^^
27-Oct-2026 10:54:12 E   RuntimeError: Error in Calibrater::initialize()
27-Oct-2026 10:54:12 ___________________ sdgaincal_preapply_test.test_preapply02 ____________________
27-Oct-2026 10:54:12 test_task_sdgaincal.py:363: in setUp
27-Oct-2026 10:54:12     self.generate()
27-Oct-2026 10:54:12 test_task_sdgaincal.py:429: in generate
27-Oct-2026 10:54:12     sdcal_cli(infile=self.infile, outfile=self.tsystable,
27-Oct-2026 10:54:12 ../../../../venv/lib/python3.12/site-packages/casatasks/sdcal.py:352: in __call__
27-Oct-2026 10:54:12     task_result = _sdcal_t( _pc.document['infile'], _pc.document['calmode'], _pc.document['fraction'], _pc.document['noff'], _pc.document['width'], _pc.document['elongated'], _pc.document['applytable'], _pc.document['interp'], _pc.document['spwmap'], _pc.document['outfile'], _pc.document['overwrite'], _pc.document['field'], _pc.document['spw'], _pc.document['scan'], **kwargs )
27-Oct-2026 10:54:12                   ^^^^^^^^^^^^^^^^^^^^^^^^^^^^^^^^^^^^^^^^^^^^^^^^^^^^^^^^^^^^^^^^^^^^^^^^^^^^^^^^^^^^^^^^^^^^^^^^^^^^^^^^^^^^^^^^^^^^^^^^^^^^^^^^^^^^^^^^^^^^^^^^^^^^^^^^^^^^^^^^^^^^^^^^^^^^^^^^^^^^^^^^^^^^^^^^^^^^^^^^^^^^^^^^^^^^^^^^^^^^^^^^^^^^^^^^^^^^^^^^^^^^^^^^^^^^^^^^^^^^^^^^^^^^^^^^^^^^^^^^^^^^^^^^^^^^^^^^^^^^^^^^^^^^^^^^^^^^^^^^^^^^^^^^^^^^^^^^^^^^^^^^^^^^^^^^^^^^^^^^^
27-Oct-2026 10:54:12 ../../../../venv/lib/python3.12/site-packages/casatasks/private/casaxmlutil.py:162: in wrapper
27-Oct-2026 10:54:12     retval = func(*args_, **kwargs_)
27-Oct-2026 10:54:12              ^^^^^^^^^^^^^^^^^^^^^^^
27-Oct-2026 10:54:12 ../../../../venv/lib/python3.12/site-packages/casatasks/private/sdutil.py:129: in wrapper
27-Oct-2026 10:54:12     retval = func(*args, **kwargs)
27-Oct-2026 10:54:12              ^^^^^^^^^^^^^^^^^^^^^
27-Oct-2026 10:54:12 ../../../../venv/lib/python3.12/site-packages/casatasks/private/task_sdcal.py:45: in sdcal
27-Oct-2026 10:54:12     cb.open(filename=infile, compress=False, addcorr=addcorr, addmodel=False)
27-Oct-2026 10:54:12 ../../../../venv/lib/python3.12/site-packages/casatools/calibrater.py:30: in open
27-Oct-2026 10:54:12     return self._swigobj.open(filename, compress, addcorr, addmodel)
27-Oct-2026 10:54:12            ^^^^^^^^^^^^^^^^^^^^^^^^^^^^^^^^^^^^^^^^^^^^^^^^^^^^^^^^^
27-Oct-2026 10:54:12 ../../../../venv/lib/python3.12/site-packages/casatools/__casac__/calibrater.py:143: in open
27-Oct-2026 10:54:12     return _calibrater.calibrater_open(self, *args, **kwargs)
27-Oct-2026 10:54:12            ^^^^^^^^^^^^^^^^^^^^^^^^^^^^^^^^^^^^^^^^^^^^^^^^^^
27-Oct-2026 10:54:12 E   RuntimeError: Error in Calibrater::initialize()
27-Oct-2026 10:54:12 ___________________ sdgaincal_preapply_test.test_preapply03 ____________________
27-Oct-2026 10:54:12 test_task_sdgaincal.py:363: in setUp
27-Oct-2026 10:54:12     self.generate()
27-Oct-2026 10:54:12 test_task_sdgaincal.py:429: in generate
27-Oct-2026 10:54:12     sdcal_cli(infile=self.infile, outfile=self.tsystable,
27-Oct-2026 10:54:12 ../../../../venv/lib/python3.12/site-packages/casatasks/sdcal.py:352: in __call__
27-Oct-2026 10:54:12     task_result = _sdcal_t( _pc.document['infile'], _pc.document['calmode'], _pc.document['fraction'], _pc.document['noff'], _pc.document['width'], _pc.document['elongated'], _pc.document['applytable'], _pc.document['interp'], _pc.document['spwmap'], _pc.document['outfile'], _pc.document['overwrite'], _pc.document['field'], _pc.document['spw'], _pc.document['scan'], **kwargs )
27-Oct-2026 10:54:12                   ^^^^^^^^^^^^^^^^^^^^^^^^^^^^^^^^^^^^^^^^^^^^^^^^^^^^^^^^^^^^^^^^^^^^^^^^^^^^^^^^^^^^^^^^^^^^^^^^^^^^^^^^^^^^^^^^^^^^^^^^^^^^^^^^^^^^^^^^^^^^^^^^^^^^^^^^^^^^^^^^^^^^^^^^^^^^^^^^^^^^^^^^^^^^^^^^^^^^^^^^^^^^^^^^^^^^^^^^^^^^^^^^^^^^^^^^^^^^^^^^^^^^^^^^^^^^^^^^^^^^^^^^^^^^^^^^^^^^^^^^^^^^^^^^^^^^^^^^^^^^^^^^^^^^^^^^^^^^^^^^^^^^^^^^^^^^^^^^^^^^^^^^^^^^^^^^^^^^^^^^^
27-Oct-2026 10:54:12 ../../../../venv/lib/python3.12/site-packages/casatasks/private/casaxmlutil.py:162: in wrapper
27-Oct-2026 10:54:12     retval = func(*args_, **kwargs_)
27-Oct-2026 10:54:12              ^^^^^^^^^^^^^^^^^^^^^^^
27-Oct-2026 10:54:12 ../../../../venv/lib/python3.12/site-packages/casatasks/private/sdutil.py:129: in wrapper
27-Oct-2026 10:54:12     retval = func(*args, **kwargs)
27-Oct-2026 10:54:12              ^^^^^^^^^^^^^^^^^^^^^
27-Oct-2026 10:54:12 ../../../../venv/lib/python3.12/site-packages/casatasks/private/task_sdcal.py:45: in sdcal
27-Oct-2026 10:54:12     cb.open(filename=infile, compress=False, addcorr=addcorr, addmodel=False)
27-Oct-2026 10:54:12 ../../../../venv/lib/python3.12/site-packages/casatools/calibrater.py:30: in open
27-Oct-2026 10:54:12     return self._swigobj.open(filename, compress, addcorr, addmodel)
27-Oct-2026 10:54:12            ^^^^^^^^^^^^^^^^^^^^^^^^^^^^^^^^^^^^^^^^^^^^^^^^^^^^^^^^^
27-Oct-2026 10:54:12 ../../../../venv/lib/python3.12/site-packages/casatools/__casac__/calibrater.py:143: in open
27-Oct-2026 10:54:12     return _calibrater.calibrater_open(self, *args, **kwargs)
27-Oct-2026 10:54:12            ^^^^^^^^^^^^^^^^^^^^^^^^^^^^^^^^^^^^^^^^^^^^^^^^^^
27-Oct-2026 10:54:12 E   RuntimeError: Error in Calibrater::initialize()
27-Oct-2026 10:54:12 ___________________ sdgaincal_preapply_test.test_preapply04 ____________________
27-Oct-2026 10:54:12 test_task_sdgaincal.py:363: in setUp
27-Oct-2026 10:54:12     self.generate()
27-Oct-2026 10:54:12 test_task_sdgaincal.py:429: in generate
27-Oct-2026 10:54:12     sdcal_cli(infile=self.infile, outfile=self.tsystable,
27-Oct-2026 10:54:12 ../../../../venv/lib/python3.12/site-packages/casatasks/sdcal.py:352: in __call__
27-Oct-2026 10:54:12     task_result = _sdcal_t( _pc.document['infile'], _pc.document['calmode'], _pc.document['fraction'], _pc.document['noff'], _pc.document['width'], _pc.document['elongated'], _pc.document['applytable'], _pc.document['interp'], _pc.document['spwmap'], _pc.document['outfile'], _pc.document['overwrite'], _pc.document['field'], _pc.document['spw'], _pc.document['scan'], **kwargs )
27-Oct-2026 10:54:12                   ^^^^^^^^^^^^^^^^^^^^^^^^^^^^^^^^^^^^^^^^^^^^^^^^^^^^^^^^^^^^^^^^^^^^^^^^^^^^^^^^^^^^^^^^^^^^^^^^^^^^^^^^^^^^^^^^^^^^^^^^^^^^^^^^^^^^^^^^^^^^^^^^^^^^^^^^^^^^^^^^^^^^^^^^^^^^^^^^^^^^^^^^^^^^^^^^^^^^^^^^^^^^^^^^^^^^^^^^^^^^^^^^^^^^^^^^^^^^^^^^^^^^^^^^^^^^^^^^^^^^^^^^^^^^^^^^^^^^^^^^^^^^^^^^^^^^^^^^^^^^^^^^^^^^^^^^^^^^^^^^^^^^^^^^^^^^^^^^^^^^^^^^^^^^^^^^^^^^^^^^^
27-Oct-2026 10:54:12 ../../../../venv/lib/python3.12/site-packages/casatasks/private/casaxmlutil.py:162: in wrapper
27-Oct-2026 10:54:12     retval = func(*args_, **kwargs_)
27-Oct-2026 10:54:12              ^^^^^^^^^^^^^^^^^^^^^^^
27-Oct-2026 10:54:12 ../../../../venv/lib/python3.12/site-packages/casatasks/private/sdutil.py:129: in wrapper
27-Oct-2026 10:54:12     retval = func(*args, **kwargs)
27-Oct-2026 10:54:12              ^^^^^^^^^^^^^^^^^^^^^
27-Oct-2026 10:54:12 ../../../../venv/lib/python3.12/site-packages/casatasks/private/task_sdcal.py:45: in sdcal
27-Oct-2026 10:54:12     cb.open(filename=infile, compress=False, addcorr=addcorr, addmodel=False)
27-Oct-2026 10:54:12 ../../../../venv/lib/python3.12/site-packages/casatools/calibrater.py:30: in open
27-Oct-2026 10:54:12     return self._swigobj.open(filename, compress, addcorr, addmodel)
27-Oct-2026 10:54:12            ^^^^^^^^^^^^^^^^^^^^^^^^^^^^^^^^^^^^^^^^^^^^^^^^^^^^^^^^^
27-Oct-2026 10:54:12 ../../../../venv/lib/python3.12/site-packages/casatools/__casac__/calibrater.py:143: in open
27-Oct-2026 10:54:12     return _calibrater.calibrater_open(self, *args, **kwargs)
27-Oct-2026 10:54:12            ^^^^^^^^^^^^^^^^^^^^^^^^^^^^^^^^^^^^^^^^^^^^^^^^^^
27-Oct-2026 10:54:12 E   RuntimeError: Error in Calibrater::initialize()
27-Oct-2026 10:54:12 ______________ sdgaincal_single_polarization_test.test_single_pol ______________
27-Oct-2026 10:54:12 test_task_sdgaincal.py:575: in test_single_pol
27-Oct-2026 10:54:12     mstransform_cli(vis=self.infile, outputvis=self.infile_YY, correlation='YY',
27-Oct-2026 10:54:12 ../../../../venv/lib/python3.12/site-packages/casatasks/mstransform.py:620: in __call__
27-Oct-2026 10:54:12     task_result = _mstransform_t( _pc.document['vis'], _pc.document['outputvis'], _pc.document['createmms'], _pc.document['separationaxis'], _pc.document['numsubms'], _pc.document['tileshape'], _pc.document['field'], _pc.document['spw'], _pc.document['scan'], _pc.document['antenna'], _pc.document['correlation'], _pc.document['timerange'], _pc.document['intent'], _pc.document['array'], _pc.document['uvrange'], _pc.document['observation'], _pc.document['feed'], _pc.document['datacolumn'], _pc.document['realmodelcol'], _pc.document['keepflags'], _pc.document['usewtspectrum'], _pc.document['combinespws'], _pc.document['chanaverage'], _pc.document['chanbin'], _pc.document['hanning'], _pc.document['regridms'], _pc.document['mode'], _pc.document['nchan'], _pc.document['start'], _pc.document['width'], _pc.document['nspw'], _pc.document['interpolation'], _pc.document['phasecenter'], _pc.document['restfreq'], _pc.document['outframe'], _pc.document['veltype'], _pc.document['preaverage'], _pc.document['timeaverage'], _pc.document['timebin'], _pc.document['timespan'], _pc.document['maxuvwdistance'], _pc.document['docallib'], _pc.document['callib'], _pc.document['douvcontsub'], _pc.document['fitspw'], _pc.document['fitorder'], _pc.document['want_cont'], _pc.document['denoising_lib'], _pc.document['nthreads'], _pc.document['niter'], _pc.document['disableparallel'], _pc.document['ddistart'], _pc.document['taql'], _pc.document['monolithic_processing'], _pc.document['reindex'] )
27-Oct-2026 10:54:12                   ^^^^^^^^^^^^^^^^^^^^^^^^^^^^^^^^^^^^^^^^^^^^^^^^^^^^^^^^^^^^^^^^^^^^^^^^^^^^^^^^^^^^^^^^^^^^^^^^^^^^^^^^^^^^^^^^^^^^^^^^^^^^^^^^^^^^^^^^^^^^^^^^^^^^^^^^^^^^^^^^^^^^^^^^^^^^^^^^^^^^^^^^^^^^^^^^^^^^^^^^^^^^^^^^^^^^^^^^^^^^^^^^^^^^^^^^^^^^^^^^^^^^^^^^^^^^^^^^^^^^^^^^^^^^^^^^^^^^^^^^^^^^^^^^^^^^^^^^^^^^^^^^^^^^^^^^^^^^^^^^^^^^^^^^^^^^^^^^^^^^^^^^^^^^^^^^^^^^^^^^^^^^^^^^^^^^^^^^^^^^^^^^^^^^^^^^^^^^^^^^^^^^^^^^^^^^^^^^^^^^^^^^^^^^^^^^^^^^^^^^^^^^^^^^^^^^^^^^^^^^^^^^^^^^^^^^^^^^^^^^^^^^^^^^^^^^^^^^^^^^^^^^^^^^^^^^^^^^^^^^^^^^^^^^^^^^^^^^^^^^^^^^^^^^^^^^^^^^^^^^^^^^^^^^^^^^^^^^^^^^^^^^^^^^^^^^^^^^^^^^^^^^^^^^^^^^^^^^^^^^^^^^^^^^^^^^^^^^^^^^^^^^^^^^^^^^^^^^^^^^^^^^^^^^^^^^^^^^^^^^^^^^^^^^^^^^^^^^^^^^^^^^^^^^^^^^^^^^^^^^^^^^^^^^^^^^^^^^^^^^^^^^^^^^^^^^^^^^^^^^^^^^^^^^^^^^^^^^^^^^^^^^^^^^^^^^^^^^^^^^^^^^^^^^^^^^^^^^^^^^^^^^^^^^^^^^^^^^^^^^^^^^^^^^^^^^^^^^^^^^^^^^^^^^^^^^^^^^^^^^^^^^^^^^^^^^^^^^^^^^^^^^^^^^^^^^^^^^^^^^^^^^^^^^^^^^^^^^^^^^^^^^^^^^^^^^^^^^^^^^^^^^^^^^^^^^^^^^^^^^^^^^^^^^^^^^^^^^^^^^^^^^^^^^^^^^^^^^^^^^^^^^^^^^^^^^^^^^^^^^^^^^^^^^^^^^^^^^^^^^^^^^^^^^^^^^^^^^^^^^^^^^^^^^^^^^^^^^^^^^^^^^^^^^^^^^^^^^^^^^^^^^^^^^^^^^^^^^^^^^^^^^^^^^^^^^^^^^^^^^^^^^^^^^^^^^^^^^^^^^^^^^^^^^^^^^^^^^^^^^^^^^^^^^^^^^^^^^^^^^^^^^^^^^^^^^^^^^^^^^^^^^^^^^^^^^^^^^^^^^^^^^^^^^^^^^^^^^^^^^^^^^^^^^^^^^^^^^^^^^^^^^^^^^^^^^^^^^^^^^^^^^^^^^^^^^^^^^^^^^^^^^^^^^^^^^^^^^^^^^^^^^^^^^^^^^^^^^^^^^^^^^^^^^^^^^^^^^^^^^^^^^^^^^^^^^^^^^^^^^^^^^^^^^^^^^^^^^^^^^^^^^^^^^^^^^^^^^^^^^^^^^^^^
27-Oct-2026 10:54:12 ../../../../venv/lib/python3.12/site-packages/casatasks/private/task_mstransform.py:293: in mstransform
27-Oct-2026 10:54:12     mtlocal.open()
27-Oct-2026 10:54:12 ../../../../venv/lib/python3.12/site-packages/casatools/mstransformer.py:36: in open
27-Oct-2026 10:54:12     return self._swigobj.open()
27-Oct-2026 10:54:12            ^^^^^^^^^^^^^^^^^^^^
27-Oct-2026 10:54:12 ../../../../venv/lib/python3.12/site-packages/casatools/__casac__/mstransformer.py:176: in open
27-Oct-2026 10:54:12     return _mstransformer.mstransformer_open(self)
27-Oct-2026 10:54:12            ^^^^^^^^^^^^^^^^^^^^^^^^^^^^^^^^^^^^^^^
27-Oct-2026 10:54:12 E   RuntimeError: Measures directory specified which does not contain the IERS data: /home/casatest/data/measures
27-Oct-2026 10:54:12 - generated xml file: /home/casatest/casa6/casatestutils/nosedir/xml/test_task_sdgaincal/nose.xml -
27-Oct-2026 10:54:12 =========================== short test summary info ============================
27-Oct-2026 10:54:12 FAILED test_task_sdgaincal.py::sdgaincal_const_test::test_const01 - RuntimeEr...
27-Oct-2026 10:54:12 FAILED test_task_sdgaincal.py::sdgaincal_const_test::test_const02 - RuntimeEr...
27-Oct-2026 10:54:12 FAILED test_task_sdgaincal.py::sdgaincal_const_test::test_const03 - RuntimeEr...
27-Oct-2026 10:54:12 FAILED test_task_sdgaincal.py::sdgaincal_variable_test::test_variable01 - Run...
27-Oct-2026 10:54:12 FAILED test_task_sdgaincal.py::sdgaincal_preapply_test::test_preapply01 - Run...
27-Oct-2026 10:54:12 FAILED test_task_sdgaincal.py::sdgaincal_preapply_test::test_preapply02 - Run...
27-Oct-2026 10:54:12 FAILED test_task_sdgaincal.py::sdgaincal_preapply_test::test_preapply03 - Run...
27-Oct-2026 10:54:12 FAILED test_task_sdgaincal.py::sdgaincal_preapply_test::test_preapply04 - Run...
27-Oct-2026 10:54:12 FAILED test_task_sdgaincal.py::sdgaincal_single_polarization_test::test_single_pol
27-Oct-2026 10:54:12 ==================== 9 failed, 4 passed, 1 warning in 2.04s ====================
27-Oct-2026 10:54:12 ============================= test session starts ==============================
27-Oct-2026 10:54:12 platform linux -- Python 3.12.9, pytest-9.1.1, pluggy-1.7.0 -- /home/casatest/venv/bin/python3.12
27-Oct-2026 10:54:12 cachedir: .pytest_cache
27-Oct-2026 10:54:12 rootdir: /home/casatest/casa6/casatestutils/nosedir/test_task_bandpass
27-Oct-2026 10:54:12 configfile: pytest.ini
27-Oct-2026 10:54:13 collecting ... 2026-10-27 14:54:13        WARN        ObsInfo::setTelescope (file /source/casa6/casatools/casacore/coordinates/Coordinates/ObsInfo.cc, line 124)        Cannot read table of Observatories, continuing without telescope position in ObsInfo
27-Oct-2026 10:54:13 bandpass tests will use data from /opt/casa/data/casatestdata/unittest/bandpass/
27-Oct-2026 10:54:13 collected 6 items
27-Oct-2026 10:54:13
27-Oct-2026 10:54:13
27-Oct-2026 10:54:13 test_task_bandpass.py::bandpass1_test::test1a 2026-10-27 14:54:14        SEVERE        Calibrater::solve        Caught exception: Measures directory specified which does not contain the IERS data: /home/casatest/data/measures
27-Oct-2026 10:54:13 2026-10-27 14:54:14        SEVERE                Exception Reported: Error in Calibrater::solve.
27-Oct-2026 10:54:13 2026-10-27 14:54:14        SEVERE        bandpass::::casa        Task bandpass raised an exception of class RuntimeError with the following message: Measures directory specified which does not contain the IERS data: /home/casatest/data/measures
27-Oct-2026 10:54:13
27-Oct-2026 10:54:13 Bandpass 1a: Create bandpass table using field=0
27-Oct-2026 10:54:13 FAILED
27-Oct-2026 10:54:13
27-Oct-2026 10:54:13 test_task_bandpass.py::bandpass1_test::test_dictBelowMinBl 2026-10-27 14:54:14        SEVERE        agentflagger:: (file src/tools/agentflagger/agentflagger_cmpt.cc, line 35)        Exception Reported: Measures directory specified which does not contain the IERS data: /home/casatest/data/measures
27-Oct-2026 10:54:13 2026-10-27 14:54:14        SEVERE        flagdata::::casa        Task flagdata raised an exception of class RuntimeError with the following message: Measures directory specified which does not contain the IERS data: /home/casatest/data/measures
27-Oct-2026 10:54:13
27-Oct-2026 10:54:13 Test that results will reflect ants excluded due to missing baselines 
27-Oct-2026 10:54:13 FAILED
27-Oct-2026 10:54:13
27-Oct-2026 10:54:13 test_task_bandpass.py::bandpass1_test::test_dictOutputAntennaFlag 2026-10-27 14:54:14        SEVERE        agentflagger:: (file src/tools/agentflagger/agentflagger_cmpt.cc, line 35)        Exception Reported: Measures directory specified which does not contain the IERS data: /home/casatest/data/measures
27-Oct-2026 10:54:13 2026-10-27 14:54:14        SEVERE        flagdata::::casa        Task flagdata raised an exception of class RuntimeError with the following message: Measures directory specified which does not contain the IERS data: /home/casatest/data/measures
27-Oct-2026 10:54:13
27-Oct-2026 10:54:13 Test that preflagging antennas shows in the output dict 
27-Oct-2026 10:54:13 FAILED
27-Oct-2026 10:54:13
27-Oct-2026 10:54:13 test_task_bandpass.py::bandpass1_test::test_dictOutputFlagged 2026-10-27 14:54:14        SEVERE        agentflagger:: (file src/tools/agentflagger/agentflagger_cmpt.cc, line 35)        Exception Reported: Measures directory specified which does not contain the IERS data: /home/casatest/data/measures
27-Oct-2026 10:54:13 2026-10-27 14:54:14        SEVERE        flagdata::::casa        Task flagdata raised an exception of class RuntimeError with the following message: Measures directory specified which does not contain the IERS data: /home/casatest/data/measures
27-Oct-2026 10:54:13
27-Oct-2026 10:54:13 Test that when an spw is flagged the final data counts are zero 
27-Oct-2026 10:54:13 FAILED
27-Oct-2026 10:54:13
27-Oct-2026 10:54:13 test_task_bandpass.py::bandpass1_test::test_returnDict 2026-10-27 14:54:14        SEVERE        Calibrater::solve        Caught exception: Measures directory specified which does not contain the IERS data: /home/casatest/data/measures
27-Oct-2026 10:54:13 2026-10-27 14:54:14        SEVERE                Exception Reported: Error in Calibrater::solve.
27-Oct-2026 10:54:13 2026-10-27 14:54:14        SEVERE        bandpass::::casa        Task bandpass raised an exception of class RuntimeError with the following message: Measures directory specified which does not contain the IERS data: /home/casatest/data/measures
27-Oct-2026 10:54:14
27-Oct-2026 10:54:14 Test that the return value is a dictionary 
27-Oct-2026 10:54:14 FAILED
27-Oct-2026 10:54:14
27-Oct-2026 10:54:14 test_task_bandpass.py::bandpass2_test::test1b 2026-10-27 14:54:14        SEVERE        Calibrater::solve        Caught exception: Measures directory specified which does not contain the IERS data: /home/casatest/data/measures
27-Oct-2026 10:54:14 2026-10-27 14:54:14        SEVERE                Exception Reported: Error in Calibrater::solve.
27-Oct-2026 10:54:14 2026-10-27 14:54:14        SEVERE        bandpass::::casa        Task bandpass raised an exception of class RuntimeError with the following message: Measures directory specified which does not contain the IERS data: /home/casatest/data/measures
27-Oct-2026 10:54:14
27-Oct-2026 10:54:14 Bandpass 1b: Create cal tables for the MS and MMS split by spws
27-Oct-2026 10:54:14 FAILED
27-Oct-2026 10:54:14
27-Oct-2026 10:54:14 =================================== FAILURES ===================================
27-Oct-2026 10:54:14 ____________________________ bandpass1_test.test1a _____________________________
27-Oct-2026 10:54:14 ../../../../venv/lib/python3.12/site-packages/casatasks/private/task_bandpass.py:134: in bandpass
27-Oct-2026 10:54:14     mycb.solve()
27-Oct-2026 10:54:14 ../../../../venv/lib/python3.12/site-packages/casatools/calibrater.py:485: in solve
27-Oct-2026 10:54:14     return self._swigobj.solve()
27-Oct-2026 10:54:14            ^^^^^^^^^^^^^^^^^^^^^
27-Oct-2026 10:54:14 ../../../../venv/lib/python3.12/site-packages/casatools/__casac__/calibrater.py:1133: in solve
27-Oct-2026 10:54:14     return _calibrater.calibrater_solve(self)
27-Oct-2026 10:54:14            ^^^^^^^^^^^^^^^^^^^^^^^^^^^^^^^^^^
27-Oct-2026 10:54:14 E   RuntimeError: Error in Calibrater::solve.
27-Oct-2026 10:54:14
27-Oct-2026 10:54:14 During handling of the above exception, another exception occurred:
27-Oct-2026 10:54:14 test_task_bandpass.py:108: in test1a
27-Oct-2026 10:54:14     bandpass(vis=self.msfile, caltable=msbcal, field='0',uvrange='>0.0',
27-Oct-2026 10:54:14 ../../../../venv/lib/python3.12/site-packages/casatasks/bandpass.py:392: in __call__
27-Oct-2026 10:54:14     task_result = _bandpass_t( _pc.document['vis'], _pc.document['caltable'], _pc.document['field'], _pc.document['spw'], _pc.document['intent'], _pc.document['selectdata'], _pc.document['timerange'], _pc.document['uvrange'], _pc.document['antenna'], _pc.document['scan'], _pc.document['observation'], _pc.document['msselect'], _pc.document['solint'], _pc.document['combine'], _pc.document['refant'], _pc.document['minblperant'], _pc.document['minsnr'], _pc.document['solnorm'], _pc.document['bandtype'], _pc.document['smodel'], _pc.document['corrdepflags'], _pc.document['append'], _pc.document['fillgaps'], _pc.document['degamp'], _pc.document['degphase'], _pc.document['visnorm'], _pc.document['maskcenter'], _pc.document['maskedge'], _pc.document['docallib'], _pc.document['callib'], _pc.document['gaintable'], _pc.document['gainfield'], _pc.document['interp'], _pc.document['spwmap'], _pc.document['parang'] )
27-Oct-2026 10:54:14                   ^^^^^^^^^^^^^^^^^^^^^^^^^^^^^^^^^^^^^^^^^^^^^^^^^^^^^^^^^^^^^^^^^^^^^^^^^^^^^^^^^^^^^^^^^^^^^^^^^^^^^^^^^^^^^^^^^^^^^^^^^^^^^^^^^^^^^^^^^^^^^^^^^^^^^^^^^^^^^^^^^^^^^^^^^^^^^^^^^^^^^^^^^^^^^^^^^^^^^^^^^^^^^^^^^^^^^^^^^^^^^^^^^^^^^^^^^^^^^^^^^^^^^^^^^^^^^^^^^^^^^^^^^^^^^^^^^^^^^^^^^^^^^^^^^^^^^^^^^^^^^^^^^^^^^^^^^^^^^^^^^^^^^^^^^^^^^^^^^^^^^^^^^^^^^^^^^^^^^^^^^^^^^^^^^^^^^^^^^^^^^^^^^^^^^^^^^^^^^^^^^^^^^^^^^^^^^^^^^^^^^^^^^^^^^^^^^^^^^^^^^^^^^^^^^^^^^^^^^^^^^^^^^^^^^^^^^^^^^^^^^^^^^^^^^^^^^^^^^^^^^^^^^^^^^^^^^^^^^^^^^^^^^^^^^^^^^^^^^^^^^^^^^^^^^^^^^^^^^^^^^^^^^^^^^^^^^^^^^^^^^^^^^^^^^^^^^^^^^^^^^^^^^^^^^^^^^^^^^^^^^^^^^^^^^^^^^^^^^^^^^^^^^^^^^^^^^^^^^^^^^^^^^^^^^^^^^^^^^^^^^^^^^^^^^^^^^^^^^^^^^^^^^^^^^^^^^^^^^^^^^^^^^^^^^^^^^^^^^^^^^^^^^^^^^^^^^^^^^^^^^^^^^^^^^^^^^^^^^^^^^^^^^^^^^^^^^^^^^^^^^^^^^^^^^^^^^^^^^^^^^^^^^^^^^^^^^^^^^^^^^^^^^^^^^^^^^^^^^^^^^^^^^^^^^^^^^^^^^^^^^^^^^^^^^^^^^^^^
27-Oct-2026 10:54:14 ../../../../venv/lib/python3.12/site-packages/casatasks/private/task_bandpass.py:137: in bandpass
27-Oct-2026 10:54:14     results_dict = mycb.returndict()
27-Oct-2026 10:54:14                    ^^^^^^^^^^^^^^^^^
27-Oct-2026 10:54:14 ../../../../venv/lib/python3.12/site-packages/casatools/calibrater.py:431: in returndict
27-Oct-2026 10:54:14     return self._swigobj.returndict()
27-Oct-2026 10:54:14            ^^^^^^^^^^^^^^^^^^^^^^^^^^
27-Oct-2026 10:54:14 ../../../../venv/lib/python3.12/site-packages/casatools/__casac__/calibrater.py:937: in returndict
27-Oct-2026 10:54:14     return _calibrater.calibrater_returndict(self)
27-Oct-2026 10:54:14            ^^^^^^^^^^^^^^^^^^^^^^^^^^^^^^^^^^^^^^^
27-Oct-2026 10:54:14 E   RuntimeError: Measures directory specified which does not contain the IERS data: /home/casatest/data/measures
27-Oct-2026 10:54:14 ______________________ bandpass1_test.test_dictBelowMinBl ______________________
27-Oct-2026 10:54:14 test_task_bandpass.py:149: in test_dictBelowMinBl
27-Oct-2026 10:54:14     flagdata(vis=self.msfile, antenna='0~24')
27-Oct-2026 10:54:14 ../../../../venv/lib/python3.12/site-packages/casatasks/flagdata.py:1136: in __call__
27-Oct-2026 10:54:14     task_result = _flagdata_t( _pc.document['vis'], _pc.document['mode'], _pc.document['autocorr'], _pc.document['inpfile'], _pc.document['reason'], _pc.document['tbuff'], _pc.document['spw'], _pc.document['field'], _pc.document['antenna'], _pc.document['uvrange'], _pc.document['timerange'], _pc.document['correlation'], _pc.document['scan'], _pc.document['intent'], _pc.document['array'], _pc.document['observation'], _pc.document['feed'], _pc.document['clipminmax'], _pc.document['datacolumn'], _pc.document['clipoutside'], _pc.document['channelavg'], _pc.document['chanbin'], _pc.document['timeavg'], _pc.document['timebin'], _pc.document['clipzeros'], _pc.document['quackinterval'], _pc.document['quackmode'], _pc.document['quackincrement'], _pc.document['tolerance'], _pc.document['addantenna'], _pc.document['lowerlimit'], _pc.document['upperlimit'], _pc.document['ntime'], _pc.document['combinescans'], _pc.document['timecutoff'], _pc.document['freqcutoff'], _pc.document['timefit'], _pc.document['freqfit'], _pc.document['maxnpieces'], _pc.document['flagdimension'], _pc.document['usewindowstats'], _pc.document['halfwin'], _pc.document['extendflags'], _pc.document['winsize'], _pc.document['timedev'], _pc.document['freqdev'], _pc.document['timedevscale'], _pc.document['freqdevscale'], _pc.document['spectralmax'], _pc.document['spectralmin'], _pc.document['antint_ref_antenna'], _pc.document['minchanfrac'], _pc.document['verbose'], _pc.document['extendpols'], _pc.document['growtime'], _pc.document['growfreq'], _pc.document['growaround'], _pc.document['flagneartime'], _pc.document['flagnearfreq'], _pc.document['minrel'], _pc.document['maxrel'], _pc.document['minabs'], _pc.document['maxabs'], _pc.document['spwchan'], _pc.document['spwcorr'], _pc.document['basecnt'], _pc.document['fieldcnt'], _pc.document['name'], _pc.document['action'], _pc.document['display'], _pc.document['flagbackup'], _pc.document['savepars'], _pc.document['cmdreason'], _pc.document['outfile'], _pc.document['overwrite'], _pc.document['writeflags'] )
27-Oct-2026 10:54:14                   ^^^^^^^^^^^^^^^^^^^^^^^^^^^^^^^^^^^^^^^^^^^^^^^^^^^^^^^^^^^^^^^^^^^^^^^^^^^^^^^^^^^^^^^^^^^^^^^^^^^^^^^^^^^^^^^^^^^^^^^^^^^^^^^^^^^^^^^^^^^^^^^^^^^^^^^^^^^^^^^^^^^^^^^^^^^^^^^^^^^^^^^^^^^^^^^^^^^^^^^^^^^^^^^^^^^^^^^^^^^^^^^^^^^^^^^^^^^^^^^^^^^^^^^^^^^^^^^^^^^^^^^^^^^^^^^^^^^^^^^^^^^^^^^^^^^^^^^^^^^^^^^^^^^^^^^^^^^^^^^^^^^^^^^^^^^^^^^^^^^^^^^^^^^^^^^^^^^^^^^^^^^^^^^^^^^^^^^^^^^^^^^^^^^^^^^^^^^^^^^^^^^^^^^^^^^^^^^^^^^^^^^^^^^^^^^^^^^^^^^^^^^^^^^^^^^^^^^^^^^^^^^^^^^^^^^^^^^^^^^^^^^^^^^^^^^^^^^^^^^^^^^^^^^^^^^^^^^^^^^^^^^^^^^^^^^^^^^^^^^^^^^^^^^^^^^^^^^^^^^^^^^^^^^^^^^^^^^^^^^^^^^^^^^^^^^^^^^^^^^^^^^^^^^^^^^^^^^^^^^^^^^^^^^^^^^^^^^^^^^^^^^^^^^^^^^^^^^^^^^^^^^^^^^^^^^^^^^^^^^^^^^^^^^^^^^^^^^^^^^^^^^^^^^^^^^^^^^^^^^^^^^^^^^^^^^^^^^^^^^^^^^^^^^^^^^^^^^^^^^^^^^^^^^^^^^^^^^^^^^^^^^^^^^^^^^^^^^^^^^^^^^^^^^^^^^^^^^^^^^^^^^^^^^^^^^^^^^^^^^^^^^^^^^^^^^^^^^^^^^^^^^^^^^^^^^^^^^^^^^^^^^^^^^^^^^^^^^^^^^^^^^^^^^^^^^^^^^^^^^^^^^^^^^^^^^^^^^^^^^^^^^^^^^^^^^^^^^^^^^^^^^^^^^^^^^^^^^^^^^^^^^^^^^^^^^^^^^^^^^^^^^^^^^^^^^^^^^^^^^^^^^^^^^^^^^^^^^^^^^^^^^^^^^^^^^^^^^^^^^^^^^^^^^^^^^^^^^^^^^^^^^^^^^^^^^^^^^^^^^^^^^^^^^^^^^^^^^^^^^^^^^^^^^^^^^^^^^^^^^^^^^^^^^^^^^^^^^^^^^^^^^^^^^^^^^^^^^^^^^^^^^^^^^^^^^^^^^^^^^^^^^^^^^^^^^^^^^^^^^^^^^^^^^^^^^^^^^^^^^^^^^^^^^^^^^^^^^^^^^^^^^^^^^^^^^^^^^^^^^^^^^^^^^^^^^^^^^^^^^^^^^^^^^^^^^^^^^^^^^^^^^^^^^^^^^^^^^^^^^^^^^^^^^^^^^^^^^^^^^^^^^^^^^^^^^^^^^^^^^^^^^^^^^^^^^^^^^^^^^^^^^^^^^^^^^^^^^^^^^^^^^^^^^^^^^^^^^^^^^^^^^^^^^^^^^^^^^^^^^^^^^^^^^^^^^^^^^^^^^^^^^^^^^^^^^^^^^^^^^^^^^^^^^^^^^^^^^^^^^^^^^^^^^^^^^^^^^^^^^^^^^^^^^^^^^^^^^^^^^^^^^^^^^^^^^^^^^^^^^^^^^^^^^^^^^^^^^^^^^^^^^^^^^^^^^^^^^^^^^^^^^^^^^^^^^^^^^^^^^^^^^^^^^^^^^^^^^^^^^^^^^^^^^^^^^^^^^^^^^^^^^^^^^^^^^^^^^^^^^^^^^^^^^^^^^^^^^^^^^^^^^^^^^^^^^^^^^^^^^^^^^^^^^^^^^^^^^^^^^^^^^^^^^^^^^^^^^^^^^^^^^^^^^^^^^^^^^^^^^^^^^^^^^^^^^^^^^^^^^^^^^^^^^^^^^^^^^^^^^^^^^^^^^^^^^^^^^^^^^^^^^^^^^^^^^^^^^^^^^^^^^^^^^^^^^^^^^^^^^^^^^^^^^^^^^^^^^^^^^^^^^^^^^^^^^^^^^^^^^^^^^^^^^^^^^^^^^^^^^^^^^^^^^^^^^^^^^^^^^^^^^^^^^^^^^^^^^^^^^^^^^^^^^^^^^^^^^^^^^^^^^^
27-Oct-2026 10:54:14 ../../../../venv/lib/python3.12/site-packages/casatasks/private/task_flagdata.py:696: in flagdata
27-Oct-2026 10:54:14     summary_stats_list = aflocal.run(writeflags, True)
27-Oct-2026 10:54:14                          ^^^^^^^^^^^^^^^^^^^^^^^^^^^^^
27-Oct-2026 10:54:14 ../../../../venv/lib/python3.12/site-packages/casatools/agentflagger.py:55: in run
27-Oct-2026 10:54:14     return self._swigobj.run(writeflags, sequential)
27-Oct-2026 10:54:14            ^^^^^^^^^^^^^^^^^^^^^^^^^^^^^^^^^^^^^^^^^
27-Oct-2026 10:54:14 ../../../../venv/lib/python3.12/site-packages/casatools/__casac__/agentflagger.py:283: in run
27-Oct-2026 10:54:14     return _agentflagger.agentflagger_run(self, *args, **kwargs)
27-Oct-2026 10:54:14            ^^^^^^^^^^^^^^^^^^^^^^^^^^^^^^^^^^^^^^^^^^^^^^^^^^^^^
27-Oct-2026 10:54:14 E   RuntimeError: Measures directory specified which does not contain the IERS data: /home/casatest/data/measures
27-Oct-2026 10:54:14 __________________ bandpass1_test.test_dictOutputAntennaFlag ___________________
27-Oct-2026 10:54:14 test_task_bandpass.py:137: in test_dictOutputAntennaFlag
27-Oct-2026 10:54:14     flagdata(vis=self.msfile, antenna='0')
27-Oct-2026 10:54:14 ../../../../venv/lib/python3.12/site-packages/casatasks/flagdata.py:1136: in __call__
27-Oct-2026 10:54:14     task_result = _flagdata_t( _pc.document['vis'], _pc.document['mode'], _pc.document['autocorr'], _pc.document['inpfile'], _pc.document['reason'], _pc.document['tbuff'], _pc.document['spw'], _pc.document['field'], _pc.document['antenna'], _pc.document['uvrange'], _pc.document['timerange'], _pc.document['correlation'], _pc.document['scan'], _pc.document['intent'], _pc.document['array'], _pc.document['observation'], _pc.document['feed'], _pc.document['clipminmax'], _pc.document['datacolumn'], _pc.document['clipoutside'], _pc.document['channelavg'], _pc.document['chanbin'], _pc.document['timeavg'], _pc.document['timebin'], _pc.document['clipzeros'], _pc.document['quackinterval'], _pc.document['quackmode'], _pc.document['quackincrement'], _pc.document['tolerance'], _pc.document['addantenna'], _pc.document['lowerlimit'], _pc.document['upperlimit'], _pc.document['ntime'], _pc.document['combinescans'], _pc.document['timecutoff'], _pc.document['freqcutoff'], _pc.document['timefit'], _pc.document['freqfit'], _pc.document['maxnpieces'], _pc.document['flagdimension'], _pc.document['usewindowstats'], _pc.document['halfwin'], _pc.document['extendflags'], _pc.document['winsize'], _pc.document['timedev'], _pc.document['freqdev'], _pc.document['timedevscale'], _pc.document['freqdevscale'], _pc.document['spectralmax'], _pc.document['spectralmin'], _pc.document['antint_ref_antenna'], _pc.document['minchanfrac'], _pc.document['verbose'], _pc.document['extendpols'], _pc.document['growtime'], _pc.document['growfreq'], _pc.document['growaround'], _pc.document['flagneartime'], _pc.document['flagnearfreq'], _pc.document['minrel'], _pc.document['maxrel'], _pc.document['minabs'], _pc.document['maxabs'], _pc.document['spwchan'], _pc.document['spwcorr'], _pc.document['basecnt'], _pc.document['fieldcnt'], _pc.document['name'], _pc.document['action'], _pc.document['display'], _pc.document['flagbackup'], _pc.document['savepars'], _pc.document['cmdreason'], _pc.document['outfile'], _pc.document['overwrite'], _pc.document['writeflags'] )
27-Oct-2026 10:54:14                   ^^^^^^^^^^^^^^^^^^^^^^^^^^^^^^^^^^^^^^^^^^^^^^^^^^^^^^^^^^^^^^^^^^^^^^^^^^^^^^^^^^^^^^^^^^^^^^^^^^^^^^^^^^^^^^^^^^^^^^^^^^^^^^^^^^^^^^^^^^^^^^^^^^^^^^^^^^^^^^^^^^^^^^^^^^^^^^^^^^^^^^^^^^^^^^^^^^^^^^^^^^^^^^^^^^^^^^^^^^^^^^^^^^^^^^^^^^^^^^^^^^^^^^^^^^^^^^^^^^^^^^^^^^^^^^^^^^^^^^^^^^^^^^^^^^^^^^^^^^^^^^^^^^^^^^^^^^^^^^^^^^^^^^^^^^^^^^^^^^^^^^^^^^^^^^^^^^^^^^^^^^^^^^^^^^^^^^^^^^^^^^^^^^^^^^^^^^^^^^^^^^^^^^^^^^^^^^^^^^^^^^^^^^^^^^^^^^^^^^^^^^^^^^^^^^^^^^^^^^^^^^^^^^^^^^^^^^^^^^^^^^^^^^^^^^^^^^^^^^^^^^^^^^^^^^^^^^^^^^^^^^^^^^^^^^^^^^^^^^^^^^^^^^^^^^^^^^^^^^^^^^^^^^^^^^^^^^^^^^^^^^^^^^^^^^^^^^^^^^^^^^^^^^^^^^^^^^^^^^^^^^^^^^^^^^^^^^^^^^^^^^^^^^^^^^^^^^^^^^^^^^^^^^^^^^^^^^^^^^^^^^^^^^^^^^^^^^^^^^^^^^^^^^^^^^^^^^^^^^^^^^^^^^^^^^^^^^^^^^^^^^^^^^^^^^^^^^^^^^^^^^^^^^^^^^^^^^^^^^^^^^^^^^^^^^^^^^^^^^^^^^^^^^^^^^^^^^^^^^^^^^^^^^^^^^^^^^^^^^^^^^^^^^^^^^^^^^^^^^^^^^^^^^^^^^^^^^^^^^^^^^^^^^^^^^^^^^^^^^^^^^^^^^^^^^^^^^^^^^^^^^^^^^^^^^^^^^^^^^^^^^^^^^^^^^^^^^^^^^^^^^^^^^^^^^^^^^^^^^^^^^^^^^^^^^^^^^^^^^^^^^^^^^^^^^^^^^^^^^^^^^^^^^^^^^^^^^^^^^^^^^^^^^^^^^^^^^^^^^^^^^^^^^^^^^^^^^^^^^^^^^^^^^^^^^^^^^^^^^^^^^^^^^^^^^^^^^^^^^^^^^^^^^^^^^^^^^^^^^^^^^^^^^^^^^^^^^^^^^^^^^^^^^^^^^^^^^^^^^^^^^^^^^^^^^^^^^^^^^^^^^^^^^^^^^^^^^^^^^^^^^^^^^^^^^^^^^^^^^^^^^^^^^^^^^^^^^^^^^^^^^^^^^^^^^^^^^^^^^^^^^^^^^^^^^^^^^^^^^^^^^^^^^^^^^^^^^^^^^^^^^^^^^^^^^^^^^^^^^^^^^^^^^^^^^^^^^^^^^^^^^^^^^^^^^^^^^^^^^^^^^^^^^^^^^^^^^^^^^^^^^^^^^^^^^^^^^^^^^^^^^^^^^^^^^^^^^^^^^^^^^^^^^^^^^^^^^^^^^^^^^^^^^^^^^^^^^^^^^^^^^^^^^^^^^^^^^^^^^^^^^^^^^^^^^^^^^^^^^^^^^^^^^^^^^^^^^^^^^^^^^^^^^^^^^^^^^^^^^^^^^^^^^^^^^^^^^^^^^^^^^^^^^^^^^^^^^^^^^^^^^^^^^^^^^^^^^^^^^^^^^^^^^^^^^^^^^^^^^^^^^^^^^^^^^^^^^^^^^^^^^^^^^^^^^^^^^^^^^^^^^^^^^^^^^^^^^^^^^^^^^^^^^^^^^^^^^^^^^^^^^^^^^^^^^^^^^^^^^^^^^^^^^^^^^^^^^^^^^^^^^^^^^^^^^^^^^^^^^^^^^^^^^^^^^^^^^^^^^^^^^^^^^^^^^^^^^^^^^^^^^^^^^^^^^^^^^^^^^^^^^^^^^^^^^^^^^^^^^^^^^^^^^^^^^^^^^^^^^^^^^^^^^^^^^^^^^^^^^^^^^^^^^^^^^^^^^^^^^^^^^^^^^^^^^^^^^^^^^^^^^^^^^^^^^^^^^^^^^^^^^^^^^^^^^^^^^^^^^^^^^^^^^^^^^^^^^^^^^^^^^^^^^^^^^^^^^^^^^^^^^^^
27-Oct-2026 10:54:14 ../../../../venv/lib/python3.12/site-packages/casatasks/private/task_flagdata.py:696: in flagdata
27-Oct-2026 10:54:14     summary_stats_list = aflocal.run(writeflags, True)
27-Oct-2026 10:54:14                          ^^^^^^^^^^^^^^^^^^^^^^^^^^^^^
27-Oct-2026 10:54:14 ../../../../venv/lib/python3.12/site-packages/casatools/agentflagger.py:55: in run
27-Oct-2026 10:54:14     return self._swigobj.run(writeflags, sequential)
27-Oct-2026 10:54:14            ^^^^^^^^^^^^^^^^^^^^^^^^^^^^^^^^^^^^^^^^^
27-Oct-2026 10:54:14 ../../../../venv/lib/python3.12/site-packages/casatools/__casac__/agentflagger.py:283: in run
27-Oct-2026 10:54:14     return _agentflagger.agentflagger_run(self, *args, **kwargs)
27-Oct-2026 10:54:14            ^^^^^^^^^^^^^^^^^^^^^^^^^^^^^^^^^^^^^^^^^^^^^^^^^^^^^
27-Oct-2026 10:54:14 E   RuntimeError: Measures directory specified which does not contain the IERS data: /home/casatest/data/measures
27-Oct-2026 10:54:14 ____________________ bandpass1_test.test_dictOutputFlagged _____________________
27-Oct-2026 10:54:14 test_task_bandpass.py:124: in test_dictOutputFlagged
27-Oct-2026 10:54:14     flagdata(vis=self.msfile, spw='0')
27-Oct-2026 10:54:14 ../../../../venv/lib/python3.12/site-packages/casatasks/flagdata.py:1136: in __call__
27-Oct-2026 10:54:14     task_result = _flagdata_t( _pc.document['vis'], _pc.document['mode'], _pc.document['autocorr'], _pc.document['inpfile'], _pc.document['reason'], _pc.document['tbuff'], _pc.document['spw'], _pc.document['field'], _pc.document['antenna'], _pc.document['uvrange'], _pc.document['timerange'], _pc.document['correlation'], _pc.document['scan'], _pc.document['intent'], _pc.document['array'], _pc.document['observation'], _pc.document['feed'], _pc.document['clipminmax'], _pc.document['datacolumn'], _pc.document['clipoutside'], _pc.document['channelavg'], _pc.document['chanbin'], _pc.document['timeavg'], _pc.document['timebin'], _pc.document['clipzeros'], _pc.document['quackinterval'], _pc.document['quackmode'], _pc.document['quackincrement'], _pc.document['tolerance'], _pc.document['addantenna'], _pc.document['lowerlimit'], _pc.document['upperlimit'], _pc.document['ntime'], _pc.document['combinescans'], _pc.document['timecutoff'], _pc.document['freqcutoff'], _pc.document['timefit'], _pc.document['freqfit'], _pc.document['maxnpieces'], _pc.document['flagdimension'], _pc.document['usewindowstats'], _pc.document['halfwin'], _pc.document['extendflags'], _pc.document['winsize'], _pc.document['timedev'], _pc.document['freqdev'], _pc.document['timedevscale'], _pc.document['freqdevscale'], _pc.document['spectralmax'], _pc.document['spectralmin'], _pc.document['antint_ref_antenna'], _pc.document['minchanfrac'], _pc.document['verbose'], _pc.document['extendpols'], _pc.document['growtime'], _pc.document['growfreq'], _pc.document['growaround'], _pc.document['flagneartime'], _pc.document['flagnearfreq'], _pc.document['minrel'], _pc.document['maxrel'], _pc.document['minabs'], _pc.document['maxabs'], _pc.document['spwchan'], _pc.document['spwcorr'], _pc.document['basecnt'], _pc.document['fieldcnt'], _pc.document['name'], _pc.document['action'], _pc.document['display'], _pc.document['flagbackup'], _pc.document['savepars'], _pc.document['cmdreason'], _pc.document['outfile'], _pc.document['overwrite'], _pc.document['writeflags'] )
27-Oct-2026 10:54:14                   ^^^^^^^^^^^^^^^^^^^^^^^^^^^^^^^^^^^^^^^^^^^^^^^^^^^^^^^^^^^^^^^^^^^^^^^^^^^^^^^^^^^^^^^^^^^^^^^^^^^^^^^^^^^^^^^^^^^^^^^^^^^^^^^^^^^^^^^^^^^^^^^^^^^^^^^^^^^^^^^^^^^^^^^^^^^^^^^^^^^^^^^^^^^^^^^^^^^^^^^^^^^^^^^^^^^^^^^^^^^^^^^^^^^^^^^^^^^^^^^^^^^^^^^^^^^^^^^^^^^^^^^^^^^^^^^^^^^^^^^^^^^^^^^^^^^^^^^^^^^^^^^^^^^^^^^^^^^^^^^^^^^^^^^^^^^^^^^^^^^^^^^^^^^^^^^^^^^^^^^^^^^^^^^^^^^^^^^^^^^^^^^^^^^^^^^^^^^^^^^^^^^^^^^^^^^^^^^^^^^^^^^^^^^^^^^^^^^^^^^^^^^^^^^^^^^^^^^^^^^^^^^^^^^^^^^^^^^^^^^^^^^^^^^^^^^^^^^^^^^^^^^^^^^^^^^^^^^^^^^^^^^^^^^^^^^^^^^^^^^^^^^^^^^^^^^^^^^^^^^^^^^^^^^^^^^^^^^^^^^^^^^^^^^^^^^^^^^^^^^^^^^^^^^^^^^^^^^^^^^^^^^^^^^^^^^^^^^^^^^^^^^^^^^^^^^^^^^^^^^^^^^^^^^^^^^^^^^^^^^^^^^^^^^^^^^^^^^^^^^^^^^^^^^^^^^^^^^^^^^^^^^^^^^^^^^^^^^^^^^^^^^^^^^^^^^^^^^^^^^^^^^^^^^^^^^^^^^^^^^^^^^^^^^^^^^^^^^^^^^^^^^^^^^^^^^^^^^^^^^^^^^^^^^^^^^^^^^^^^^^^^^^^^^^^^^^^^^^^^^^^^^^^^^^^^^^^^^^^^^^^^^^^^^^^^^^^^^^^^^^^^^^^^^^^^^^^^^^^^^^^^^^^^^^^^^^^^^^^^^^^^^^^^^^^^^^^^^^^^^^^^^^^^^^^^^^^^^^^^^^^^^^^^^^^^^^^^^^^^^^^^^^^^^^^^^^^^^^^^^^^^^^^^^^^^^^^^^^^^^^^^^^^^^^^^^^^^^^^^^^^^^^^^^^^^^^^^^^^^^^^^^^^^^^^^^^^^^^^^^^^^^^^^^^^^^^^^^^^^^^^^^^^^^^^^^^^^^^^^^^^^^^^^^^^^^^^^^^^^^^^^^^^^^^^^^^^^^^^^^^^^^^^^^^^^^^^^^^^^^^^^^^^^^^^^^^^^^^^^^^^^^^^^^^^^^^^^^^^^^^^^^^^^^^^^^^^^^^^^^^^^^^^^^^^^^^^^^^^^^^^^^^^^^^^^^^^^^^^^^^^^^^^^^^^^^^^^^^^^^^^^^^^^^^^^^^^^^^^^^^^^^^^^^^^^^^^^^^^^^^^^^^^^^^^^^^^^^^^^^^^^^^^^^^^^^^^^^^^^^^^^^^^^^^^^^^^^^^^^^^^^^^^^^^^^^^^^^^^^^^^^^^^^^^^^^^^^^^^^^^^^^^^^^^^^^^^^^^^^^^^^^^^^^^^^^^^^^^^^^^^^^^^^^^^^^^^^^^^^^^^^^^^^^^^^^^^^^^^^^^^^^^^^^^^^^^^^^^^^^^^^^^^^^^^^^^^^^^^^^^^^^^^^^^^^^^^^^^^^^^^^^^^^^^^^^^^^^^^^^^^^^^^^^^^^^^^^^^^^^^^^^^^^^^^^^^^^^^^^^^^^^^^^^^^^^^^^^^^^^^^^^^^^^^^^^^^^^^^^^^^^^^^^^^^^^^^^^^^^^^^^^^^^^^^^^^^^^^^^^^^^^^^^^^^^^^^^^^^^^^^^^^^^^^^^^^^^^^^^^^^^^^^^^^^^^^^^^^^^^^^^^^^^^^^^^^^^^^^^^^^^^^^^^^^^^^^^^^^^^^^^^^^^^^^^^^^^^^^^^^^^^^^^^^^^^^^^^^^^^^^^^^^^^^^^^^^^^^^^^^^^^^^^^^^^^^^^^^^^^^^^^^^^^^^^^^^^^^^^^^^^^^^^^^^^^^^^^^^^^^^^^^^^^^^^^^^^^^^^^^^^^^^^^^^^^^^^^^^^^^^^^^^^^^^^^^^^^^^^^^^^^^terminate called after throwing an instance of 'casacore::AipsError'
27-Oct-2026 10:54:14   what():  RegularFile: /home/casatest/casa6/casatestutils/nosedir/test_task_bandpass/ngc4826.ms/SPECTRAL_WINDOW/table.dat_tmp does not exist and cannot be created
27-Oct-2026 10:54:20 ============================= test session starts ==============================
27-Oct-2026 10:54:20 platform linux -- Python 3.12.9, pytest-9.1.1, pluggy-1.7.0 -- /home/casatest/venv/bin/python3.12
27-Oct-2026 10:54:20 cachedir: .pytest_cache
27-Oct-2026 10:54:20 rootdir: /home/casatest/casa6/casatestutils/nosedir/test_task_visstat
27-Oct-2026 10:54:20 configfile: pytest.ini
27-Oct-2026 10:54:21 collecting ... 2026-10-27 14:54:21        WARN        ObsInfo::setTelescope (file /source/casa6/casatools/casacore/coordinates/Coordinates/ObsInfo.cc, line 124)        Cannot read table of Observatories, continuing without telescope position in ObsInfo
27-Oct-2026 10:54:21 2026-10-27 14:54:22        SEVERE        visstat::ms::statistics        Exception Reported: Measures directory specified which does not contain the IERS data: /home/casatest/data/measures
27-Oct-2026 10:54:21 2026-10-27 14:54:22        SEVERE        visstat::::casa        Task visstat raised an exception of class RuntimeError with the following message: Measures directory specified which does not contain the IERS data: /home/casatest/data/measures
27-Oct-2026 10:54:21 collected 0 items / 1 error
27-Oct-2026 10:54:21
27-Oct-2026 10:54:21 ==================================== ERRORS ====================================
27-Oct-2026 10:54:21 ____________________ ERROR collecting test_task_visstat.py _____________________
27-Oct-2026 10:54:21 test_task_visstat.py:80: in <module>
27-Oct-2026 10:54:21     nostat = visstat(selectiondata)
27-Oct-2026 10:54:21              ^^^^^^^^^^^^^^^^^^^^^^
27-Oct-2026 10:54:21 ../../../../venv/lib/python3.12/site-packages/casatasks/visstat.py:206: in __call__
27-Oct-2026 10:54:21     task_result = _visstat_t( _pc.document['vis'], _pc.document['axis'], _pc.document['datacolumn'], _pc.document['useflags'], _pc.document['spw'], _pc.document['field'], _pc.document['selectdata'], _pc.document['antenna'], _pc.document['uvrange'], _pc.document['timerange'], _pc.document['correlation'], _pc.document['scan'], _pc.document['array'], _pc.document['observation'], _pc.document['timeaverage'], _pc.document['timebin'], _pc.document['timespan'], _pc.document['maxuvwdistance'], _pc.document['disableparallel'], _pc.document['ddistart'], _pc.document['taql'], _pc.document['monolithic_processing'], _pc.document['intent'], _pc.document['reportingaxes'], _pc.document['doquantiles'] )
27-Oct-2026 10:54:21                   ^^^^^^^^^^^^^^^^^^^^^^^^^^^^^^^^^^^^^^^^^^^^^^^^^^^^^^^^^^^^^^^^^^^^^^^^^^^^^^^^^^^^^^^^^^^^^^^^^^^^^^^^^^^^^^^^^^^^^^^^^^^^^^^^^^^^^^^^^^^^^^^^^^^^^^^^^^^^^^^^^^^^^^^^^^^^^^^^^^^^^^^^^^^^^^^^^^^^^^^^^^^^^^^^^^^^^^^^^^^^^^^^^^^^^^^^^^^^^^^^^^^^^^^^^^^^^^^^^^^^^^^^^^^^^^^^^^^^^^^^^^^^^^^^^^^^^^^^^^^^^^^^^^^^^^^^^^^^^^^^^^^^^^^^^^^^^^^^^^^^^^^^^^^^^^^^^^^^^^^^^^^^^^^^^^^^^^^^^^^^^^^^^^^^^^^^^^^^^^^^^^^^^^^^^^^^^^^^^^^^^^^^^^^^^^^^^^^^^^^^^^^^^^^^^^^^^^^^^^^^^^^^^^^^^^^^^^^^^^^^^^^^^^^^^^^^^^^^^^^^^^^^^^^^^^^^^^^^^^^^^^^^^^^^^^^^^^^^^^^^^^^^^^^^^^^^^^^^^^^^^^^^^^^^^^^^^^^^^^^^^^^^^^^^^^^^^^^^^^^^^^^^^^^^^^^^^^^^^^^^^^^^^^^^^^^^^^^^^^^^^^^^^^^^^^^^^^^^^^^^^^^^^^^^^^^^^^^^^
27-Oct-2026 10:54:21 ../../../../venv/lib/python3.12/site-packages/casatasks/private/task_visstat.py:37: in visstat
27-Oct-2026 10:54:21     s = mslocal.statistics(
27-Oct-2026 10:54:21 ../../../../venv/lib/python3.12/site-packages/casatools/ms.py:642: in statistics
27-Oct-2026 10:54:21     return self._swigobj.statistics(column, complex_value, useflags, useweights, spw, field, baseline, uvrange, time, correlation, scan, intent, array, obs, reportingaxes, timeaverage, timebin, timespan, maxuvwdistance, doquantiles)
27-Oct-2026 10:54:21            ^^^^^^^^^^^^^^^^^^^^^^^^^^^^^^^^^^^^^^^^^^^^^^^^^^^^^^^^^^^^^^^^^^^^^^^^^^^^^^^^^^^^^^^^^^^^^^^^^^^^^^^^^^^^^^^^^^^^^^^^^^^^^^^^^^^^^^^^^^^^^^^^^^^^^^^^^^^^^^^^^^^^^^^^^^^^^^^^^^^^^^^^^^^^^^^^^^^^^^^^^^^^^^^^^^^^^^^^^^^^^
27-Oct-2026 10:54:21 ../../../../venv/lib/python3.12/site-packages/casatools/__casac__/ms.py:1681: in statistics
27-Oct-2026 10:54:21     return _ms.ms_statistics(self, *args, **kwargs)
27-Oct-2026 10:54:21            ^^^^^^^^^^^^^^^^^^^^^^^^^^^^^^^^^^^^^^^^
27-Oct-2026 10:54:21 E   RuntimeError: Measures directory specified which does not contain the IERS data: /home/casatest/data/measures
27-Oct-2026 10:54:21 - generated xml file: /home/casatest/casa6/casatestutils/nosedir/xml/test_task_visstat/nose.xml -
27-Oct-2026 10:54:21 =========================== short test summary info ============================
27-Oct-2026 10:54:21 ERROR test_task_visstat.py - RuntimeError: Measures directory specified which...
27-Oct-2026 10:54:21 !!!!!!!!!!!!!!!!!!!! Interrupted: 1 error during collection !!!!!!!!!!!!!!!!!!!!
27-Oct-2026 10:54:21 ========================= 1 warning, 1 error in 1.28s ==========================
27-Oct-2026 10:54:21 Traceback (most recent call last):
27-Oct-2026 10:54:21   File "/home/casatest/casa6/casatestutils/runtest.py", line 1526, in <module>
27-Oct-2026 10:54:21     run(
27-Oct-2026 10:54:21   File "/home/casatest/casa6/casatestutils/runtest.py", line 1170, in run
27-Oct-2026 10:54:21     setup_and_run(cmd, workdir, workpath, dirname, DRY_RUN, pytest_args )
27-Oct-2026 10:54:21   File "/home/casatest/casa6/casatestutils/runtest.py", line 1016, in setup_and_run
27-Oct-2026 10:54:21     update_xml(xmlfile, result, name=os.getcwd().split("/")[-1])
27-Oct-2026 10:54:21   File "/home/casatest/casa6/casatestutils/runtest.py", line 581, in update_xml
27-Oct-2026 10:54:21     testclass = element.attrib["classname"].split(".")[1]
27-Oct-2026 10:54:21                 ~~~~~~~~~~~~~~~~~~~~~~~~~~~~~~~~~~~~~~^^^
27-Oct-2026 10:54:21 IndexError: list index out of range
27-Oct-2026 10:54:21
27-Oct-2026 10:54:21
27-Oct-2026 10:54:21 Setting Working Directory: /home/casatest/casa6/casatestutils/nosedir/test_task_specfit/
27-Oct-2026 10:54:21 Test Directory: /home/casatest/casa6/casatestutils/nosedir/test_task_specfit
27-Oct-2026 10:54:21
27-Oct-2026 10:54:21 Running Command: pytest --junitxml=/home/casatest/casa6/casatestutils/nosedir/xml/test_task_specfit/nose.xml -s --disable-pytest-warnings --verbose -ra --tb=short /home/casatest/casa6/casatestutils/nosedir/test_task_specfit/
27-Oct-2026 10:54:21
27-Oct-2026 10:54:21 Setting Working Directory: /home/casatest/casa6/casatestutils/nosedir/test_task_pccor/
27-Oct-2026 10:54:21 Test Directory: /home/casatest/casa6/casatestutils/nosedir/test_task_pccor
27-Oct-2026 10:54:21
27-Oct-2026 10:54:21 Running Command: pytest --junitxml=/home/casatest/casa6/casatestutils/nosedir/xml/test_task_pccor/nose.xml -s --disable-pytest-warnings --verbose -ra --tb=short /home/casatest/casa6/casatestutils/nosedir/test_task_pccor/
27-Oct-2026 10:54:21
27-Oct-2026 10:54:21 Setting Working Directory: /home/casatest/casa6/casatestutils/nosedir/test_task_imdev/
27-Oct-2026 10:54:21 Test Directory: /home/casatest/casa6/casatestutils/nosedir/test_task_imdev
27-Oct-2026 10:54:21
27-Oct-2026 10:54:21 Running Command: pytest --junitxml=/home/casatest/casa6/casatestutils/nosedir/xml/test_task_imdev/nose.xml -s --disable-pytest-warnings --verbose -ra --tb=short /home/casatest/casa6/casatestutils/nosedir/test_task_imdev/
27-Oct-2026 10:54:21
27-Oct-2026 10:54:21 Setting Working Directory: /home/casatest/casa6/casatestutils/nosedir/test_task_zenithdelaycal/
27-Oct-2026 10:54:21 Test Directory: /home/casatest/casa6/casatestutils/nosedir/test_task_zenithdelaycal
27-Oct-2026 10:54:21
27-Oct-2026 10:54:21 Running Command: pytest --junitxml=/home/casatest/casa6/casatestutils/nosedir/xml/test_task_zenithdelaycal/nose.xml -s --disable-pytest-warnings --verbose -ra --tb=short /home/casatest/casa6/casatestutils/nosedir/test_task_zenithdelaycal/
27-Oct-2026 10:54:21
27-Oct-2026 10:54:21 Setting Working Directory: /home/casatest/casa6/casatestutils/nosedir/test_jyperk/
27-Oct-2026 10:54:21 Test Directory: /home/casatest/casa6/casatestutils/nosedir/test_jyperk
27-Oct-2026 10:54:21
27-Oct-2026 10:54:21 Running Command: pytest --junitxml=/home/casatest/casa6/casatestutils/nosedir/xml/test_jyperk/nose.xml -s --disable-pytest-warnings --verbose -ra --tb=short /home/casatest/casa6/casatestutils/nosedir/test_jyperk/
27-Oct-2026 10:54:21
27-Oct-2026 10:54:21 Setting Working Directory: /home/casatest/casa6/casatestutils/nosedir/test_task_setjy/
27-Oct-2026 10:54:21 Test Directory: /home/casatest/casa6/casatestutils/nosedir/test_task_setjy
27-Oct-2026 10:54:21
27-Oct-2026 10:54:21 Running Command: pytest --junitxml=/home/casatest/casa6/casatestutils/nosedir/xml/test_task_setjy/nose.xml -s --disable-pytest-warnings --verbose -ra --tb=short /home/casatest/casa6/casatestutils/nosedir/test_task_setjy/
27-Oct-2026 10:54:21
27-Oct-2026 10:54:21 Setting Working Directory: /home/casatest/casa6/casatestutils/nosedir/test_task_imstat/
27-Oct-2026 10:54:21 Test Directory: /home/casatest/casa6/casatestutils/nosedir/test_task_imstat
27-Oct-2026 10:54:21
27-Oct-2026 10:54:21 Running Command: pytest --junitxml=/home/casatest/casa6/casatestutils/nosedir/xml/test_task_imstat/nose.xml -s --disable-pytest-warnings --verbose -ra --tb=short /home/casatest/casa6/casatestutils/nosedir/test_task_imstat/
27-Oct-2026 10:54:21
27-Oct-2026 10:54:21 Setting Working Directory: /home/casatest/casa6/casatestutils/nosedir/test_task_conjugatevis/
27-Oct-2026 10:54:21 Test Directory: /home/casatest/casa6/casatestutils/nosedir/test_task_conjugatevis
27-Oct-2026 10:54:21
27-Oct-2026 10:54:21 Running Command: pytest --junitxml=/home/casatest/casa6/casatestutils/nosedir/xml/test_task_conjugatevis/nose.xml -s --disable-pytest-warnings --verbose -ra --tb=short /home/casatest/casa6/casatestutils/nosedir/test_task_conjugatevis/
27-Oct-2026 10:54:21
27-Oct-2026 10:54:21 Setting Working Directory: /home/casatest/casa6/casatestutils/nosedir/test_task_spxfit/
27-Oct-2026 10:54:21 Test Directory: /home/casatest/casa6/casatestutils/nosedir/test_task_spxfit
27-Oct-2026 10:54:21
27-Oct-2026 10:54:21 Running Command: pytest --junitxml=/home/casatest/casa6/casatestutils/nosedir/xml/test_task_spxfit/nose.xml -s --disable-pytest-warnings --verbose -ra --tb=short /home/casatest/casa6/casatestutils/nosedir/test_task_spxfit/
27-Oct-2026 10:54:21
27-Oct-2026 10:54:21 Setting Working Directory: /home/casatest/casa6/casatestutils/nosedir/test_task_clearstat/
27-Oct-2026 10:54:21 Test Directory: /home/casatest/casa6/casatestutils/nosedir/test_task_clearstat
27-Oct-2026 10:54:21
27-Oct-2026 10:54:21 Running Command: pytest --junitxml=/home/casatest/casa6/casatestutils/nosedir/xml/test_task_clearstat/nose.xml -s --disable-pytest-warnings --verbose -ra --tb=short /home/casatest/casa6/casatestutils/nosedir/test_task_clearstat/
27-Oct-2026 10:54:21
27-Oct-2026 10:54:21 Setting Working Directory: /home/casatest/casa6/casatestutils/nosedir/test_task_imhistory/
27-Oct-2026 10:54:21 Test Directory: /home/casatest/casa6/casatestutils/nosedir/test_task_imhistory
27-Oct-2026 10:54:21
27-Oct-2026 10:54:21 Running Command: pytest --junitxml=/home/casatest/casa6/casatestutils/nosedir/xml/test_task_imhistory/nose.xml -s --disable-pytest-warnings --verbose -ra --tb=short /home/casatest/casa6/casatestutils/nosedir/test_task_imhistory/
27-Oct-2026 10:54:21
27-Oct-2026 10:54:21 Setting Working Directory: /home/casatest/casa6/casatestutils/nosedir/test_task_phaseshift/
27-Oct-2026 10:54:21 Test Directory: /home/casatest/casa6/casatestutils/nosedir/test_task_phaseshift
27-Oct-2026 10:54:21
27-Oct-2026 10:54:21 Running Command: pytest --junitxml=/home/casatest/casa6/casatestutils/nosedir/xml/test_task_phaseshift/nose.xml -s --disable-pytest-warnings --verbose -ra --tb=short /home/casatest/casa6/casatestutils/nosedir/test_task_phaseshift/
27-Oct-2026 10:54:21
27-Oct-2026 10:54:21 Setting Working Directory: /home/casatest/casa6/casatestutils/nosedir/test_task_flagdata/
27-Oct-2026 10:54:21 Test Directory: /home/casatest/casa6/casatestutils/nosedir/test_task_flagdata
27-Oct-2026 10:54:21
27-Oct-2026 10:54:21 Running Command: pytest --junitxml=/home/casatest/casa6/casatestutils/nosedir/xml/test_task_flagdata/nose.xml -s --disable-pytest-warnings --verbose -ra --tb=short /home/casatest/casa6/casatestutils/nosedir/test_task_flagdata/
27-Oct-2026 10:54:21 Nose File Not Generated. Generating: /home/casatest/casa6/casatestutils/nosedir/xml/test_task_flagdata/nose.xml
27-Oct-2026 10:54:21
27-Oct-2026 10:54:21 Setting Working Directory: /home/casatest/casa6/casatestutils/nosedir/test_task_initweights/
27-Oct-2026 10:54:21 Test Directory: /home/casatest/casa6/casatestutils/nosedir/test_task_initweights
27-Oct-2026 10:54:21
27-Oct-2026 10:54:21 Running Command: pytest --junitxml=/home/casatest/casa6/casatestutils/nosedir/xml/test_task_initweights/nose.xml -s --disable-pytest-warnings --verbose -ra --tb=short /home/casatest/casa6/casatestutils/nosedir/test_task_initweights/
27-Oct-2026 10:54:21
27-Oct-2026 10:54:21 Setting Working Directory: /home/casatest/casa6/casatestutils/nosedir/test_task_sdgaincal/
27-Oct-2026 10:54:21 Test Directory: /home/casatest/casa6/casatestutils/nosedir/test_task_sdgaincal
27-Oct-2026 10:54:21
27-Oct-2026 10:54:21 Running Command: pytest --junitxml=/home/casatest/casa6/casatestutils/nosedir/xml/test_task_sdgaincal/nose.xml -s --disable-pytest-warnings --verbose -ra --tb=short /home/casatest/casa6/casatestutils/nosedir/test_task_sdgaincal/
27-Oct-2026 10:54:21
27-Oct-2026 10:54:21 Setting Working Directory: /home/casatest/casa6/casatestutils/nosedir/test_task_bandpass/
27-Oct-2026 10:54:21 Test Directory: /home/casatest/casa6/casatestutils/nosedir/test_task_bandpass
27-Oct-2026 10:54:21
27-Oct-2026 10:54:21 Running Command: pytest --junitxml=/home/casatest/casa6/casatestutils/nosedir/xml/test_task_bandpass/nose.xml -s --disable-pytest-warnings --verbose -ra --tb=short /home/casatest/casa6/casatestutils/nosedir/test_task_bandpass/
27-Oct-2026 10:54:21
27-Oct-2026 10:54:21 Setting Working Directory: /home/casatest/casa6/casatestutils/nosedir/test_task_visstat/
27-Oct-2026 10:54:21 Test Directory: /home/casatest/casa6/casatestutils/nosedir/test_task_visstat
27-Oct-2026 10:54:21
27-Oct-2026 10:54:21 Running Command: pytest --junitxml=/home/casatest/casa6/casatestutils/nosedir/xml/test_task_visstat/nose.xml -s --disable-pytest-warnings --verbose -ra --tb=short /home/casatest/casa6/casatestutils/nosedir/test_task_visstat/
27-Oct-2026 10:54:22 total 81700
27-Oct-2026 10:54:22 -rw-r--r-- 1 casaci 15001  1066651 Oct 27 14:37 casashell-6.8.0.1-py3-none-any.whl
27-Oct-2026 10:54:22 -rw-r--r-- 1 casaci 15001  1935259 Oct 27 14:37 casatasks-6.8.0.1-py3-none-any.whl
27-Oct-2026 10:54:22 -rw-r--r-- 1 casaci root    815364 Oct 27 14:54 casatasks_test.log
27-Oct-2026 10:54:22 -rw-r--r-- 1 casaci 15001   161004 Oct 27 14:37 casatestutils-6.8.0.1-py3-none-any.whl
27-Oct-2026 10:54:22 -rw-r--r-- 1 casaci 15001 79357178 Oct 27 14:37 casatools-6.8.0.1-cp312-cp312-manylinux_2_28_x86_64.whl
27-Oct-2026 10:54:22 -rw-r--r-- 1 casaci root       870 Oct 27 14:54 requirements.txt
27-Oct-2026 10:54:22 -rw-r--r-- 1 casaci root      2684 Oct 27 14:54 test_jyperk.xml
27-Oct-2026 10:54:22 -rw-r--r-- 1 casaci root     26492 Oct 27 14:54 test_task_bandpass.xml
27-Oct-2026 10:54:22 -rw-r--r-- 1 casaci root       689 Oct 27 14:54 test_task_clearstat.xml
27-Oct-2026 10:54:22 -rw-r--r-- 1 casaci root      1366 Oct 27 14:54 test_task_conjugatevis.xml
27-Oct-2026 10:54:22 -rw-r--r-- 1 casaci root       378 Oct 27 14:54 test_task_flagdata.xml
27-Oct-2026 10:54:22 -rw-r--r-- 1 casaci root      1767 Oct 27 14:54 test_task_imdev.xml
27-Oct-2026 10:54:22 -rw-r--r-- 1 casaci root      1175 Oct 27 14:54 test_task_imhistory.xml
27-Oct-2026 10:54:22 -rw-r--r-- 1 casaci root      1440 Oct 27 14:54 test_task_imstat.xml
27-Oct-2026 10:54:22 -rw-r--r-- 1 casaci root     52758 Oct 27 14:54 test_task_initweights.xml
27-Oct-2026 10:54:22 -rw-r--r-- 1 casaci root     25541 Oct 27 14:54 test_task_pccor.xml
27-Oct-2026 10:54:22 -rw-r--r-- 1 casaci root     39427 Oct 27 14:54 test_task_phaseshift.xml
27-Oct-2026 10:54:22 -rw-r--r-- 1 casaci root     21183 Oct 27 14:54 test_task_sdgaincal.xml
27-Oct-2026 10:54:22 -rw-r--r-- 1 casaci root     79307 Oct 27 14:54 test_task_setjy.xml
27-Oct-2026 10:54:22 -rw-r--r-- 1 casaci root      1949 Oct 27 14:54 test_task_specfit.xml
27-Oct-2026 10:54:22 -rw-r--r-- 1 casaci root       705 Oct 27 14:54 test_task_spxfit.xml
27-Oct-2026 10:54:22 -rw-r--r-- 1 casaci root      2947 Oct 27 14:54 test_task_visstat.xml
27-Oct-2026 10:54:22 -rw-r--r-- 1 casaci root      4396 Oct 27 14:54 test_task_zenithdelaycal.xml
27-Oct-2026 10:54:22 Finished task 'Test wheel' with result: Success
27-Oct-2026 10:54:22 Starting task 'Inject is_641' of type 'com.atlassian.bamboo.plugins.bamboo-variable-inject-plugin:inject'
27-Oct-2026 10:54:22 Injected variable bamboo.inject.is_641=False in LOCAL scope
27-Oct-2026 10:54:22 Finished task 'Inject is_641' with result: Success
27-Oct-2026 10:54:22
Substituting variable: ${bamboo.planRepository.branchName} with master
27-Oct-2026 10:54:22
Substituting variable: ${bamboo.python_version} with 3.12
27-Oct-2026 10:54:22
Substituting variable: ${bamboo.agentId} with 153550853
27-Oct-2026 10:54:22
Substituting variable: ${bamboo.agentId} with 153550853
27-Oct-2026 10:54:22
Substituting variable: ${bamboo.agentId} with 153550853
27-Oct-2026 10:54:22
Substituting variable: ${bamboo.agentId} with 153550853
27-Oct-2026 10:54:22 Starting task 'Tar work directory' of type 'com.atlassian.bamboo.plugins.scripttask:task.builder.script'
27-Oct-2026 10:54:22
Beginning to execute external process for build 'CASASPECS - Master Test 3.12 with NRAO IERS - Test Tasks Many Linux 2.28 Rocky 8.10 Py3.12 #10 (CASASPECS-MASTERTESTNRAOIERSPY312-TTM228PY38-10)'
... running command line:
/opt/ci_workspace/casa/bamboo/agent5/temp/CASASPECS-MASTERTESTNRAOIERSPY312-TTM228PY38-10-ScriptBuildTask-15545417642541445468.sh
... in: /opt/ci_workspace/casa/bamboo/agent5/xml-data/build-dir/CASASPECS-MASTERTESTNRAOIERSPY312-TTM228PY38
27-Oct-2026 10:54:22 Package working directory
27-Oct-2026 10:54:22 nosedir/
27-Oct-2026 10:54:22 nosedir/test_task_specfit/
27-Oct-2026 10:54:22 nosedir/test_task_specfit/test_task_specfit.py
27-Oct-2026 10:54:22 nosedir/test_task_specfit/conftest.py
27-Oct-2026 10:54:22 nosedir/test_task_specfit/casa-20261027-143949.log
27-Oct-2026 10:54:23 nosedir/test_task_specfit/short_summary.log
27-Oct-2026 10:54:23 nosedir/test_task_specfit/mylog.txt
27-Oct-2026 10:54:23 nosedir/test_task_specfit/amp_gm_0/
27-Oct-2026 10:54:23 nosedir/test_task_specfit/amp_gm_1/
27-Oct-2026 10:54:23 nosedir/test_task_specfit/amp_gm_2/
27-Oct-2026 10:54:23 nosedir/test_task_specfit/ampErr_gm_0/
27-Oct-2026 10:54:23 nosedir/test_task_specfit/ampErr_gm_1/
27-Oct-2026 10:54:23 nosedir/test_task_specfit/ampErr_gm_2/
27-Oct-2026 10:54:23 nosedir/test_task_specfit/center_gm_0/
27-Oct-2026 10:54:23 nosedir/test_task_specfit/center_gm_1/
27-Oct-2026 10:54:23 nosedir/test_task_specfit/center_gm_2/
27-Oct-2026 10:54:23 nosedir/test_task_specfit/centerErr_gm_0/
27-Oct-2026 10:54:23 nosedir/test_task_specfit/centerErr_gm_1/
27-Oct-2026 10:54:23 nosedir/test_task_specfit/centerErr_gm_2/
27-Oct-2026 10:54:23 nosedir/test_task_specfit/fwhm_gm_0/
27-Oct-2026 10:54:23 nosedir/test_task_specfit/fwhm_gm_1/
27-Oct-2026 10:54:23 nosedir/test_task_specfit/fwhm_gm_2/
27-Oct-2026 10:54:23 nosedir/test_task_specfit/fwhmErr_gm_0/
27-Oct-2026 10:54:23 nosedir/test_task_specfit/fwhmErr_gm_1/
27-Oct-2026 10:54:23 nosedir/test_task_specfit/fwhmErr_gm_2/
27-Oct-2026 10:54:23 nosedir/test_task_specfit/integral_gm_0/
27-Oct-2026 10:54:23 nosedir/test_task_specfit/integral_gm_1/
27-Oct-2026 10:54:23 nosedir/test_task_specfit/integral_gm_2/
27-Oct-2026 10:54:23 nosedir/test_task_specfit/integralErr_gm_0/
27-Oct-2026 10:54:23 nosedir/test_task_specfit/integralErr_gm_1/
27-Oct-2026 10:54:23 nosedir/test_task_specfit/integralErr_gm_2/
27-Oct-2026 10:54:23 nosedir/test_task_specfit/two_lorentzian_fit.log
27-Oct-2026 10:54:23 nosedir/test_task_specfit/amp_ls_0/
27-Oct-2026 10:54:23 nosedir/test_task_specfit/amp_ls_1/
27-Oct-2026 10:54:23 nosedir/test_task_specfit/ampErr_ls_0/
27-Oct-2026 10:54:23 nosedir/test_task_specfit/ampErr_ls_1/
27-Oct-2026 10:54:23 nosedir/test_task_specfit/center_ls_0/
27-Oct-2026 10:54:23 nosedir/test_task_specfit/center_ls_1/
27-Oct-2026 10:54:23 nosedir/test_task_specfit/centerErr_ls_0/
27-Oct-2026 10:54:23 nosedir/test_task_specfit/centerErr_ls_1/
27-Oct-2026 10:54:23 nosedir/test_task_specfit/fwhm_ls_0/
27-Oct-2026 10:54:23 nosedir/test_task_specfit/fwhm_ls_1/
27-Oct-2026 10:54:23 nosedir/test_task_specfit/fwhmErr_ls_0/
27-Oct-2026 10:54:23 nosedir/test_task_specfit/fwhmErr_ls_1/
27-Oct-2026 10:54:23 nosedir/test_task_specfit/integral_ls_0/
27-Oct-2026 10:54:23 nosedir/test_task_specfit/integral_ls_1/
27-Oct-2026 10:54:23 nosedir/test_task_specfit/integralErr_ls_0/
27-Oct-2026 10:54:23 nosedir/test_task_specfit/integralErr_ls_1/
27-Oct-2026 10:54:23 nosedir/test_task_specfit/sigma.im/
27-Oct-2026 10:54:23 nosedir/test_task_specfit/CAS6134_in.im/
27-Oct-2026 10:54:23 nosedir/test_task_specfit/CAS6134_in.im/mask0/
27-Oct-2026 10:54:23 nosedir/test_task_specfit/amp_0/
27-Oct-2026 10:54:23 nosedir/test_task_specfit/amp_0/mask0/
27-Oct-2026 10:54:23 nosedir/test_task_specfit/amp_1/
27-Oct-2026 10:54:23 nosedir/test_task_specfit/amp_1/mask0/
27-Oct-2026 10:54:23 nosedir/test_task_specfit/ampErr_0/
27-Oct-2026 10:54:23 nosedir/test_task_specfit/ampErr_0/mask0/
27-Oct-2026 10:54:23 nosedir/test_task_specfit/ampErr_1/
27-Oct-2026 10:54:23 nosedir/test_task_specfit/ampErr_1/mask0/
27-Oct-2026 10:54:23 nosedir/test_task_specfit/center_0/
27-Oct-2026 10:54:23 nosedir/test_task_specfit/center_0/mask0/
27-Oct-2026 10:54:23 nosedir/test_task_specfit/center_1/
27-Oct-2026 10:54:23 nosedir/test_task_specfit/center_1/mask0/
27-Oct-2026 10:54:23 nosedir/test_task_specfit/centerErr_0/
27-Oct-2026 10:54:23 nosedir/test_task_specfit/centerErr_0/mask0/
27-Oct-2026 10:54:23 nosedir/test_task_specfit/centerErr_1/
27-Oct-2026 10:54:23 nosedir/test_task_specfit/centerErr_1/mask0/
27-Oct-2026 10:54:23 nosedir/test_task_specfit/fwhm_0/
27-Oct-2026 10:54:23 nosedir/test_task_specfit/fwhm_0/mask0/
27-Oct-2026 10:54:23 nosedir/test_task_specfit/fwhm_1/
27-Oct-2026 10:54:23 nosedir/test_task_specfit/fwhm_1/mask0/
27-Oct-2026 10:54:23 nosedir/test_task_specfit/fwhmErr_0/
27-Oct-2026 10:54:23 nosedir/test_task_specfit/fwhmErr_0/mask0/
27-Oct-2026 10:54:23 nosedir/test_task_specfit/fwhmErr_1/
27-Oct-2026 10:54:23 nosedir/test_task_specfit/fwhmErr_1/mask0/
27-Oct-2026 10:54:23 nosedir/test_task_specfit/integral_0/
27-Oct-2026 10:54:23 nosedir/test_task_specfit/integral_0/mask0/
27-Oct-2026 10:54:23 nosedir/test_task_specfit/integral_1/
27-Oct-2026 10:54:23 nosedir/test_task_specfit/integral_1/mask0/
27-Oct-2026 10:54:23 nosedir/test_task_specfit/integralErr_0/
27-Oct-2026 10:54:23 nosedir/test_task_specfit/integralErr_0/mask0/
27-Oct-2026 10:54:23 nosedir/test_task_specfit/integralErr_1/
27-Oct-2026 10:54:23 nosedir/test_task_specfit/integralErr_1/mask0/
27-Oct-2026 10:54:23 nosedir/test_task_specfit/tg_poly.im/
27-Oct-2026 10:54:23 nosedir/test_task_specfit/myres.im/
27-Oct-2026 10:54:23 nosedir/test_task_specfit/myres.im/mask0/
27-Oct-2026 10:54:23 nosedir/test_task_specfit/fit.amp.image_0/
27-Oct-2026 10:54:23 nosedir/test_task_specfit/fit.amp.image_0/mask0/
27-Oct-2026 10:54:23 nosedir/test_task_specfit/fit.amp.image_1/
27-Oct-2026 10:54:23 nosedir/test_task_specfit/fit.amp.image_1/mask0/
27-Oct-2026 10:54:23 nosedir/test_task_specfit/fitcenter.image_0/
27-Oct-2026 10:54:23 nosedir/test_task_specfit/fitcenter.image_0/mask0/
27-Oct-2026 10:54:23 nosedir/test_task_specfit/fitcenter.image_1/
27-Oct-2026 10:54:23 nosedir/test_task_specfit/fitcenter.image_1/mask0/
27-Oct-2026 10:54:23 nosedir/test_task_specfit/fitfwhm.image_0/
27-Oct-2026 10:54:23 nosedir/test_task_specfit/fitfwhm.image_0/mask0/
27-Oct-2026 10:54:23 nosedir/test_task_specfit/fitfwhm.image_1/
27-Oct-2026 10:54:23 nosedir/test_task_specfit/fitfwhm.image_1/mask0/
27-Oct-2026 10:54:23 nosedir/test_task_specfit/maskim/
27-Oct-2026 10:54:23 nosedir/xml/
27-Oct-2026 10:54:23 nosedir/xml/test_task_specfit/
27-Oct-2026 10:54:23 nosedir/xml/test_task_specfit/nose.xml
27-Oct-2026 10:54:23 nosedir/xml/test_task_pccor/
27-Oct-2026 10:54:23 nosedir/xml/test_task_pccor/nose.xml
27-Oct-2026 10:54:23 nosedir/xml/test_task_imdev/
27-Oct-2026 10:54:23 nosedir/xml/test_task_imdev/nose.xml
27-Oct-2026 10:54:23 nosedir/xml/test_task_zenithdelaycal/
27-Oct-2026 10:54:23 nosedir/xml/test_task_zenithdelaycal/nose.xml
27-Oct-2026 10:54:23 nosedir/xml/test_jyperk/
27-Oct-2026 10:54:23 nosedir/xml/test_jyperk/nose.xml
27-Oct-2026 10:54:23 nosedir/xml/test_task_setjy/
27-Oct-2026 10:54:23 nosedir/xml/test_task_setjy/nose.xml
27-Oct-2026 10:54:23 nosedir/xml/test_task_imstat/
27-Oct-2026 10:54:23 nosedir/xml/test_task_imstat/nose.xml
27-Oct-2026 10:54:23 nosedir/xml/test_task_conjugatevis/
27-Oct-2026 10:54:23 nosedir/xml/test_task_conjugatevis/nose.xml
27-Oct-2026 10:54:23 nosedir/xml/test_task_spxfit/
27-Oct-2026 10:54:23 nosedir/xml/test_task_spxfit/nose.xml
27-Oct-2026 10:54:23 nosedir/xml/test_task_clearstat/
27-Oct-2026 10:54:23 nosedir/xml/test_task_clearstat/nose.xml
27-Oct-2026 10:54:23 nosedir/xml/test_task_imhistory/
27-Oct-2026 10:54:23 nosedir/xml/test_task_imhistory/nose.xml
27-Oct-2026 10:54:23 nosedir/xml/test_task_phaseshift/
27-Oct-2026 10:54:23 nosedir/xml/test_task_phaseshift/nose.xml
27-Oct-2026 10:54:23 nosedir/xml/test_task_flagdata/
27-Oct-2026 10:54:23 nosedir/xml/test_task_flagdata/nose.xml
27-Oct-2026 10:54:23 nosedir/xml/test_task_initweights/
27-Oct-2026 10:54:23 nosedir/xml/test_task_initweights/nose.xml
27-Oct-2026 10:54:23 nosedir/xml/test_task_sdgaincal/
27-Oct-2026 10:54:23 nosedir/xml/test_task_sdgaincal/nose.xml
27-Oct-2026 10:54:23 nosedir/xml/test_task_bandpass/
27-Oct-2026 10:54:23 nosedir/xml/test_task_bandpass/nose.xml
27-Oct-2026 10:54:23 nosedir/xml/test_task_visstat/
27-Oct-2026 10:54:23 nosedir/xml/test_task_visstat/nose.xml
27-Oct-2026 10:54:23 nosedir/test_task_pccor/
27-Oct-2026 10:54:23 nosedir/test_task_pccor/test_task_pccor.py
27-Oct-2026 10:54:23 nosedir/test_task_pccor/conftest.py
27-Oct-2026 10:54:23 nosedir/test_task_pccor/casa-20261027-144026.log
27-Oct-2026 10:54:23 nosedir/test_task_pccor/short_summary.log
27-Oct-2026 10:54:23 nosedir/summary_of_failed.log
27-Oct-2026 10:54:23 nosedir/test_task_imdev/
27-Oct-2026 10:54:23 nosedir/test_task_imdev/test_task_imdev.py
27-Oct-2026 10:54:23 nosedir/test_task_imdev/conftest.py
27-Oct-2026 10:54:23 nosedir/test_task_imdev/casa-20261027-144047.log
27-Oct-2026 10:54:23 nosedir/test_task_imdev/short_summary.log
27-Oct-2026 10:54:23 nosedir/test_task_zenithdelaycal/
27-Oct-2026 10:54:23 nosedir/test_task_zenithdelaycal/test_task_zenithdelaycal.py
27-Oct-2026 10:54:23 nosedir/test_task_zenithdelaycal/conftest.py
27-Oct-2026 10:54:23 nosedir/test_task_zenithdelaycal/casa-20261027-144128.log
27-Oct-2026 10:54:23 nosedir/test_task_zenithdelaycal/short_summary.log
27-Oct-2026 10:54:23 nosedir/test_jyperk/
27-Oct-2026 10:54:23 nosedir/test_jyperk/test_jyperk.py
27-Oct-2026 10:54:23 nosedir/test_jyperk/conftest.py
27-Oct-2026 10:54:23 nosedir/test_jyperk/casa-20261027-144136.log
27-Oct-2026 10:54:23 nosedir/test_jyperk/short_summary.log
27-Oct-2026 10:54:23 nosedir/test_task_setjy/
27-Oct-2026 10:54:23 nosedir/test_task_setjy/test_task_setjy.py
27-Oct-2026 10:54:23 nosedir/test_task_setjy/conftest.py
27-Oct-2026 10:54:23 nosedir/test_task_setjy/casa-20261027-144139.log
27-Oct-2026 10:54:23 nosedir/test_task_setjy/short_summary.log
27-Oct-2026 10:54:23 nosedir/test_task_setjy/n1333_1.test.mms.data/
27-Oct-2026 10:54:23 nosedir/test_task_imstat/
27-Oct-2026 10:54:23 nosedir/test_task_imstat/test_task_imstat.py
27-Oct-2026 10:54:23 nosedir/test_task_imstat/conftest.py
27-Oct-2026 10:54:23 nosedir/test_task_imstat/casa-20261027-144156.log
27-Oct-2026 10:54:23 nosedir/test_task_imstat/short_summary.log
27-Oct-2026 10:54:23 nosedir/test_task_imstat/imstat.log
27-Oct-2026 10:54:23 nosedir/test_task_conjugatevis/
27-Oct-2026 10:54:23 nosedir/test_task_conjugatevis/test_task_conjugatevis.py
27-Oct-2026 10:54:23 nosedir/test_task_conjugatevis/conftest.py
27-Oct-2026 10:54:23 nosedir/test_task_conjugatevis/casa-20261027-144215.log
27-Oct-2026 10:54:23 nosedir/test_task_conjugatevis/short_summary.log
27-Oct-2026 10:54:23 nosedir/test_task_spxfit/
27-Oct-2026 10:54:23 nosedir/test_task_spxfit/test_task_spxfit.py
27-Oct-2026 10:54:23 nosedir/test_task_spxfit/conftest.py
27-Oct-2026 10:54:23 nosedir/test_task_spxfit/casa-20261027-144258.log
27-Oct-2026 10:54:23 nosedir/test_task_spxfit/short_summary.log
27-Oct-2026 10:54:23 nosedir/test_task_clearstat/
27-Oct-2026 10:54:23 nosedir/test_task_clearstat/test_task_clearstat.py
27-Oct-2026 10:54:23 nosedir/test_task_clearstat/conftest.py
27-Oct-2026 10:54:23 nosedir/test_task_clearstat/casa-20261027-144306.log
27-Oct-2026 10:54:23 nosedir/test_task_clearstat/short_summary.log
27-Oct-2026 10:54:23 nosedir/test_task_imhistory/
27-Oct-2026 10:54:23 nosedir/test_task_imhistory/test_task_imhistory.py
27-Oct-2026 10:54:23 nosedir/test_task_imhistory/conftest.py
27-Oct-2026 10:54:23 nosedir/test_task_imhistory/casa-20261027-144307.log
27-Oct-2026 10:54:23 nosedir/test_task_imhistory/short_summary.log
27-Oct-2026 10:54:23 nosedir/test_task_phaseshift/
27-Oct-2026 10:54:23 nosedir/test_task_phaseshift/test_task_phaseshift.py
27-Oct-2026 10:54:23 nosedir/test_task_phaseshift/conftest.py
27-Oct-2026 10:54:23 nosedir/test_task_phaseshift/casa-20261027-144309.log
27-Oct-2026 10:54:23 nosedir/test_task_phaseshift/short_summary.log
27-Oct-2026 10:54:23 nosedir/test_task_flagdata/
27-Oct-2026 10:54:23 nosedir/test_task_flagdata/test_task_flagdata.py
27-Oct-2026 10:54:23 nosedir/test_task_flagdata/conftest.py
27-Oct-2026 10:54:23 nosedir/test_task_flagdata/casa-20261027-144320.log
27-Oct-2026 10:54:23 nosedir/test_task_flagdata/short_summary.log
27-Oct-2026 10:54:23 nosedir/test_task_flagdata/X7ef.tsys/
27-Oct-2026 10:54:23 nosedir/test_task_flagdata/X7ef.tsys/ANTENNA/
27-Oct-2026 10:54:23 nosedir/test_task_flagdata/X7ef.tsys/FIELD/
27-Oct-2026 10:54:23 nosedir/test_task_flagdata/X7ef.tsys/HISTORY/
27-Oct-2026 10:54:23 nosedir/test_task_flagdata/X7ef.tsys/SPECTRAL_WINDOW/
27-Oct-2026 10:54:23 nosedir/test_task_flagdata/X7ef.tsys/OBSERVATION/
27-Oct-2026 10:54:23 nosedir/test_task_initweights/
27-Oct-2026 10:54:23 nosedir/test_task_initweights/test_task_initweights.py
27-Oct-2026 10:54:23 nosedir/test_task_initweights/conftest.py
27-Oct-2026 10:54:23 nosedir/test_task_initweights/casa-20261027-145405.log
27-Oct-2026 10:54:23 nosedir/test_task_initweights/short_summary.log
27-Oct-2026 10:54:23 nosedir/test_task_sdgaincal/
27-Oct-2026 10:54:23 nosedir/test_task_sdgaincal/test_task_sdgaincal.py
27-Oct-2026 10:54:23 nosedir/test_task_sdgaincal/conftest.py
27-Oct-2026 10:54:23 nosedir/test_task_sdgaincal/casa-20261027-145410.log
27-Oct-2026 10:54:23 nosedir/test_task_sdgaincal/short_summary.log
27-Oct-2026 10:54:23 nosedir/test_task_bandpass/
27-Oct-2026 10:54:23 nosedir/test_task_bandpass/test_task_bandpass.py
27-Oct-2026 10:54:23 nosedir/test_task_bandpass/conftest.py
27-Oct-2026 10:54:23 nosedir/test_task_bandpass/casa-20261027-145412.log
27-Oct-2026 10:54:23 nosedir/test_task_bandpass/short_summary.log
27-Oct-2026 10:54:23 nosedir/test_task_bandpass/ngc5921.ms.flagversions/
27-Oct-2026 10:54:23 nosedir/test_task_bandpass/ngc5921.ms.flagversions/FLAG_VERSION_LIST
27-Oct-2026 10:54:23 nosedir/test_task_bandpass/ngc5921.ms.flagversions/flags.flagdata_1/
27-Oct-2026 10:54:23 nosedir/test_task_bandpass/ngc5921.ms.flagversions/flags.flagdata_2/
27-Oct-2026 10:54:23 nosedir/test_task_bandpass/ngc5921.ms.flagversions/flags.flagdata_3/
27-Oct-2026 10:54:23 nosedir/test_task_visstat/
27-Oct-2026 10:54:23 nosedir/test_task_visstat/test_task_visstat.py
27-Oct-2026 10:54:23 nosedir/test_task_visstat/pytest.ini
27-Oct-2026 10:54:23 nosedir/test_task_visstat/conftest.py
27-Oct-2026 10:54:23 nosedir/test_task_visstat/casa-20261027-145420.log
27-Oct-2026 10:54:23 nosedir/requirements.txt
27-Oct-2026 10:54:23 total 83116
27-Oct-2026 10:54:23 -rw-r--r-- 1 casaci 15001  1066651 Oct 27 14:37 casashell-6.8.0.1-py3-none-any.whl
27-Oct-2026 10:54:23 -rw-r--r-- 1 casaci 15001  1935259 Oct 27 14:37 casatasks-6.8.0.1-py3-none-any.whl
27-Oct-2026 10:54:23 -rw-r--r-- 1 casaci root    815364 Oct 27 14:54 casatasks_test.log
27-Oct-2026 10:54:23 -rw-r--r-- 1 casaci 15001   161004 Oct 27 14:37 casatestutils-6.8.0.1-py3-none-any.whl
27-Oct-2026 10:54:23 -rw-r--r-- 1 casaci 15001 79357178 Oct 27 14:37 casatools-6.8.0.1-cp312-cp312-manylinux_2_28_x86_64.whl
27-Oct-2026 10:54:23 -rw-r--r-- 1 casaci root       870 Oct 27 14:54 requirements.txt
27-Oct-2026 10:54:23 -rw-r--r-- 1 casaci root      2684 Oct 27 14:54 test_jyperk.xml
27-Oct-2026 10:54:23 -rw-r--r-- 1 casaci root     26492 Oct 27 14:54 test_task_bandpass.xml
27-Oct-2026 10:54:23 -rw-r--r-- 1 casaci root       689 Oct 27 14:54 test_task_clearstat.xml
27-Oct-2026 10:54:23 -rw-r--r-- 1 casaci root      1366 Oct 27 14:54 test_task_conjugatevis.xml
27-Oct-2026 10:54:23 -rw-r--r-- 1 casaci root       378 Oct 27 14:54 test_task_flagdata.xml
27-Oct-2026 10:54:23 -rw-r--r-- 1 casaci root      1767 Oct 27 14:54 test_task_imdev.xml
27-Oct-2026 10:54:23 -rw-r--r-- 1 casaci root      1175 Oct 27 14:54 test_task_imhistory.xml
27-Oct-2026 10:54:23 -rw-r--r-- 1 casaci root      1440 Oct 27 14:54 test_task_imstat.xml
27-Oct-2026 10:54:23 -rw-r--r-- 1 casaci root     52758 Oct 27 14:54 test_task_initweights.xml
27-Oct-2026 10:54:23 -rw-r--r-- 1 casaci root     25541 Oct 27 14:54 test_task_pccor.xml
27-Oct-2026 10:54:23 -rw-r--r-- 1 casaci root     39427 Oct 27 14:54 test_task_phaseshift.xml
27-Oct-2026 10:54:23 -rw-r--r-- 1 casaci root     21183 Oct 27 14:54 test_task_sdgaincal.xml
27-Oct-2026 10:54:23 -rw-r--r-- 1 casaci root     79307 Oct 27 14:54 test_task_setjy.xml
27-Oct-2026 10:54:23 -rw-r--r-- 1 casaci root      1949 Oct 27 14:54 test_task_specfit.xml
27-Oct-2026 10:54:23 -rw-r--r-- 1 casaci root       705 Oct 27 14:54 test_task_spxfit.xml
27-Oct-2026 10:54:23 -rw-r--r-- 1 casaci root      2947 Oct 27 14:54 test_task_visstat.xml
27-Oct-2026 10:54:23 -rw-r--r-- 1 casaci root      4396 Oct 27 14:54 test_task_zenithdelaycal.xml
27-Oct-2026 10:54:23 -rw-r--r-- 1 casaci root   1449961 Oct 27 14:54 work-manylinux_228_casatasks-3.12.tar.gz
27-Oct-2026 10:54:23 Done packaging working directory
27-Oct-2026 10:54:23 Finished task 'Tar work directory' with result: Success
27-Oct-2026 10:54:23 Starting task 'Parse tests' of type 'com.atlassian.bamboo.plugins.testresultparser:task.testresultparser.junit'
27-Oct-2026 10:54:23 Parsing test results under /opt/ci_workspace/casa/bamboo/agent5/xml-data/build-dir/CASASPECS-MASTERTESTNRAOIERSPY312-TTM228PY38...
27-Oct-2026 10:54:23 Failing task since 108 failing test cases were found.
27-Oct-2026 10:54:23 Finished task 'Parse tests' with result: Failed
27-Oct-2026 10:54:23 Running post build plugin 'Docker Container Cleanup'
27-Oct-2026 10:54:23
Beginning to execute external process for build 'CASASPECS - Master Test 3.12 with NRAO IERS - Test Tasks Many Linux 2.28 Rocky 8.10 Py3.12 #10 (CASASPECS-MASTERTESTNRAOIERSPY312-TTM228PY38-10)'
... running command line:
/usr/bin/docker rm -f wheel-container-test-153550853
... in: /opt/ci_workspace/casa/bamboo/agent5/xml-data/build-dir/CASASPECS-MASTERTESTNRAOIERSPY312-TTM228PY38
27-Oct-2026 10:54:25 wheel-container-test-153550853
27-Oct-2026 10:54:25 Running post build plugin 'NCover Results Collector'
27-Oct-2026 10:54:25 Running post build plugin 'Build Results Label Collector'
27-Oct-2026 10:54:25 Running post build plugin 'Clover Results Collector'
27-Oct-2026 10:54:25 Running post build plugin 'npm Cache Cleanup'
27-Oct-2026 10:54:25 Running post build plugin 'Artifact Copier'
27-Oct-2026 10:54:25 Publishing an artifact: Workdir
27-Oct-2026 10:54:25 Finished publishing of artifact Non required job artifact Http Compression On : [Workdir], patterns: [work*.tar.gz] anchored at: [wheeldirectory/] in 100.6 ms
27-Oct-2026 10:54:25 Publishing an artifact: requirements.txt
27-Oct-2026 10:54:25 Finished publishing of artifact Non required job artifact Http Compression On : [requirements.txt], patterns: [requirements.txt] anchored at: [wheeldirectory/] in 8.710 ms
27-Oct-2026 10:54:25 Publishing an artifact: XML Directories
27-Oct-2026 10:54:25 Finished publishing of artifact Non required job artifact Http Compression On : [XML Directories], patterns: [**/*.xml] anchored at: [wheeldirectory/] in 75.82 ms
27-Oct-2026 10:54:25 Finalising the build...
27-Oct-2026 10:54:25 Stopping timer.
27-Oct-2026 10:54:25 Build CASASPECS-MASTERTESTNRAOIERSPY312-TTM228PY38-10 completed.
27-Oct-2026 10:54:25 Running on server: post build plugin 'Build Hanging Detection Configuration'
27-Oct-2026 10:54:25 Running on server: post build plugin 'NCover Results Collector'
27-Oct-2026 10:54:25 Running on server: post build plugin 'Build Labeller'
27-Oct-2026 10:54:25 Running on server: post build plugin 'Clover Delta Calculator'
27-Oct-2026 10:54:25 Running on server: post build plugin 'Maven Dependencies Postprocessor'
27-Oct-2026 10:54:25 All post build plugins have finished
27-Oct-2026 10:54:25 Generating build results summary...
27-Oct-2026 10:54:26 Saving build results to disk...
27-Oct-2026 10:54:26 Store variable context...
27-Oct-2026 10:54:26 Finished building CASASPECS-MASTERTESTNRAOIERSPY312-TTM228PY38-10.