Test Tools and Tasks using measures at go (dot) nrao (dot) edu (slash)iers

Build: #11 failed Manual run by Akeem Wells

Build result summary

Details

Completed
Queue duration
1 second
Duration
192 minutes
Labels
None
Revisions
CASA6
07b93ae4691683e42ffeb80be149a8fa5ebcf9f9
OPEN-CASA-PKG
e5285e68467f01199807a1f1a978aec8a4781be7
Total tests
3938
Failing since
#10 (Manual run by Akeem Wells – )

Responsible

This build has been failing since #10
No one has taken responsibility

Tests

New test failures 6
Status Test View job Duration
Collapse Failed test_task_gencal gencal_eoptest.test_eop
Test Tasks Many Linux 2.28 Rocky 8.10 Py3.12 < 1 sec
AssertionError: False is not true
test_task_gencal.py:911: in test_eop
    self.assertTrue(th.compTables(caltab, reference, ['WEIGHT'], [0.001, 1e-14], mode="both"))
E   AssertionError: False is not true
Collapse Failed test_task_importasdm asdm_import3.test_evlatest1
Test Tasks Many Linux 2.28 Rocky 8.10 Py3.12 < 1 sec
AssertionError: False is not true
test_task_importasdm.py:893: in test_evlatest1
    self.assertTrue(retValue['success'])
E   AssertionError: False is not true
Collapse Failed test_task_polcal polcal_test.test_sourceInstPolDllsLin
Test Tasks Many Linux 2.28 Rocky 8.10 Py3.12 < 1 sec
AssertionError: np.False_ is not true
test_task_polcal.py:281: in test_sourceInstPolDllsLin
    self.assertTrue(np.all(np.isclose(calresult, refresult)))
E   AssertionError: np.False_ is not true
Collapse Failed test_task_polcal polcal_test.test_posAngLin
Test Tasks Many Linux 2.28 Rocky 8.10 Py3.12 < 1 sec
AssertionError: np.False_ is not true
test_task_polcal.py:412: in test_posAngLin
    self.assertTrue(np.all(np.isclose(calresult, 0)))
E   AssertionError: np.False_ is not true
Collapse Failed test_tool_synthesisutils advisechansel_test.test_su_advisechansel_getfreqrange_ephem
Test Tools Many Linux 2.28 Rocky 8.10 Py3.12 < 1 sec
AssertionError: 220295510184.34296 != 220295510184.3427
test_tool_synthesisutils.py:478: in test_su_advisechansel_getfreqrange_ephem
    self.assertEqual(res['freqstart']['value'], refdict['freqstart']['value'])
E   AssertionError: 220295510184.34296 != 220295510184.3427
Collapse Failed unnamed test suite test_task_exportantab
Test Tasks Many Linux 2.28 Rocky 8.10 Py3.12 < 1 sec
collection failure
ImportError while importing test module '/home/casatest/casa6/casatestutils/nosedir/test_task_exportantab/test_task_exportantab.py'.
Hint: make sure your test modules/packages have valid Python names.
Traceback:
/usr/local/lib/python3.12/importlib/__init__.py:90: in import_module
    return _bootstrap._gcd_import(name[level:], package, level)
           ^^^^^^^^^^^^^^^^^^^^^^^^^^^^^^^^^^^^^^^^^^^^^^^^^^^^
test_task_exportantab.py:29: in <module>
(2 more lines...)
Fixed tests 86
Status Test Failing since View job Duration
Successful test_task_bandpass bandpass2_test.test1b
Failing since build #10 (Manual run by Akeem Wells) Test Tasks Many Linux 2.28 Rocky 8.10 Py3.12 < 1 sec
Successful test_task_bandpass bandpass1_test.test_dictOutputFlagged
Failing since build #10 (Manual run by Akeem Wells) Test Tasks Many Linux 2.28 Rocky 8.10 Py3.12 < 1 sec
Successful test_task_bandpass bandpass1_test.test_dictOutputAntennaFlag
Failing since build #10 (Manual run by Akeem Wells) Test Tasks Many Linux 2.28 Rocky 8.10 Py3.12 1 sec
Successful test_task_bandpass bandpass1_test.test_returnDict
Failing since build #10 (Manual run by Akeem Wells) Test Tasks Many Linux 2.28 Rocky 8.10 Py3.12 < 1 sec
Successful test_task_bandpass bandpass1_test.test_dictBelowMinBl
Failing since build #10 (Manual run by Akeem Wells) Test Tasks Many Linux 2.28 Rocky 8.10 Py3.12 < 1 sec
Successful test_task_bandpass bandpass1_test.test1a
Failing since build #10 (Manual run by Akeem Wells) Test Tasks Many Linux 2.28 Rocky 8.10 Py3.12 < 1 sec
Successful test_task_pccor pccor_test_missing.test_missingPcDataUseFringefit
Failing since build #10 (Manual run by Akeem Wells) Test Tasks Many Linux 2.28 Rocky 8.10 Py3.12 2 secs
Successful test_task_pccor pccor_test_splitMses.test_splitMses_non_contiguous_ms
Failing since build #10 (Manual run by Akeem Wells) Test Tasks Many Linux 2.28 Rocky 8.10 Py3.12 2 secs
Successful test_task_pccor pccor_test_solutionValues.test_solutionValues
Failing since build #10 (Manual run by Akeem Wells) Test Tasks Many Linux 2.28 Rocky 8.10 Py3.12 5 secs
Successful test_task_pccor pccor_test_parse.test_parseAntenna_antennas_specified
Failing since build #10 (Manual run by Akeem Wells) Test Tasks Many Linux 2.28 Rocky 8.10 Py3.12 2 secs
Successful test_task_pccor pccor_test_splitMses.test_splitMses_contiguous_ms
Failing since build #10 (Manual run by Akeem Wells) Test Tasks Many Linux 2.28 Rocky 8.10 Py3.12 2 secs
Successful test_task_pccor pccor_test_missing.test_missingPhaseCalSubtable
Failing since build #10 (Manual run by Akeem Wells) Test Tasks Many Linux 2.28 Rocky 8.10 Py3.12 < 1 sec
Successful test_task_pccor pccor_test_parse.test_parseSpw
Failing since build #10 (Manual run by Akeem Wells) Test Tasks Many Linux 2.28 Rocky 8.10 Py3.12 6 secs
Successful test_task_pccor pccor_test_parse.test_parseAntenna
Failing since build #10 (Manual run by Akeem Wells) Test Tasks Many Linux 2.28 Rocky 8.10 Py3.12 4 secs
Successful test_task_pccor pccor_test_parse.test_provideFringeFitTable_equal
Failing since build #10 (Manual run by Akeem Wells) Test Tasks Many Linux 2.28 Rocky 8.10 Py3.12 3 secs
Successful test_task_phaseshift phaseshift_multi_phasecenter_test.test_test_nodict
Failing since build #10 (Manual run by Akeem Wells) Test Tasks Many Linux 2.28 Rocky 8.10 Py3.12 < 1 sec
Successful test_task_phaseshift phaseshift_test.test_outvis
Failing since build #10 (Manual run by Akeem Wells) Test Tasks Many Linux 2.28 Rocky 8.10 Py3.12 1 sec
Successful test_task_phaseshift phaseshift_test.test_shiftAndCompare
Failing since build #10 (Manual run by Akeem Wells) Test Tasks Many Linux 2.28 Rocky 8.10 Py3.12 48 secs
Successful test_task_phaseshift phaseshift_test.test_keepsMMS
Failing since build #10 (Manual run by Akeem Wells) Test Tasks Many Linux 2.28 Rocky 8.10 Py3.12 < 1 sec
Successful test_task_phaseshift phaseshift_multi_phasecenter_test.test_phasecenter_dict_with_field_selection_overlapping
Failing since build #10 (Manual run by Akeem Wells) Test Tasks Many Linux 2.28 Rocky 8.10 Py3.12 < 1 sec
Successful test_task_phaseshift phaseshift_test.test_fieldSelect
Failing since build #10 (Manual run by Akeem Wells) Test Tasks Many Linux 2.28 Rocky 8.10 Py3.12 < 1 sec
Successful test_task_phaseshift phaseshift_test.test_phasecenter
Failing since build #10 (Manual run by Akeem Wells) Test Tasks Many Linux 2.28 Rocky 8.10 Py3.12 < 1 sec
Successful test_task_phaseshift reference_frame_tests.test_field
Failing since build #10 (Manual run by Akeem Wells) Test Tasks Many Linux 2.28 Rocky 8.10 Py3.12 2 secs
Successful test_task_phaseshift phaseshift_multi_phasecenter_test.test_phasecenter_dict_with_field_selection_nonoverlapping
Failing since build #10 (Manual run by Akeem Wells) Test Tasks Many Linux 2.28 Rocky 8.10 Py3.12 < 1 sec
Successful test_task_phaseshift phaseshift_test.test_datacolumn
Failing since build #10 (Manual run by Akeem Wells) Test Tasks Many Linux 2.28 Rocky 8.10 Py3.12 < 1 sec
Successful test_task_phaseshift phaseshift_test.test_phasecenter_default_frame
Failing since build #10 (Manual run by Akeem Wells) Test Tasks Many Linux 2.28 Rocky 8.10 Py3.12 < 1 sec
Successful test_task_phaseshift phaseshift_test.test_takesVis
Failing since build #10 (Manual run by Akeem Wells) Test Tasks Many Linux 2.28 Rocky 8.10 Py3.12 1 sec
Successful test_task_phaseshift phaseshift_multi_phasecenter_test.test_phasecenter_dict_outofrange
Failing since build #10 (Manual run by Akeem Wells) Test Tasks Many Linux 2.28 Rocky 8.10 Py3.12 < 1 sec
Successful test_task_phaseshift phaseshift_multi_phasecenter_test.test_phasecenter_dict_one_out
Failing since build #10 (Manual run by Akeem Wells) Test Tasks Many Linux 2.28 Rocky 8.10 Py3.12 < 1 sec
Successful test_task_phaseshift reference_frame_tests.test_frames
Failing since build #10 (Manual run by Akeem Wells) Test Tasks Many Linux 2.28 Rocky 8.10 Py3.12 57 secs
Successful test_task_phaseshift phaseshift_multi_phasecenter_test.test_fix_transition_from_shifted_field_to_field_with_no_shift
Failing since build #10 (Manual run by Akeem Wells) Test Tasks Many Linux 2.28 Rocky 8.10 Py3.12 < 1 sec
Successful test_task_phaseshift phaseshift_test.test_intentSelect
Failing since build #10 (Manual run by Akeem Wells) Test Tasks Many Linux 2.28 Rocky 8.10 Py3.12 < 1 sec
Successful test_task_phaseshift phaseshift_test.test_arraySelect
Failing since build #10 (Manual run by Akeem Wells) Test Tasks Many Linux 2.28 Rocky 8.10 Py3.12 1 sec
Successful test_task_phaseshift phaseshift_multi_phasecenter_test.test_phasecenter_dict_simple
Failing since build #10 (Manual run by Akeem Wells) Test Tasks Many Linux 2.28 Rocky 8.10 Py3.12 < 1 sec
Successful test_task_phaseshift phaseshift_test.test_observationSelect
Failing since build #10 (Manual run by Akeem Wells) Test Tasks Many Linux 2.28 Rocky 8.10 Py3.12 < 1 sec
Successful test_task_phaseshift phaseshift_test.test_spwSelect
Failing since build #10 (Manual run by Akeem Wells) Test Tasks Many Linux 2.28 Rocky 8.10 Py3.12 < 1 sec
Successful test_task_setjy test_SingleObservation.test1_SingleObservationOldModel
Failing since build #10 (Manual run by Akeem Wells) Test Tasks Many Linux 2.28 Rocky 8.10 Py3.12 1 sec
Successful test_task_setjy test_conesearch.test_searchByPosition
Failing since build #10 (Manual run by Akeem Wells) Test Tasks Many Linux 2.28 Rocky 8.10 Py3.12 2 secs
Successful test_task_setjy test_MultipleObservations.test1_MultipleObservationOldModel
Failing since build #10 (Manual run by Akeem Wells) Test Tasks Many Linux 2.28 Rocky 8.10 Py3.12 < 1 sec
Successful test_task_setjy test_newVLAmodelimages.test_3C48_KaBandModel
Failing since build #10 (Manual run by Akeem Wells) Test Tasks Many Linux 2.28 Rocky 8.10 Py3.12 < 1 sec
Successful test_task_setjy test_tpmAsteroid.test1_tpm
Failing since build #10 (Manual run by Akeem Wells) Test Tasks Many Linux 2.28 Rocky 8.10 Py3.12 8 secs
Successful test_task_setjy test_fluxscaleStandard.test_fluxscaleStandard1
Failing since build #10 (Manual run by Akeem Wells) Test Tasks Many Linux 2.28 Rocky 8.10 Py3.12 < 1 sec
Successful test_task_setjy test_newStandards.test_PB2017
Failing since build #10 (Manual run by Akeem Wells) Test Tasks Many Linux 2.28 Rocky 8.10 Py3.12 < 1 sec
Successful test_task_setjy test_newStandards.test_PB2013
Failing since build #10 (Manual run by Akeem Wells) Test Tasks Many Linux 2.28 Rocky 8.10 Py3.12 1 sec
Successful test_task_setjy test_SingleObservation.test4_SingleObservationSelectByIntent
Failing since build #10 (Manual run by Akeem Wells) Test Tasks Many Linux 2.28 Rocky 8.10 Py3.12 1 sec
Successful test_task_setjy test_SingleObservation.test3_SingleObservationNewModel
Failing since build #10 (Manual run by Akeem Wells) Test Tasks Many Linux 2.28 Rocky 8.10 Py3.12 1 sec
Successful test_task_setjy test_SingleObservation.test2_SingleObservationScaleByChan
Failing since build #10 (Manual run by Akeem Wells) Test Tasks Many Linux 2.28 Rocky 8.10 Py3.12 1 sec
Successful test_task_setjy test_setpol.testr6
Failing since build #10 (Manual run by Akeem Wells) Test Tasks Many Linux 2.28 Rocky 8.10 Py3.12 < 1 sec
Successful test_task_setjy test_ephemtbl.test_ephemtbl2
Failing since build #10 (Manual run by Akeem Wells) Test Tasks Many Linux 2.28 Rocky 8.10 Py3.12 8 secs
Successful test_task_setjy test_setpol.test_setpol1
Failing since build #10 (Manual run by Akeem Wells) Test Tasks Many Linux 2.28 Rocky 8.10 Py3.12 < 1 sec