Test Tools and Tasks using measures at go (dot) nrao (dot) edu (slash)iers

Build: #11 failed

Job: Test Tasks Many Linux 2.28 Rocky 8.10 Py3.12 failed

Job result summary

Completed
Duration
192 minutes
Agent
casaci-4.cv.nrao.edu test agent6
Revision
07b93ae4691683e42ffeb80be149a8fa5ebcf9f9
Total tests
3241
Failing since
#10 (Manual run by Akeem Wells – )

Tests

  • 3,241 tests in total
  • 5 tests failed
  • 5 failures are new
  • 66 tests were fixed
  • 129 tests were quarantined / skipped
  • 180 minutes taken in total.
New test failures 5
Status Test Duration
Collapse Failed test_task_gencal gencal_eoptest.test_eop
< 1 sec
AssertionError: False is not true
test_task_gencal.py:911: in test_eop
    self.assertTrue(th.compTables(caltab, reference, ['WEIGHT'], [0.001, 1e-14], mode="both"))
E   AssertionError: False is not true
Collapse Failed test_task_importasdm asdm_import3.test_evlatest1
< 1 sec
AssertionError: False is not true
test_task_importasdm.py:893: in test_evlatest1
    self.assertTrue(retValue['success'])
E   AssertionError: False is not true
Collapse Failed test_task_polcal polcal_test.test_posAngLin
< 1 sec
AssertionError: np.False_ is not true
test_task_polcal.py:412: in test_posAngLin
    self.assertTrue(np.all(np.isclose(calresult, 0)))
E   AssertionError: np.False_ is not true
Collapse Failed test_task_polcal polcal_test.test_sourceInstPolDllsLin
< 1 sec
AssertionError: np.False_ is not true
test_task_polcal.py:281: in test_sourceInstPolDllsLin
    self.assertTrue(np.all(np.isclose(calresult, refresult)))
E   AssertionError: np.False_ is not true
Collapse Failed unnamed test suite test_task_exportantab
< 1 sec
collection failure
ImportError while importing test module '/home/casatest/casa6/casatestutils/nosedir/test_task_exportantab/test_task_exportantab.py'.
Hint: make sure your test modules/packages have valid Python names.
Traceback:
/usr/local/lib/python3.12/importlib/__init__.py:90: in import_module
    return _bootstrap._gcd_import(name[level:], package, level)
           ^^^^^^^^^^^^^^^^^^^^^^^^^^^^^^^^^^^^^^^^^^^^^^^^^^^^
test_task_exportantab.py:29: in <module>
(2 more lines...)
Fixed tests 66
Status Test Failing since Duration
Successful test_task_bandpass bandpass1_test.test1a
Failing since build #10 (Manual run by Akeem Wells) < 1 sec
Successful test_task_bandpass bandpass1_test.test_dictBelowMinBl
Failing since build #10 (Manual run by Akeem Wells) < 1 sec
Successful test_task_bandpass bandpass1_test.test_dictOutputAntennaFlag
Failing since build #10 (Manual run by Akeem Wells) 1 sec
Successful test_task_bandpass bandpass1_test.test_dictOutputFlagged
Failing since build #10 (Manual run by Akeem Wells) < 1 sec
Successful test_task_bandpass bandpass1_test.test_returnDict
Failing since build #10 (Manual run by Akeem Wells) < 1 sec
Successful test_task_bandpass bandpass2_test.test1b
Failing since build #10 (Manual run by Akeem Wells) < 1 sec
Successful test_task_pccor pccor_test_missing.test_missingPcDataUseFringefit
Failing since build #10 (Manual run by Akeem Wells) 2 secs
Successful test_task_pccor pccor_test_missing.test_missingPhaseCalSubtable
Failing since build #10 (Manual run by Akeem Wells) < 1 sec
Successful test_task_pccor pccor_test_parse.test_parseAntenna
Failing since build #10 (Manual run by Akeem Wells) 4 secs
Successful test_task_pccor pccor_test_parse.test_parseAntenna_antennas_specified
Failing since build #10 (Manual run by Akeem Wells) 2 secs
Successful test_task_pccor pccor_test_parse.test_parseSpw
Failing since build #10 (Manual run by Akeem Wells) 6 secs
Successful test_task_pccor pccor_test_parse.test_provideFringeFitTable_equal
Failing since build #10 (Manual run by Akeem Wells) 3 secs
Successful test_task_pccor pccor_test_solutionValues.test_solutionValues
Failing since build #10 (Manual run by Akeem Wells) 5 secs
Successful test_task_pccor pccor_test_splitMses.test_splitMses_contiguous_ms
Failing since build #10 (Manual run by Akeem Wells) 2 secs
Successful test_task_pccor pccor_test_splitMses.test_splitMses_non_contiguous_ms
Failing since build #10 (Manual run by Akeem Wells) 2 secs
Successful test_task_phaseshift phaseshift_multi_phasecenter_test.test_fix_transition_from_shifted_field_to_field_with_no_shift
Failing since build #10 (Manual run by Akeem Wells) < 1 sec
Successful test_task_phaseshift phaseshift_multi_phasecenter_test.test_phasecenter_dict_one_out
Failing since build #10 (Manual run by Akeem Wells) < 1 sec
Successful test_task_phaseshift phaseshift_multi_phasecenter_test.test_phasecenter_dict_outofrange
Failing since build #10 (Manual run by Akeem Wells) < 1 sec
Successful test_task_phaseshift phaseshift_multi_phasecenter_test.test_phasecenter_dict_simple
Failing since build #10 (Manual run by Akeem Wells) < 1 sec
Successful test_task_phaseshift phaseshift_multi_phasecenter_test.test_phasecenter_dict_with_field_selection_nonoverlapping
Failing since build #10 (Manual run by Akeem Wells) < 1 sec
Successful test_task_phaseshift phaseshift_multi_phasecenter_test.test_phasecenter_dict_with_field_selection_overlapping
Failing since build #10 (Manual run by Akeem Wells) < 1 sec
Successful test_task_phaseshift phaseshift_multi_phasecenter_test.test_test_nodict
Failing since build #10 (Manual run by Akeem Wells) < 1 sec
Successful test_task_phaseshift phaseshift_test.test_arraySelect
Failing since build #10 (Manual run by Akeem Wells) 1 sec
Successful test_task_phaseshift phaseshift_test.test_datacolumn
Failing since build #10 (Manual run by Akeem Wells) < 1 sec
Successful test_task_phaseshift phaseshift_test.test_fieldSelect
Failing since build #10 (Manual run by Akeem Wells) < 1 sec
Successful test_task_phaseshift phaseshift_test.test_intentSelect
Failing since build #10 (Manual run by Akeem Wells) < 1 sec
Successful test_task_phaseshift phaseshift_test.test_keepsMMS
Failing since build #10 (Manual run by Akeem Wells) < 1 sec
Successful test_task_phaseshift phaseshift_test.test_observationSelect
Failing since build #10 (Manual run by Akeem Wells) < 1 sec
Successful test_task_phaseshift phaseshift_test.test_outvis
Failing since build #10 (Manual run by Akeem Wells) 1 sec
Successful test_task_phaseshift phaseshift_test.test_phasecenter
Failing since build #10 (Manual run by Akeem Wells) < 1 sec
Successful test_task_phaseshift phaseshift_test.test_phasecenter_default_frame
Failing since build #10 (Manual run by Akeem Wells) < 1 sec
Successful test_task_phaseshift phaseshift_test.test_shiftAndCompare
Failing since build #10 (Manual run by Akeem Wells) 48 secs
Successful test_task_phaseshift phaseshift_test.test_spwSelect
Failing since build #10 (Manual run by Akeem Wells) < 1 sec
Successful test_task_phaseshift phaseshift_test.test_takesVis
Failing since build #10 (Manual run by Akeem Wells) 1 sec
Successful test_task_phaseshift reference_frame_tests.test_field
Failing since build #10 (Manual run by Akeem Wells) 2 secs
Successful test_task_phaseshift reference_frame_tests.test_frames
Failing since build #10 (Manual run by Akeem Wells) 57 secs
Successful test_task_setjy test_ModImage.test1_UBandModelwithQBandMS
Failing since build #10 (Manual run by Akeem Wells) 4 secs
Successful test_task_setjy test_MultipleObservations.test1_MultipleObservationOldModel
Failing since build #10 (Manual run by Akeem Wells) < 1 sec
Successful test_task_setjy test_MultipleObservations.test2_MultipleObservationNewModel
Failing since build #10 (Manual run by Akeem Wells) < 1 sec
Successful test_task_setjy test_SingleObservation.test1_SingleObservationOldModel
Failing since build #10 (Manual run by Akeem Wells) 1 sec
Successful test_task_setjy test_SingleObservation.test2_SingleObservationScaleByChan
Failing since build #10 (Manual run by Akeem Wells) 1 sec
Successful test_task_setjy test_SingleObservation.test3_SingleObservationNewModel
Failing since build #10 (Manual run by Akeem Wells) 1 sec
Successful test_task_setjy test_SingleObservation.test4_SingleObservationSelectByIntent
Failing since build #10 (Manual run by Akeem Wells) 1 sec
Successful test_task_setjy test_SingleObservation.test5_SingleObservationSelectByIntentNewModel
Failing since build #10 (Manual run by Akeem Wells) 1 sec
Successful test_task_setjy test_conesearch.test_searchByPosition
Failing since build #10 (Manual run by Akeem Wells) 2 secs
Successful test_task_setjy test_ephemtbl.test_ephemtbl1
Failing since build #10 (Manual run by Akeem Wells) 1 sec
Successful test_task_setjy test_ephemtbl.test_ephemtbl2
Failing since build #10 (Manual run by Akeem Wells) 8 secs
Successful test_task_setjy test_fluxscaleStandard.test_fluxscaleStandard1
Failing since build #10 (Manual run by Akeem Wells) < 1 sec
Successful test_task_setjy test_newStandards.test_PB2013
Failing since build #10 (Manual run by Akeem Wells) 1 sec
Successful test_task_setjy test_newStandards.test_PB2017
Failing since build #10 (Manual run by Akeem Wells) < 1 sec

Error summary

The build generated some errors. See the full build log for more details.

Error response from daemon: No such container: wheel-container-test-153550854
Error response from daemon: No such container: wheel-container-test-153550854
  % Total    % Received % Xferd  Average Speed   Time    Time     Time  Current
                                 Dload  Upload   Total   Spent    Left  Speed

  0     0    0     0    0     0      0      0 --:--:-- --:--:-- --:--:--     0
100 6002k  100 6002k    0     0  82.5M      0 --:--:-- --:--:-- --:--:-- 82.5M
[4119778] Failed to execute script 'atlutil' due to unhandled exception!
Traceback (most recent call last):
  File "atlutil.py", line 200, in <module>
  File "atlutil.py", line 165, in has_fix_version
KeyError: 'fields'
Already on 'master'