Test Tools and Tasks using measures at go (dot) nrao (dot) edu (slash)iers

Build: #11 failed Manual run by Akeem Wells

Test results

  • 3,938 tests in total
  • 6 tests failed
  • 6 failures are new
  • 86 tests were fixed
  • 134 tests were quarantined / skipped
  • 186 minutes taken in total.
New test failures 6
Status Test View job Duration
Collapse Failed test_task_gencal gencal_eoptest.test_eop
Test Tasks Many Linux 2.28 Rocky 8.10 Py3.12 < 1 sec
AssertionError: False is not true
test_task_gencal.py:911: in test_eop
    self.assertTrue(th.compTables(caltab, reference, ['WEIGHT'], [0.001, 1e-14], mode="both"))
E   AssertionError: False is not true
Collapse Failed test_task_importasdm asdm_import3.test_evlatest1
Test Tasks Many Linux 2.28 Rocky 8.10 Py3.12 < 1 sec
AssertionError: False is not true
test_task_importasdm.py:893: in test_evlatest1
    self.assertTrue(retValue['success'])
E   AssertionError: False is not true
Collapse Failed test_task_polcal polcal_test.test_sourceInstPolDllsLin
Test Tasks Many Linux 2.28 Rocky 8.10 Py3.12 < 1 sec
AssertionError: np.False_ is not true
test_task_polcal.py:281: in test_sourceInstPolDllsLin
    self.assertTrue(np.all(np.isclose(calresult, refresult)))
E   AssertionError: np.False_ is not true
Collapse Failed test_task_polcal polcal_test.test_posAngLin
Test Tasks Many Linux 2.28 Rocky 8.10 Py3.12 < 1 sec
AssertionError: np.False_ is not true
test_task_polcal.py:412: in test_posAngLin
    self.assertTrue(np.all(np.isclose(calresult, 0)))
E   AssertionError: np.False_ is not true
Collapse Failed test_tool_synthesisutils advisechansel_test.test_su_advisechansel_getfreqrange_ephem
Test Tools Many Linux 2.28 Rocky 8.10 Py3.12 < 1 sec
AssertionError: 220295510184.34296 != 220295510184.3427
test_tool_synthesisutils.py:478: in test_su_advisechansel_getfreqrange_ephem
    self.assertEqual(res['freqstart']['value'], refdict['freqstart']['value'])
E   AssertionError: 220295510184.34296 != 220295510184.3427
Collapse Failed unnamed test suite test_task_exportantab
Test Tasks Many Linux 2.28 Rocky 8.10 Py3.12 < 1 sec
collection failure
ImportError while importing test module '/home/casatest/casa6/casatestutils/nosedir/test_task_exportantab/test_task_exportantab.py'.
Hint: make sure your test modules/packages have valid Python names.
Traceback:
/usr/local/lib/python3.12/importlib/__init__.py:90: in import_module
    return _bootstrap._gcd_import(name[level:], package, level)
           ^^^^^^^^^^^^^^^^^^^^^^^^^^^^^^^^^^^^^^^^^^^^^^^^^^^^
test_task_exportantab.py:29: in <module>
(2 more lines...)
Fixed tests 86
Status Test Failing since View job Duration
Successful test_task_bandpass bandpass2_test.test1b
Failing since build #10 (Manual run by Akeem Wells) Test Tasks Many Linux 2.28 Rocky 8.10 Py3.12 < 1 sec
Successful test_task_bandpass bandpass1_test.test_dictOutputFlagged
Failing since build #10 (Manual run by Akeem Wells) Test Tasks Many Linux 2.28 Rocky 8.10 Py3.12 < 1 sec
Successful test_task_bandpass bandpass1_test.test_dictOutputAntennaFlag
Failing since build #10 (Manual run by Akeem Wells) Test Tasks Many Linux 2.28 Rocky 8.10 Py3.12 1 sec
Successful test_task_bandpass bandpass1_test.test_returnDict
Failing since build #10 (Manual run by Akeem Wells) Test Tasks Many Linux 2.28 Rocky 8.10 Py3.12 < 1 sec
Successful test_task_bandpass bandpass1_test.test_dictBelowMinBl
Failing since build #10 (Manual run by Akeem Wells) Test Tasks Many Linux 2.28 Rocky 8.10 Py3.12 < 1 sec
Successful test_task_bandpass bandpass1_test.test1a
Failing since build #10 (Manual run by Akeem Wells) Test Tasks Many Linux 2.28 Rocky 8.10 Py3.12 < 1 sec
Successful test_task_pccor pccor_test_missing.test_missingPcDataUseFringefit
Failing since build #10 (Manual run by Akeem Wells) Test Tasks Many Linux 2.28 Rocky 8.10 Py3.12 2 secs
Successful test_task_pccor pccor_test_splitMses.test_splitMses_non_contiguous_ms
Failing since build #10 (Manual run by Akeem Wells) Test Tasks Many Linux 2.28 Rocky 8.10 Py3.12 2 secs
Successful test_task_pccor pccor_test_solutionValues.test_solutionValues
Failing since build #10 (Manual run by Akeem Wells) Test Tasks Many Linux 2.28 Rocky 8.10 Py3.12 5 secs
Successful test_task_pccor pccor_test_parse.test_parseAntenna_antennas_specified
Failing since build #10 (Manual run by Akeem Wells) Test Tasks Many Linux 2.28 Rocky 8.10 Py3.12 2 secs
Successful test_task_pccor pccor_test_splitMses.test_splitMses_contiguous_ms
Failing since build #10 (Manual run by Akeem Wells) Test Tasks Many Linux 2.28 Rocky 8.10 Py3.12 2 secs
Successful test_task_pccor pccor_test_missing.test_missingPhaseCalSubtable
Failing since build #10 (Manual run by Akeem Wells) Test Tasks Many Linux 2.28 Rocky 8.10 Py3.12 < 1 sec
Successful test_task_pccor pccor_test_parse.test_parseSpw
Failing since build #10 (Manual run by Akeem Wells) Test Tasks Many Linux 2.28 Rocky 8.10 Py3.12 6 secs
Successful test_task_pccor pccor_test_parse.test_parseAntenna
Failing since build #10 (Manual run by Akeem Wells) Test Tasks Many Linux 2.28 Rocky 8.10 Py3.12 4 secs
Successful test_task_pccor pccor_test_parse.test_provideFringeFitTable_equal
Failing since build #10 (Manual run by Akeem Wells) Test Tasks Many Linux 2.28 Rocky 8.10 Py3.12 3 secs
Successful test_task_phaseshift phaseshift_multi_phasecenter_test.test_test_nodict
Failing since build #10 (Manual run by Akeem Wells) Test Tasks Many Linux 2.28 Rocky 8.10 Py3.12 < 1 sec
Successful test_task_phaseshift phaseshift_test.test_outvis
Failing since build #10 (Manual run by Akeem Wells) Test Tasks Many Linux 2.28 Rocky 8.10 Py3.12 1 sec
Successful test_task_phaseshift phaseshift_test.test_shiftAndCompare
Failing since build #10 (Manual run by Akeem Wells) Test Tasks Many Linux 2.28 Rocky 8.10 Py3.12 48 secs
Successful test_task_phaseshift phaseshift_test.test_keepsMMS
Failing since build #10 (Manual run by Akeem Wells) Test Tasks Many Linux 2.28 Rocky 8.10 Py3.12 < 1 sec
Successful test_task_phaseshift phaseshift_multi_phasecenter_test.test_phasecenter_dict_with_field_selection_overlapping
Failing since build #10 (Manual run by Akeem Wells) Test Tasks Many Linux 2.28 Rocky 8.10 Py3.12 < 1 sec
Successful test_task_phaseshift phaseshift_test.test_fieldSelect
Failing since build #10 (Manual run by Akeem Wells) Test Tasks Many Linux 2.28 Rocky 8.10 Py3.12 < 1 sec
Successful test_task_phaseshift phaseshift_test.test_phasecenter
Failing since build #10 (Manual run by Akeem Wells) Test Tasks Many Linux 2.28 Rocky 8.10 Py3.12 < 1 sec
Successful test_task_phaseshift reference_frame_tests.test_field
Failing since build #10 (Manual run by Akeem Wells) Test Tasks Many Linux 2.28 Rocky 8.10 Py3.12 2 secs
Successful test_task_phaseshift phaseshift_multi_phasecenter_test.test_phasecenter_dict_with_field_selection_nonoverlapping
Failing since build #10 (Manual run by Akeem Wells) Test Tasks Many Linux 2.28 Rocky 8.10 Py3.12 < 1 sec
Successful test_task_phaseshift phaseshift_test.test_datacolumn
Failing since build #10 (Manual run by Akeem Wells) Test Tasks Many Linux 2.28 Rocky 8.10 Py3.12 < 1 sec
Successful test_task_phaseshift phaseshift_test.test_phasecenter_default_frame
Failing since build #10 (Manual run by Akeem Wells) Test Tasks Many Linux 2.28 Rocky 8.10 Py3.12 < 1 sec
Successful test_task_phaseshift phaseshift_test.test_takesVis
Failing since build #10 (Manual run by Akeem Wells) Test Tasks Many Linux 2.28 Rocky 8.10 Py3.12 1 sec
Successful test_task_phaseshift phaseshift_multi_phasecenter_test.test_phasecenter_dict_outofrange
Failing since build #10 (Manual run by Akeem Wells) Test Tasks Many Linux 2.28 Rocky 8.10 Py3.12 < 1 sec
Successful test_task_phaseshift phaseshift_multi_phasecenter_test.test_phasecenter_dict_one_out
Failing since build #10 (Manual run by Akeem Wells) Test Tasks Many Linux 2.28 Rocky 8.10 Py3.12 < 1 sec
Successful test_task_phaseshift reference_frame_tests.test_frames
Failing since build #10 (Manual run by Akeem Wells) Test Tasks Many Linux 2.28 Rocky 8.10 Py3.12 57 secs
Successful test_task_phaseshift phaseshift_multi_phasecenter_test.test_fix_transition_from_shifted_field_to_field_with_no_shift
Failing since build #10 (Manual run by Akeem Wells) Test Tasks Many Linux 2.28 Rocky 8.10 Py3.12 < 1 sec
Successful test_task_phaseshift phaseshift_test.test_intentSelect
Failing since build #10 (Manual run by Akeem Wells) Test Tasks Many Linux 2.28 Rocky 8.10 Py3.12 < 1 sec
Successful test_task_phaseshift phaseshift_test.test_arraySelect
Failing since build #10 (Manual run by Akeem Wells) Test Tasks Many Linux 2.28 Rocky 8.10 Py3.12 1 sec
Successful test_task_phaseshift phaseshift_multi_phasecenter_test.test_phasecenter_dict_simple
Failing since build #10 (Manual run by Akeem Wells) Test Tasks Many Linux 2.28 Rocky 8.10 Py3.12 < 1 sec
Successful test_task_phaseshift phaseshift_test.test_observationSelect
Failing since build #10 (Manual run by Akeem Wells) Test Tasks Many Linux 2.28 Rocky 8.10 Py3.12 < 1 sec
Successful test_task_phaseshift phaseshift_test.test_spwSelect
Failing since build #10 (Manual run by Akeem Wells) Test Tasks Many Linux 2.28 Rocky 8.10 Py3.12 < 1 sec
Successful test_task_setjy test_SingleObservation.test1_SingleObservationOldModel
Failing since build #10 (Manual run by Akeem Wells) Test Tasks Many Linux 2.28 Rocky 8.10 Py3.12 1 sec
Successful test_task_setjy test_conesearch.test_searchByPosition
Failing since build #10 (Manual run by Akeem Wells) Test Tasks Many Linux 2.28 Rocky 8.10 Py3.12 2 secs
Successful test_task_setjy test_MultipleObservations.test1_MultipleObservationOldModel
Failing since build #10 (Manual run by Akeem Wells) Test Tasks Many Linux 2.28 Rocky 8.10 Py3.12 < 1 sec
Successful test_task_setjy test_newVLAmodelimages.test_3C48_KaBandModel
Failing since build #10 (Manual run by Akeem Wells) Test Tasks Many Linux 2.28 Rocky 8.10 Py3.12 < 1 sec
Successful test_task_setjy test_tpmAsteroid.test1_tpm
Failing since build #10 (Manual run by Akeem Wells) Test Tasks Many Linux 2.28 Rocky 8.10 Py3.12 8 secs
Successful test_task_setjy test_fluxscaleStandard.test_fluxscaleStandard1
Failing since build #10 (Manual run by Akeem Wells) Test Tasks Many Linux 2.28 Rocky 8.10 Py3.12 < 1 sec
Successful test_task_setjy test_newStandards.test_PB2017
Failing since build #10 (Manual run by Akeem Wells) Test Tasks Many Linux 2.28 Rocky 8.10 Py3.12 < 1 sec
Successful test_task_setjy test_newStandards.test_PB2013
Failing since build #10 (Manual run by Akeem Wells) Test Tasks Many Linux 2.28 Rocky 8.10 Py3.12 1 sec
Successful test_task_setjy test_SingleObservation.test4_SingleObservationSelectByIntent
Failing since build #10 (Manual run by Akeem Wells) Test Tasks Many Linux 2.28 Rocky 8.10 Py3.12 1 sec
Successful test_task_setjy test_SingleObservation.test3_SingleObservationNewModel
Failing since build #10 (Manual run by Akeem Wells) Test Tasks Many Linux 2.28 Rocky 8.10 Py3.12 1 sec
Successful test_task_setjy test_SingleObservation.test2_SingleObservationScaleByChan
Failing since build #10 (Manual run by Akeem Wells) Test Tasks Many Linux 2.28 Rocky 8.10 Py3.12 1 sec
Successful test_task_setjy test_setpol.testr6
Failing since build #10 (Manual run by Akeem Wells) Test Tasks Many Linux 2.28 Rocky 8.10 Py3.12 < 1 sec
Successful test_task_setjy test_ephemtbl.test_ephemtbl2
Failing since build #10 (Manual run by Akeem Wells) Test Tasks Many Linux 2.28 Rocky 8.10 Py3.12 8 secs
Successful test_task_setjy test_setpol.test_setpol1
Failing since build #10 (Manual run by Akeem Wells) Test Tasks Many Linux 2.28 Rocky 8.10 Py3.12 < 1 sec
Successful test_task_setjy test_setpol.test_setpol3
Failing since build #10 (Manual run by Akeem Wells) Test Tasks Many Linux 2.28 Rocky 8.10 Py3.12 < 1 sec
Successful test_task_setjy test_ModImage.test1_UBandModelwithQBandMS
Failing since build #10 (Manual run by Akeem Wells) Test Tasks Many Linux 2.28 Rocky 8.10 Py3.12 4 secs
Successful test_task_setjy test_setpol.test_setpol_wrongspix
Failing since build #10 (Manual run by Akeem Wells) Test Tasks Many Linux 2.28 Rocky 8.10 Py3.12 < 1 sec
Successful test_task_setjy test_newVLAmodelimages.test_3C138_KaBandModel
Failing since build #10 (Manual run by Akeem Wells) Test Tasks Many Linux 2.28 Rocky 8.10 Py3.12 < 1 sec
Successful test_task_setjy test_SingleObservation.test5_SingleObservationSelectByIntentNewModel
Failing since build #10 (Manual run by Akeem Wells) Test Tasks Many Linux 2.28 Rocky 8.10 Py3.12 1 sec
Successful test_task_setjy test_setpol.testr5
Failing since build #10 (Manual run by Akeem Wells) Test Tasks Many Linux 2.28 Rocky 8.10 Py3.12 < 1 sec
Successful test_task_setjy test_newStandards_MMS.test_PB2017_MMS
Failing since build #10 (Manual run by Akeem Wells) Test Tasks Many Linux 2.28 Rocky 8.10 Py3.12 6 secs
Successful test_task_setjy test_MultipleObservations.test2_MultipleObservationNewModel
Failing since build #10 (Manual run by Akeem Wells) Test Tasks Many Linux 2.28 Rocky 8.10 Py3.12 < 1 sec
Successful test_task_setjy test_newStandards_MMS.test_PB2013_MMS
Failing since build #10 (Manual run by Akeem Wells) Test Tasks Many Linux 2.28 Rocky 8.10 Py3.12 7 secs
Successful test_task_setjy test_newVLAmodelimages.test_3C286_KaBandModel
Failing since build #10 (Manual run by Akeem Wells) Test Tasks Many Linux 2.28 Rocky 8.10 Py3.12 < 1 sec
Successful test_task_setjy test_ephemtbl.test_ephemtbl1
Failing since build #10 (Manual run by Akeem Wells) Test Tasks Many Linux 2.28 Rocky 8.10 Py3.12 1 sec
Successful test_task_setjy test_setpol.test_setpol2
Failing since build #10 (Manual run by Akeem Wells) Test Tasks Many Linux 2.28 Rocky 8.10 Py3.12 < 1 sec
Successful test_task_setjy test_setpol.test_setpol4
Failing since build #10 (Manual run by Akeem Wells) Test Tasks Many Linux 2.28 Rocky 8.10 Py3.12 < 1 sec
Successful test_task_setjy test_newVLAmodelimages.test_3C147_KaBandModel
Failing since build #10 (Manual run by Akeem Wells) Test Tasks Many Linux 2.28 Rocky 8.10 Py3.12 < 1 sec
Successful test_task_zenithdelaycal ZenithDelayCal_applycal_tests.test_applycal_zenithdelaycal_per_pol
Failing since build #10 (Manual run by Akeem Wells) Test Tasks Many Linux 2.28 Rocky 8.10 Py3.12 < 1 sec
Successful test_task_zenithdelaycal ZenithDelayCal_applycal_tests.test_applycal_zenithdelaycal
Failing since build #10 (Manual run by Akeem Wells) Test Tasks Many Linux 2.28 Rocky 8.10 Py3.12 < 1 sec
Successful test_tool_calibrater calibrater_test.test_selectVisField
Failing since build #10 (Manual run by Akeem Wells) Test Tools Many Linux 2.28 Rocky 8.10 Py3.12 2 secs
Successful test_tool_calibrater calibrater_test.test_selectVisTime
Failing since build #10 (Manual run by Akeem Wells) Test Tools Many Linux 2.28 Rocky 8.10 Py3.12 3 secs
Successful test_tool_calibrater calibrater_test.test_activityRecord
Failing since build #10 (Manual run by Akeem Wells) Test Tools Many Linux 2.28 Rocky 8.10 Py3.12 2 secs
Successful test_tool_calibrater calibrater_test.test_done
Failing since build #10 (Manual run by Akeem Wells) Test Tools Many Linux 2.28 Rocky 8.10 Py3.12 < 1 sec
Successful test_tool_calibrater calibrater_test.test_writeToCorrected
Failing since build #10 (Manual run by Akeem Wells) Test Tools Many Linux 2.28 Rocky 8.10 Py3.12 2 secs
Successful test_tool_calibrater calibrater_test.test_selectVisIntent
Failing since build #10 (Manual run by Akeem Wells) Test Tools Many Linux 2.28 Rocky 8.10 Py3.12 3 secs
Successful test_tool_calibrater calibrater_test.test_selectVisBaseline
Failing since build #10 (Manual run by Akeem Wells) Test Tools Many Linux 2.28 Rocky 8.10 Py3.12 2 secs
Successful test_tool_calibrater calibrater_test.test_takesMs
Failing since build #10 (Manual run by Akeem Wells) Test Tools Many Linux 2.28 Rocky 8.10 Py3.12 < 1 sec
Successful test_tool_calibrater calibrater_test.test_selectVisScan
Failing since build #10 (Manual run by Akeem Wells) Test Tools Many Linux 2.28 Rocky 8.10 Py3.12 1 sec
Successful test_tool_calibrater calibrater_test.test_solveBandpass
Failing since build #10 (Manual run by Akeem Wells) Test Tools Many Linux 2.28 Rocky 8.10 Py3.12 4 secs
Successful test_tool_calibrater calibrater_test.test_reinitModel
Failing since build #10 (Manual run by Akeem Wells) Test Tools Many Linux 2.28 Rocky 8.10 Py3.12 3 secs
Successful test_tool_calibrater calibrater_test.test_setCalLib
Failing since build #10 (Manual run by Akeem Wells) Test Tools Many Linux 2.28 Rocky 8.10 Py3.12 2 secs
Successful test_tool_calibrater calibrater_test.test_corruptCal
Failing since build #10 (Manual run by Akeem Wells) Test Tools Many Linux 2.28 Rocky 8.10 Py3.12 2 secs
Successful test_tool_calibrater calibrater_test.test_selectVisObs
Failing since build #10 (Manual run by Akeem Wells) Test Tools Many Linux 2.28 Rocky 8.10 Py3.12 3 secs
Successful test_tool_calibrater calibrater_test.test_returnDict
Failing since build #10 (Manual run by Akeem Wells) Test Tools Many Linux 2.28 Rocky 8.10 Py3.12 1 sec
Successful test_tool_calibrater calibrater_test.test_selectVisUVrange
Failing since build #10 (Manual run by Akeem Wells) Test Tools Many Linux 2.28 Rocky 8.10 Py3.12 2 secs
Successful test_tool_calibrater calibrater_test.test_smoothedCalTables
Failing since build #10 (Manual run by Akeem Wells) Test Tools Many Linux 2.28 Rocky 8.10 Py3.12 < 1 sec
Successful test_tool_calibrater calibrater_test.test_solveGainspline
Failing since build #10 (Manual run by Akeem Wells) Test Tools Many Linux 2.28 Rocky 8.10 Py3.12 < 1 sec
Successful test_tool_calibrater calibrater_test.test_selectVisSpw
Failing since build #10 (Manual run by Akeem Wells) Test Tools Many Linux 2.28 Rocky 8.10 Py3.12 1 sec
Successful test_tool_calibrater calibrater_test.test_standardPath
Failing since build #10 (Manual run by Akeem Wells) Test Tools Many Linux 2.28 Rocky 8.10 Py3.12 1 sec
Skipped tests 100
Status Test Failing since View job
Skipped test_flaghelper test_flaghelper.test_evaluateParameters2
Test Tasks Many Linux 2.28 Rocky 8.10 Py3.12
Skipped test_task_deconvolve test_imgval.test_imgval_startmodel_axesmismatch
Test Tasks Many Linux 2.28 Rocky 8.10 Py3.12
Skipped test_task_deconvolve test_mtmfsimgval.test_mtmfsimgval_startmodel_axesmismatch
Test Tasks Many Linux 2.28 Rocky 8.10 Py3.12
Skipped test_task_exportasdm exportasdm_test.test10
Test Tasks Many Linux 2.28 Rocky 8.10 Py3.12
Skipped test_task_flagdata test_auto_methods_display.test_display_clip_timeavg_chanavg
Test Tasks Many Linux 2.28 Rocky 8.10 Py3.12
Skipped test_task_flagdata test_auto_methods_display.test_display_all_auto_timeavg_chanavg_extendflags_list_antint
Test Tasks Many Linux 2.28 Rocky 8.10 Py3.12
Skipped test_task_flagdata test_auto_methods_display.test_display_tfcrop_timeavg_chanavg_extendflags
Test Tasks Many Linux 2.28 Rocky 8.10 Py3.12
Skipped test_task_flagdata test_auto_methods_display.test_display_rflag_timeavg_chanavg_extendflags
Test Tasks Many Linux 2.28 Rocky 8.10 Py3.12
Skipped test_task_mstransform test_channelAverageByDefault.test_channelAverageByDefaultInVelocityMode
Test Tasks Many Linux 2.28 Rocky 8.10 Py3.12
Skipped test_task_mstransform test_spectrum_transformations_median.test_timeavg_chanavg_median_data
Test Tasks Many Linux 2.28 Rocky 8.10 Py3.12
Skipped test_task_mstransform test_spectrum_transformations_median.test_timeavg_median_corrected
Test Tasks Many Linux 2.28 Rocky 8.10 Py3.12
Skipped test_task_mstransform test_radial_velocity_correction_largetimerange.test_descending_freq
Test Tasks Many Linux 2.28 Rocky 8.10 Py3.12
Skipped test_task_mstransform test_spectrum_transformations_weight_zero_flag_set.test_timeavg_chanavg_weight_zero_flag_set_corrected
Test Tasks Many Linux 2.28 Rocky 8.10 Py3.12
Skipped test_task_mstransform test_spectrum_transformations_median.test_timeavg_chanavg_median_all
Test Tasks Many Linux 2.28 Rocky 8.10 Py3.12
Skipped test_task_mstransform test_spectrum_transformations_median.test_chanavg_median_corrected
Test Tasks Many Linux 2.28 Rocky 8.10 Py3.12
Skipped test_task_mstransform test_WeightSpectrum.test_fillWeightSpectrumFromWeight
Test Tasks Many Linux 2.28 Rocky 8.10 Py3.12
Skipped test_task_mstransform test_spectrum_transformations_median.test_chanavg_median_model
Test Tasks Many Linux 2.28 Rocky 8.10 Py3.12
Skipped test_task_mstransform test_spectrum_transformations_median.test_spw_separation_median_all
Test Tasks Many Linux 2.28 Rocky 8.10 Py3.12
Skipped test_task_mstransform test_spectrum_transformations_median.test_spw_separation_median_data
Test Tasks Many Linux 2.28 Rocky 8.10 Py3.12
Skipped test_task_mstransform test_spectrum_transformations_median.test_timeavg_median_data
Test Tasks Many Linux 2.28 Rocky 8.10 Py3.12
Skipped test_task_mstransform test_spectrum_transformations_weight_zero_flag_set.test_timeavg_weight_zero_flag_set_corrected
Test Tasks Many Linux 2.28 Rocky 8.10 Py3.12
Skipped test_task_mstransform test_spectrum_transformations_median.test_chanavg_median_all
Test Tasks Many Linux 2.28 Rocky 8.10 Py3.12
Skipped test_task_mstransform test_spectrum_transformations_median.test_timeavg_chanavg_median_model
Test Tasks Many Linux 2.28 Rocky 8.10 Py3.12
Skipped test_task_mstransform test_spectrum_transformations_median.test_spw_separation_median_corrected
Test Tasks Many Linux 2.28 Rocky 8.10 Py3.12
Skipped test_task_mstransform test_spectrum_transformations_median.test_timeavg_median_model
Test Tasks Many Linux 2.28 Rocky 8.10 Py3.12
Skipped test_task_mstransform test_regridms_multiple_spws.test_combine_regrid_fftshift
Test Tasks Many Linux 2.28 Rocky 8.10 Py3.12
Skipped test_task_mstransform test_Shape.test_shape2
Test Tasks Many Linux 2.28 Rocky 8.10 Py3.12
Skipped test_task_mstransform test_spectrum_transformations_weight_zero_flag_set.test_chanavg_weight_zero_flag_set_corrected
Test Tasks Many Linux 2.28 Rocky 8.10 Py3.12
Skipped test_task_mstransform test_spectrum_transformations_median.test_chanavg_median_data
Test Tasks Many Linux 2.28 Rocky 8.10 Py3.12
Skipped test_task_mstransform test_spectrum_transformations_median.test_spw_separation_median_model
Test Tasks Many Linux 2.28 Rocky 8.10 Py3.12
Skipped test_task_mstransform test_radial_velocity_correction_largetimerange.test_ascending_freq
Test Tasks Many Linux 2.28 Rocky 8.10 Py3.12
Skipped test_task_mstransform test_spectrum_transformations_median.test_timeavg_chanavg_median_corrected
Test Tasks Many Linux 2.28 Rocky 8.10 Py3.12
Skipped test_task_mstransform test_spectrum_transformations_median.test_timeavg_median_all
Test Tasks Many Linux 2.28 Rocky 8.10 Py3.12
Skipped test_task_mstransform_mms test_mms_transformations.test_shape3
Test Tasks Many Linux 2.28 Rocky 8.10 Py3.12
Skipped test_task_sdbaseline sdbaseline_multi_IF_test.test200
Test Tasks Many Linux 2.28 Rocky 8.10 Py3.12
Skipped test_task_sdbaseline sdbaseline_bloutputTest.test030
Test Tasks Many Linux 2.28 Rocky 8.10 Py3.12
Skipped test_task_sdbaseline sdbaseline_bloutputTest.test020
Test Tasks Many Linux 2.28 Rocky 8.10 Py3.12
Skipped test_task_sdbaseline sdbaseline_bloutputTest.test021
Test Tasks Many Linux 2.28 Rocky 8.10 Py3.12
Skipped test_task_sdcal sdcal_test_apply.test_apply_sky08M
Test Tasks Many Linux 2.28 Rocky 8.10 Py3.12
Skipped test_task_simobserve simobserve_noise.testNZ_intAtm
Test Tasks Many Linux 2.28 Rocky 8.10 Py3.12
Skipped test_task_simobserve simobserve_badinputs.testBad_leakage
Test Tasks Many Linux 2.28 Rocky 8.10 Py3.12
Skipped test_task_simobserve simobserve_badinputs.testBad_obsmode
Test Tasks Many Linux 2.28 Rocky 8.10 Py3.12
Skipped test_task_simobserve simobserve_badinputs.testBad_pwv
Test Tasks Many Linux 2.28 Rocky 8.10 Py3.12
Skipped test_task_simobserve simobserve_badinputs.testBad_graphics
Test Tasks Many Linux 2.28 Rocky 8.10 Py3.12
Skipped test_task_simobserve simobserve_skycomp.testSC_intLeak
Test Tasks Many Linux 2.28 Rocky 8.10 Py3.12
Skipped test_task_simobserve simobserve_comp.testComp_intLeak
Test Tasks Many Linux 2.28 Rocky 8.10 Py3.12
Skipped test_task_simobserve simobserve_badinputs.testBad_Tground
Test Tasks Many Linux 2.28 Rocky 8.10 Py3.12
Skipped test_task_simobserve simobserve_badinputs.testBad_Tsky
Test Tasks Many Linux 2.28 Rocky 8.10 Py3.12
Skipped test_task_simobserve simobserve_badinputs.testBad_noisetype
Test Tasks Many Linux 2.28 Rocky 8.10 Py3.12
Skipped test_task_simobserve simobserve_skycomp.testSC_sdObs
Test Tasks Many Linux 2.28 Rocky 8.10 Py3.12
Skipped test_task_simobserve simobserve_comp.testComp_sdObs
Test Tasks Many Linux 2.28 Rocky 8.10 Py3.12
Skipped test_task_simobserve simobserve_badinputs.testBad_tau0
Test Tasks Many Linux 2.28 Rocky 8.10 Py3.12
Skipped test_task_simobserve simobserve_skycomp.testSC_sdAll
Test Tasks Many Linux 2.28 Rocky 8.10 Py3.12
Skipped test_task_simobserve simobserve_badinputs.testBad_maptype
Test Tasks Many Linux 2.28 Rocky 8.10 Py3.12
Skipped test_task_simobserve simobserve_comp.testComp_sdAll
Test Tasks Many Linux 2.28 Rocky 8.10 Py3.12
Skipped test_task_split split_test_tav.test_sigma
Test Tasks Many Linux 2.28 Rocky 8.10 Py3.12
Skipped test_task_split split_test_tav.test_data_ll
Test Tasks Many Linux 2.28 Rocky 8.10 Py3.12
Skipped test_task_split split_test_fc.test_fc_tav
Test Tasks Many Linux 2.28 Rocky 8.10 Py3.12
Skipped test_task_split split_test_tav.test_sigma_ll
Test Tasks Many Linux 2.28 Rocky 8.10 Py3.12
Skipped test_task_split split_test_tav_then_cvel.test_cv
Test Tasks Many Linux 2.28 Rocky 8.10 Py3.12
Skipped test_task_split split_test_tav_then_cvel.test_tav_wt
Test Tasks Many Linux 2.28 Rocky 8.10 Py3.12
Skipped test_task_split split_test_fc.test_fc_cav
Test Tasks Many Linux 2.28 Rocky 8.10 Py3.12
Skipped test_task_split split_test_tav.test_wt_ll
Test Tasks Many Linux 2.28 Rocky 8.10 Py3.12
Skipped test_task_split split_test_tav.test_wt_rr
Test Tasks Many Linux 2.28 Rocky 8.10 Py3.12
Skipped test_task_split split_test_tav.test_sigma_rr
Test Tasks Many Linux 2.28 Rocky 8.10 Py3.12
Skipped test_task_split split_test_tav_then_cvel.test_tav_data
Test Tasks Many Linux 2.28 Rocky 8.10 Py3.12
Skipped test_task_split split_test_tav.test_data_rrll
Test Tasks Many Linux 2.28 Rocky 8.10 Py3.12
Skipped test_task_split split_test_tav.test_sigma_rllr
Test Tasks Many Linux 2.28 Rocky 8.10 Py3.12
Skipped test_task_split split_test_tav.test_sts
Test Tasks Many Linux 2.28 Rocky 8.10 Py3.12
Skipped test_task_split split_test_tav.test_sts_ll
Test Tasks Many Linux 2.28 Rocky 8.10 Py3.12
Skipped test_task_split split_test_tav.test_wt
Test Tasks Many Linux 2.28 Rocky 8.10 Py3.12
Skipped test_task_split split_test_tav.test_data
Test Tasks Many Linux 2.28 Rocky 8.10 Py3.12
Skipped test_task_split split_test_tav.test_sts_rr
Test Tasks Many Linux 2.28 Rocky 8.10 Py3.12
Skipped test_task_split split_test_tav.test_sts_rllr
Test Tasks Many Linux 2.28 Rocky 8.10 Py3.12
Skipped test_task_split split_test_tav.test_data_rr
Test Tasks Many Linux 2.28 Rocky 8.10 Py3.12
Skipped test_task_split split_test_tav.test_wt_rllr
Test Tasks Many Linux 2.28 Rocky 8.10 Py3.12
Skipped test_task_split split_test_tav_then_cvel.test_tav_time
Test Tasks Many Linux 2.28 Rocky 8.10 Py3.12
Skipped test_task_split split_test_tav.test_wt_rrll
Test Tasks Many Linux 2.28 Rocky 8.10 Py3.12
Skipped test_task_split split_test_tav_then_cvel.test_tav_scan
Test Tasks Many Linux 2.28 Rocky 8.10 Py3.12
Skipped test_task_split split_test_tav.test_sigma_rrll
Test Tasks Many Linux 2.28 Rocky 8.10 Py3.12
Skipped test_task_split split_test_fc.test_fc_categories
Test Tasks Many Linux 2.28 Rocky 8.10 Py3.12
Skipped test_task_split split_test_tav.test_sts_rrll
Test Tasks Many Linux 2.28 Rocky 8.10 Py3.12
Skipped test_task_split split_test_tav_then_cvel.test_tav_state_id
Test Tasks Many Linux 2.28 Rocky 8.10 Py3.12
Skipped test_task_split split_test_fc.test_fc_straightselection
Test Tasks Many Linux 2.28 Rocky 8.10 Py3.12
Skipped test_task_split split_test_tav.test_data_rllr
Test Tasks Many Linux 2.28 Rocky 8.10 Py3.12
Skipped test_task_split split_test_tav_then_cvel.test_tav_int
Test Tasks Many Linux 2.28 Rocky 8.10 Py3.12
Skipped test_task_tclean test_pbcor.test_pbcor_mtmfs
Test Tasks Many Linux 2.28 Rocky 8.10 Py3.12
Skipped test_task_tclean test_cube.test_cube_flagged_mosaic_mtmfs
Test Tasks Many Linux 2.28 Rocky 8.10 Py3.12
Skipped test_task_tclean test_widefield.test_widefield_awphpg_cube
Test Tasks Many Linux 2.28 Rocky 8.10 Py3.12
Skipped test_task_tclean test_hetarray_imaging.test_het_antenna_mosaic_cube_vptable_complex
Test Tasks Many Linux 2.28 Rocky 8.10 Py3.12
Skipped test_task_tclean test_mask.test_mask_outlier
Test Tasks Many Linux 2.28 Rocky 8.10 Py3.12
Skipped test_task_tclean test_hetarray_imaging.test_het_antenna_mosaic_cube_vptable_float
Test Tasks Many Linux 2.28 Rocky 8.10 Py3.12
Skipped test_task_tclean test_mask.test_mask_combined_1
Test Tasks Many Linux 2.28 Rocky 8.10 Py3.12
Skipped test_task_tclean test_cube.test_cube_continuum_subtract_uvsub
Test Tasks Many Linux 2.28 Rocky 8.10 Py3.12
Skipped test_task_tclean test_cube.test_cube_mtmfs_nterms1
Test Tasks Many Linux 2.28 Rocky 8.10 Py3.12
Skipped test_task_tclean test_cube.test_cube_weighting_taper_cas13260_old
Test Tasks Many Linux 2.28 Rocky 8.10 Py3.12
Skipped test_task_tclean test_mask.test_mask_combined_2
Test Tasks Many Linux 2.28 Rocky 8.10 Py3.12
Skipped test_task_tclean test_mask.test_mask_pbmask
Test Tasks Many Linux 2.28 Rocky 8.10 Py3.12
Skipped test_task_tclean test_widefield.test_widefield_awphpg_mtmfs_via_cube
Test Tasks Many Linux 2.28 Rocky 8.10 Py3.12
Skipped test_task_tclean test_cube.test_cubedata_mtmfs_nterms1
Test Tasks Many Linux 2.28 Rocky 8.10 Py3.12