Build: #180 failed

Job: Test Tasks Many Linux 2.28 Rocky 8.10 Py3.12 failed

Job result summary

Completed
Duration
336 minutes
Agent
cvpost135.cv.nrao.edu
Revision
371d1a67d52c269ff1eaa8de61f77ae6da8e5116
Total tests
3713

Tests

  • 3,713 tests in total
  • 2 tests failed
  • 2 failures are new
  • 138 tests were quarantined / skipped
  • 323 minutes taken in total.
New test failures 2
Status Test Duration
Collapse Failed test_task_tclean test_widefield.test_widefield_awphpg_mtmfs_via_cube
22 secs
AssertionError: False is not true
test_task_tclean.py:4502: in test_widefield_awphpg_mtmfs_via_cube
    self.assertTrue(self.check_final(report))
E   AssertionError: False is not true
Collapse Failed test_task_tclean test_wproject.test_wterm_awphpg
40 secs
AssertionError: False is not true
test_task_tclean.py:4242: in test_wterm_awphpg
    self.assertTrue(self.check_final(report))
E   AssertionError: False is not true

Error summary

The build generated some errors. See the full build log for more details.

/export/cvpost135-nvme/casa/bamboohome/temp/CASASPECS-MASTERTESTGPUPY312-TTM228PY312-180-ScriptBuildTask-16028758658563018577.sh: line 1: cd: /opt/casa/data/master: No such file or directory
/export/cvpost135-nvme/casa/bamboohome/temp/CASASPECS-MASTERTESTGPUPY312-TTM228PY312-180-ScriptBuildTask-16028758658563018577.sh: line 2: cd: /opt/casa/data/casa-data-req: No such file or directory
/export/cvpost135-nvme/casa/bamboohome/temp/CASASPECS-MASTERTESTGPUPY312-TTM228PY312-180-ScriptBuildTask-16028758658563018577.sh: line 3: cd: /opt/casa/data/casatestdata: No such file or directory
Error response from daemon: No such container: wheel-container-test
Error response from daemon: No such container: wheel-container-test
  % Total    % Received % Xferd  Average Speed   Time    Time     Time  Current
                                 Dload  Upload   Total   Spent    Left  Speed

  0     0    0     0    0     0      0      0 --:--:-- --:--:-- --:--:--     0
100 6002k  100 6002k    0     0  63.0M      0 --:--:-- --:--:-- --:--:-- 63.0M
[2531376] Failed to execute script 'atlutil' due to unhandled exception!
Traceback (most recent call last):
  File "atlutil.py", line 194, in <module>
  File "atlutil.py", line 112, in get_ticket_components
KeyError: 'fields'
[2531445] Failed to execute script 'atlutil' due to unhandled exception!
Traceback (most recent call last):
  File "atlutil.py", line 200, in <module>
  File "atlutil.py", line 165, in has_fix_version
KeyError: 'fields'
Already on 'master'
tar: work: Cannot stat: No such file or directory
tar: Exiting with failure status due to previous errors