Build: #180 failed
Job: Test Casalith Many Linux 2.28 Py3.12 was successful
Job result summary
- Completed
- Duration
- 20 minutes
- Agent
- cvpost134.cv.nrao.edu
- Revision
-
371d1a67d52c269ff1eaa8de61f77ae6da8e5116
- Total tests
- 4
- Successful since
- #178 ()
Tests
- 4 tests in total
- 16 minutes taken in total.
Error summary
The build generated some errors. See the full build log for more details.
% Total % Received % Xferd Average Speed Time Time Time Current
Dload Upload Total Spent Left Speed
0 0 0 0 0 0 0 0 --:--:-- --:--:-- --:--:-- 0
94 6002k 94 5679k 0 0 50.8M 0 --:--:-- --:--:-- --:--:-- 50.4M
100 6002k 100 6002k 0 0 52.8M 0 --:--:-- --:--:-- --:--:-- 52.3M
[1942557] Failed to execute script 'atlutil' due to unhandled exception!
Traceback (most recent call last):
File "atlutil.py", line 200, in <module>
File "atlutil.py", line 165, in has_fix_version
KeyError: 'fields'
% Total % Received % Xferd Average Speed Time Time Time Current
Dload Upload Total Spent Left Speed
0 0 0 0 0 0 0 0 --:--:-- --:--:-- --:--:-- 0
100 6002k 100 6002k 0 0 64.4M 0 --:--:-- --:--:-- --:--:-- 64.4M
[1942873] Failed to execute script 'atlutil' due to unhandled exception!
Traceback (most recent call last):
File "atlutil.py", line 194, in <module>
File "atlutil.py", line 112, in get_ticket_components
KeyError: 'fields'
Cloning into 'casa6'...
Updating files: 46% (3045/6546)
Updating files: 47% (3077/6546)
Updating files: 48% (3143/6546)
Updating files: 49% (3208/6546)
Updating files: 50% (3273/6546)
Updating files: 51% (3339/6546)
Updating files: 52% (3404/6546)
Updating files: 53% (3470/6546)
Updating files: 54% (3535/6546)
Updating files: 55% (3601/6546)
Updating files: 56% (3666/6546)
Updating files: 57% (3732/6546)
Updating files: 58% (3797/6546)
Updating files: 59% (3863/6546)
Updating files: 60% (3928/6546)
Updating files: 61% (3994/6546)
Updating files: 62% (4059/6546)
Updating files: 63% (4124/6546)
Updating files: 64% (4190/6546)
Updating files: 65% (4255/6546)
Updating files: 66% (4321/6546)
Updating files: 67% (4386/6546)
Updating files: 68% (4452/6546)
Updating files: 69% (4517/6546)
Updating files: 70% (4583/6546)
Updating files: 71% (4648/6546)
Updating files: 72% (4714/6546)
Updating files: 73% (4779/6546)
Updating files: 74% (4845/6546)
Updating files: 75% (4910/6546)
Updating files: 76% (4975/6546)
Updating files: 77% (5041/6546)
Updating files: 78% (5106/6546)
Updating files: 79% (5172/6546)
Updating files: 80% (5237/6546)
Updating files: 81% (5303/6546)
Updating files: 82% (5368/6546)
Updating files: 83% (5434/6546)
Updating files: 84% (5499/6546)
Updating files: 85% (5565/6546)
Updating files: 86% (5630/6546)
Updating files: 87% (5696/6546)
Updating files: 88% (5761/6546)
Updating files: 89% (5826/6546)
Updating files: 89% (5833/6546)
Updating files: 90% (5892/6546)
Updating files: 91% (5957/6546)
Updating files: 92% (6023/6546)
Updating files: 93% (6088/6546)
Updating files: 94% (6154/6546)
Updating files: 95% (6219/6546)
Updating files: 96% (6285/6546)
Updating files: 97% (6350/6546)
Updating files: 98% (6416/6546)
Updating files: 99% (6481/6546)
Updating files: 100% (6546/6546)
Updating files: 100% (6546/6546), done.
Already on 'master'
% Total % Received % Xferd Average Speed Time Time Time Current
Dload Upload Total Spent Left Speed
0 0 0 0 0 0 0 0 --:--:-- --:--:-- --:--:-- 0
100 669 0 669 0 0 41812 0 --:--:-- --:--:-- --:--:-- 41812
find: './proc/112/task/112/net': Invalid argument
find: './proc/112/net': Invalid argument
find: './proc/241/task/241/net': Invalid argument
find: './proc/241/net': Invalid argument
find: './proc/242/task/242/net': Invalid argument
find: './proc/242/net': Invalid argument
find: './proc/295/task/295/net': Invalid argument
find: './proc/295/net': Invalid argument
find: './proc/296/task/296/net': Invalid argument
find: './proc/296/net': Invalid argument
find: './proc/297/task/297/net': Invalid argument
find: './proc/297/net': Invalid argument
find: './proc/698/task/698/net': Invalid argument
find: './proc/698/net': Invalid argument
find: './proc/702/task/702/net': Invalid argument
find: './proc/702/net': Invalid argument
find: './proc/831/task/831/net': Invalid argument
find: './proc/831/net': Invalid argument
find: './proc/835/task/835/net': Invalid argument
find: './proc/835/net': Invalid argument
find: './proc/968/task/968/net': Invalid argument
find: './proc/968/net': Invalid argument
Dload Upload Total Spent Left Speed
0 0 0 0 0 0 0 0 --:--:-- --:--:-- --:--:-- 0
94 6002k 94 5679k 0 0 50.8M 0 --:--:-- --:--:-- --:--:-- 50.4M
100 6002k 100 6002k 0 0 52.8M 0 --:--:-- --:--:-- --:--:-- 52.3M
[1942557] Failed to execute script 'atlutil' due to unhandled exception!
Traceback (most recent call last):
File "atlutil.py", line 200, in <module>
File "atlutil.py", line 165, in has_fix_version
KeyError: 'fields'
% Total % Received % Xferd Average Speed Time Time Time Current
Dload Upload Total Spent Left Speed
0 0 0 0 0 0 0 0 --:--:-- --:--:-- --:--:-- 0
100 6002k 100 6002k 0 0 64.4M 0 --:--:-- --:--:-- --:--:-- 64.4M
[1942873] Failed to execute script 'atlutil' due to unhandled exception!
Traceback (most recent call last):
File "atlutil.py", line 194, in <module>
File "atlutil.py", line 112, in get_ticket_components
KeyError: 'fields'
Cloning into 'casa6'...
Updating files: 46% (3045/6546)
Updating files: 47% (3077/6546)
Updating files: 48% (3143/6546)
Updating files: 49% (3208/6546)
Updating files: 50% (3273/6546)
Updating files: 51% (3339/6546)
Updating files: 52% (3404/6546)
Updating files: 53% (3470/6546)
Updating files: 54% (3535/6546)
Updating files: 55% (3601/6546)
Updating files: 56% (3666/6546)
Updating files: 57% (3732/6546)
Updating files: 58% (3797/6546)
Updating files: 59% (3863/6546)
Updating files: 60% (3928/6546)
Updating files: 61% (3994/6546)
Updating files: 62% (4059/6546)
Updating files: 63% (4124/6546)
Updating files: 64% (4190/6546)
Updating files: 65% (4255/6546)
Updating files: 66% (4321/6546)
Updating files: 67% (4386/6546)
Updating files: 68% (4452/6546)
Updating files: 69% (4517/6546)
Updating files: 70% (4583/6546)
Updating files: 71% (4648/6546)
Updating files: 72% (4714/6546)
Updating files: 73% (4779/6546)
Updating files: 74% (4845/6546)
Updating files: 75% (4910/6546)
Updating files: 76% (4975/6546)
Updating files: 77% (5041/6546)
Updating files: 78% (5106/6546)
Updating files: 79% (5172/6546)
Updating files: 80% (5237/6546)
Updating files: 81% (5303/6546)
Updating files: 82% (5368/6546)
Updating files: 83% (5434/6546)
Updating files: 84% (5499/6546)
Updating files: 85% (5565/6546)
Updating files: 86% (5630/6546)
Updating files: 87% (5696/6546)
Updating files: 88% (5761/6546)
Updating files: 89% (5826/6546)
Updating files: 89% (5833/6546)
Updating files: 90% (5892/6546)
Updating files: 91% (5957/6546)
Updating files: 92% (6023/6546)
Updating files: 93% (6088/6546)
Updating files: 94% (6154/6546)
Updating files: 95% (6219/6546)
Updating files: 96% (6285/6546)
Updating files: 97% (6350/6546)
Updating files: 98% (6416/6546)
Updating files: 99% (6481/6546)
Updating files: 100% (6546/6546)
Updating files: 100% (6546/6546), done.
Already on 'master'
% Total % Received % Xferd Average Speed Time Time Time Current
Dload Upload Total Spent Left Speed
0 0 0 0 0 0 0 0 --:--:-- --:--:-- --:--:-- 0
100 669 0 669 0 0 41812 0 --:--:-- --:--:-- --:--:-- 41812
find: './proc/112/task/112/net': Invalid argument
find: './proc/112/net': Invalid argument
find: './proc/241/task/241/net': Invalid argument
find: './proc/241/net': Invalid argument
find: './proc/242/task/242/net': Invalid argument
find: './proc/242/net': Invalid argument
find: './proc/295/task/295/net': Invalid argument
find: './proc/295/net': Invalid argument
find: './proc/296/task/296/net': Invalid argument
find: './proc/296/net': Invalid argument
find: './proc/297/task/297/net': Invalid argument
find: './proc/297/net': Invalid argument
find: './proc/698/task/698/net': Invalid argument
find: './proc/698/net': Invalid argument
find: './proc/702/task/702/net': Invalid argument
find: './proc/702/net': Invalid argument
find: './proc/831/task/831/net': Invalid argument
find: './proc/831/net': Invalid argument
find: './proc/835/task/835/net': Invalid argument
find: './proc/835/net': Invalid argument
find: './proc/968/task/968/net': Invalid argument
find: './proc/968/net': Invalid argument