Build result summary

Details

Completed
Queue duration
1 second
Duration
350 minutes
Labels
None
Revisions
CASA6
371d1a67d52c269ff1eaa8de61f77ae6da8e5116
OPEN-CASA-PKG
e5285e68467f01199807a1f1a978aec8a4781be7
Total tests
4414

Tests

Responsible

  • Bob Garwood Bob Garwood Automatically assigned
  • Kumar Golap Kumar Golap Automatically assigned

Code commits

CASA6
Author Commit Message Commit date
Bob Garwood Bob Garwood 371d1a67d52c269ff1eaa8de61f77ae6da8e5116 Pull request #1087: CAS-14849
Merge in CASA/casa6 from CAS-14849 to master

* commit 'b7c9977a194ec0f6d5ce3a54c3a47be204959703':
  casaconfig 1.5.2
  casaconfig to 1.5.2.dev to address issues with failing tests
  casaconfig to 1.5.1, commented out casaconfig dev info from setup.py
  changes to use development casaconfig for CAS-14849 (1.5.1.dev1)
Kumar Golap Kumar Golap 1c15161af4835b249f46b5067f9a4927f32ea461 Pull request #1079: CAS-14812
Merge in CASA/casa6 from CAS-14812 to master

* commit '96f0882b20b77a5dabb50d0519fbb2fb99490292':
  make minimum oversampling to be 10 for awp2 and awphpg..reduces flux difference from mosaic by a few %
  Fixed a rounding to zero problem when the field of view of image is tiny wrt to beam fov
  some suggestions from reviewer and removed some commented code
  cherry picked stuff from CAS-14708
  cherry picked fixes from CAS-14708
  cherrypicking this file
Kumar Golap Kumar Golap 96f0882b20b77a5dabb50d0519fbb2fb99490292 Merge branch 'master' into CAS-14812
Bob Garwood Bob Garwood b7c9977a194ec0f6d5ce3a54c3a47be204959703 m casaconfig 1.5.2
Bob Garwood Bob Garwood 0162b0f21d9253a10cd8a3ebc52b074f3465cdd1 m casaconfig to 1.5.2.dev to address issues with failing tests

Tests

New test failures 2
Status Test View job Duration
Collapse Failed test_task_tclean test_wproject.test_wterm_awphpg
Test Tasks Many Linux 2.28 Rocky 8.10 Py3.12 40 secs
AssertionError: False is not true
test_task_tclean.py:4242: in test_wterm_awphpg
    self.assertTrue(self.check_final(report))
E   AssertionError: False is not true
Collapse Failed test_task_tclean test_widefield.test_widefield_awphpg_mtmfs_via_cube
Test Tasks Many Linux 2.28 Rocky 8.10 Py3.12 22 secs
AssertionError: False is not true
test_task_tclean.py:4502: in test_widefield_awphpg_mtmfs_via_cube
    self.assertTrue(self.check_final(report))
E   AssertionError: False is not true

Jira issues

IssueDescriptionStatus
Unknown Issue TypeCAS-14708Could not obtain issue details from Jira
Unknown Issue TypeCAS-14812Could not obtain issue details from Jira
Unknown Issue TypeCAS-14849Could not obtain issue details from Jira