Build: #180 failed

Job: Test Tasks Many Linux 2.28 Rocky 8.10 Py3.12 failed

Test results

  • 3,713 tests in total
  • 2 tests failed
  • 2 failures are new
  • 138 tests were quarantined / skipped
  • 323 minutes taken in total.

Build 180 has the following 2 errors: 2 new failure(s) occurred since the previous build.

New test failures 2
Status Test Duration
Collapse Failed test_task_tclean test_widefield.test_widefield_awphpg_mtmfs_via_cube
22 secs
AssertionError: False is not true
test_task_tclean.py:4502: in test_widefield_awphpg_mtmfs_via_cube
    self.assertTrue(self.check_final(report))
E   AssertionError: False is not true
Collapse Failed test_task_tclean test_wproject.test_wterm_awphpg
40 secs
AssertionError: False is not true
test_task_tclean.py:4242: in test_wterm_awphpg
    self.assertTrue(self.check_final(report))
E   AssertionError: False is not true