Build: #6 failed

Job: Test Tools macOS 15 Py3.12 was successful

Build log

The build generated 53,274 lines of output.   The output is too long and has been truncated to the last 1,000 lines. Download or view full build log.

01-Oct-2026 09:50:38 2026-10-01 13:50:39        INFO        FITSReader::showHDU +        NAXIS   =                      2 /Two-dimensional table
01-Oct-2026 09:50:38 2026-10-01 13:50:39        INFO        FITSReader::showHDU +        NAXIS1  =                     66 /Number of bytes per row
01-Oct-2026 09:50:38 2026-10-01 13:50:39        INFO        FITSReader::showHDU +        NAXIS2  =                     28 /Number of rows
01-Oct-2026 09:50:38 2026-10-01 13:50:39        INFO        FITSReader::showHDU +        PCOUNT  =                      0 /No random parameters
01-Oct-2026 09:50:38 2026-10-01 13:50:39        INFO        FITSReader::showHDU +        GCOUNT  =                      1 /Only one group
01-Oct-2026 09:50:38 2026-10-01 13:50:39        INFO        FITSReader::showHDU +        TFIELDS =                     13 /Number of columns
01-Oct-2026 09:50:38 2026-10-01 13:50:39        INFO        FITSReader::showHDU +               
01-Oct-2026 09:50:38 2026-10-01 13:50:39        INFO        FITSReader::showHDU +               
01-Oct-2026 09:50:38 2026-10-01 13:50:39        INFO        FITSReader::showHDU +        EXTNAME = 'AIPS AN '
01-Oct-2026 09:50:38 2026-10-01 13:50:39        INFO        FITSReader::showHDU +        EXTVER  =                      1
01-Oct-2026 09:50:38 2026-10-01 13:50:39        INFO        FITSReader::showHDU +        ARRAYX  =                      0
01-Oct-2026 09:50:38 2026-10-01 13:50:39        INFO        FITSReader::showHDU +        ARRAYY  =                      0
01-Oct-2026 09:50:38 2026-10-01 13:50:39        INFO        FITSReader::showHDU +        ARRAYZ  =                      0
01-Oct-2026 09:50:38 2026-10-01 13:50:39        INFO        FITSReader::showHDU +        GSTIA0  =                200.712
01-Oct-2026 09:50:38 2026-10-01 13:50:39        INFO        FITSReader::showHDU +        DEGPDY  =                360.986
01-Oct-2026 09:50:38 2026-10-01 13:50:39        INFO        FITSReader::showHDU +        FREQ    =            1.41342e+09
01-Oct-2026 09:50:38 2026-10-01 13:50:39        INFO        FITSReader::showHDU +        RDATE   = '1995-04-13T09:18:59.999771'
01-Oct-2026 09:50:38 2026-10-01 13:50:39        INFO        FITSReader::showHDU +        POLARX  =                2.12653
01-Oct-2026 09:50:38 2026-10-01 13:50:39        INFO        FITSReader::showHDU +        POLARY  =                17.1957
01-Oct-2026 09:50:38 2026-10-01 13:50:39        INFO        FITSReader::showHDU +        UT1UTC  =               0.123216
01-Oct-2026 09:50:38 2026-10-01 13:50:39        INFO        FITSReader::showHDU +        IATUTC  =                     29
01-Oct-2026 09:50:38 2026-10-01 13:50:39        INFO        FITSReader::showHDU +        TIMSYS  = 'TAI     '
01-Oct-2026 09:50:38 2026-10-01 13:50:39        INFO        FITSReader::showHDU +        ARRNAM  = 'VLA     '
01-Oct-2026 09:50:38 2026-10-01 13:50:39        INFO        FITSReader::showHDU +        NUMORB  =                      0
01-Oct-2026 09:50:38 2026-10-01 13:50:39        INFO        FITSReader::showHDU +        NOPCAL  =                      0
01-Oct-2026 09:50:38 2026-10-01 13:50:39        INFO        FITSReader::showHDU +        POLTYPE = '        '
01-Oct-2026 09:50:38 2026-10-01 13:50:39        INFO        FITSReader::showHDU +        XYZHAND = 'RIGHT   '
01-Oct-2026 09:50:38 2026-10-01 13:50:39        INFO        FITSReader::showHDU +        FRAME   = 'ITRF    '
01-Oct-2026 09:50:38 2026-10-01 13:50:39        INFO        FITSReader::showHDU +               
01-Oct-2026 09:50:38 2026-10-01 13:50:39        INFO        FITSReader::showHDU +        TTYPE1  = 'ANNAME  '
01-Oct-2026 09:50:38 2026-10-01 13:50:39        INFO        FITSReader::showHDU +        TFORM1  = '8A      '
01-Oct-2026 09:50:38 2026-10-01 13:50:39        INFO        FITSReader::showHDU +        TTYPE2  = 'STABXYZ '
01-Oct-2026 09:50:38 2026-10-01 13:50:39        INFO        FITSReader::showHDU +        TFORM2  = '3D      '
01-Oct-2026 09:50:38 2026-10-01 13:50:39        INFO        FITSReader::showHDU +        TUNIT2  = 'METERS  '
01-Oct-2026 09:50:38 2026-10-01 13:50:39        INFO        FITSReader::showHDU +        TTYPE3  = 'ORBPARM '
01-Oct-2026 09:50:38 2026-10-01 13:50:39        INFO        FITSReader::showHDU +        TFORM3  = '0D      '
01-Oct-2026 09:50:38 2026-10-01 13:50:39        INFO        FITSReader::showHDU +        TTYPE4  = 'NOSTA   '
01-Oct-2026 09:50:38 2026-10-01 13:50:39        INFO        FITSReader::showHDU +        TFORM4  = '1J      '
01-Oct-2026 09:50:38 2026-10-01 13:50:39        INFO        FITSReader::showHDU +        TTYPE5  = 'MNTSTA  '
01-Oct-2026 09:50:38 2026-10-01 13:50:39        INFO        FITSReader::showHDU +        TFORM5  = '1J      '
01-Oct-2026 09:50:38 2026-10-01 13:50:39        INFO        FITSReader::showHDU +        TTYPE6  = 'STAXOF  '
01-Oct-2026 09:50:38 2026-10-01 13:50:39        INFO        FITSReader::showHDU +        TFORM6  = '1E      '
01-Oct-2026 09:50:38 2026-10-01 13:50:39        INFO        FITSReader::showHDU +        TUNIT6  = 'METERS  '
01-Oct-2026 09:50:38 2026-10-01 13:50:39        INFO        FITSReader::showHDU +        TTYPE7  = 'POLTYA  '
01-Oct-2026 09:50:38 2026-10-01 13:50:39        INFO        FITSReader::showHDU +        TFORM7  = '1A      '
01-Oct-2026 09:50:38 2026-10-01 13:50:39        INFO        FITSReader::showHDU +        TTYPE8  = 'POLAA   '
01-Oct-2026 09:50:38 2026-10-01 13:50:39        INFO        FITSReader::showHDU +        TFORM8  = '1E      '
01-Oct-2026 09:50:38 2026-10-01 13:50:39        INFO        FITSReader::showHDU +        TUNIT8  = 'DEGREES '
01-Oct-2026 09:50:38 2026-10-01 13:50:39        INFO        FITSReader::showHDU +        TTYPE9  = 'POLCALA '
01-Oct-2026 09:50:38 2026-10-01 13:50:39        INFO        FITSReader::showHDU +        TFORM9  = '1E      '
01-Oct-2026 09:50:38 2026-10-01 13:50:39        INFO        FITSReader::showHDU +        TTYPE10 = 'POLTYB  '
01-Oct-2026 09:50:38 2026-10-01 13:50:39        INFO        FITSReader::showHDU +        TFORM10 = '1A      '
01-Oct-2026 09:50:38 2026-10-01 13:50:39        INFO        FITSReader::showHDU +        TTYPE11 = 'POLAB   '
01-Oct-2026 09:50:38 2026-10-01 13:50:39        INFO        FITSReader::showHDU +        TFORM11 = '1E      '
01-Oct-2026 09:50:38 2026-10-01 13:50:39        INFO        FITSReader::showHDU +        TUNIT11 = 'DEGREES '
01-Oct-2026 09:50:38 2026-10-01 13:50:39        INFO        FITSReader::showHDU +        TTYPE12 = 'POLCALB '
01-Oct-2026 09:50:38 2026-10-01 13:50:39        INFO        FITSReader::showHDU +        TFORM12 = '1E      '
01-Oct-2026 09:50:38 2026-10-01 13:50:39        INFO        FITSReader::showHDU +        TTYPE13 = 'DIAMETER'
01-Oct-2026 09:50:38 2026-10-01 13:50:39        INFO        FITSReader::showHDU +        TFORM13 = '1E      '
01-Oct-2026 09:50:38 2026-10-01 13:50:39        INFO        FITSReader::showHDU +               
01-Oct-2026 09:50:38 2026-10-01 13:50:39        INFO        FITSReader::showHDU +        END
01-Oct-2026 09:50:38 2026-10-01 13:50:39        INFO        FITSReader::showBinaryTable         28 rows, 13 cols, 1848 bytes total
01-Oct-2026 09:50:38 2026-10-01 13:50:39        INFO        FITSReader::showBinaryTable         the first 20 cols of the first 5 rows:
01-Oct-2026 09:50:38 2026-10-01 13:50:39        INFO        FITSReader::showBinaryTable         0: | VLA:N7 | -1.60116e+06, -5.04178e+06, 3.55516e+06 | | 1 | 0 | 0.00164886 | R | 0 | 0 | L | 0 | 0 | 25 |
01-Oct-2026 09:50:38 2026-10-01 13:50:39        INFO        FITSReader::showBinaryTable +        1: | VLA:W1 | -1.60119e+06, -5.042e+06, 3.55484e+06 | | 2 | 0 | 0.000869398 | R | 0 | 0 | L | 0 | 0 | 25 |
01-Oct-2026 09:50:38 2026-10-01 13:50:39        INFO        FITSReader::showBinaryTable +        2: | VLA:W2 | -1.60123e+06, -5.04198e+06, 3.55486e+06 | | 3 | 0 | -0.00116919 | R | 0 | 0 | L | 0 | 0 | 25 |
01-Oct-2026 09:50:38 2026-10-01 13:50:39        INFO        FITSReader::showBinaryTable +        3: | VLA:E1 | -1.60119e+06, -5.04202e+06, 3.55481e+06 | | 4 | 0 | 0.0093835 | R | 0 | 0 | L | 0 | 0 | 25 |
01-Oct-2026 09:50:38 2026-10-01 13:50:39        INFO        FITSReader::showBinaryTable +        4: | VLA:E3 | -1.60111e+06, -5.04202e+06, 3.55484e+06 | | 5 | 0 | 0.000869398 | R | 0 | 0 | L | 0 | 0 | 25 |
01-Oct-2026 09:50:38 2026-10-01 13:50:39        INFO        FITSReader::listFits         <<<------ Binary Table HDU
01-Oct-2026 09:50:38 2026-10-01 13:50:39        INFO        FITSReader::listFits         Binary Table HDU ------>>>
01-Oct-2026 09:50:38 2026-10-01 13:50:39        INFO        FITSReader::showHDU         XTENSION= 'BINTABLE' /Binary Table Extension
01-Oct-2026 09:50:38 2026-10-01 13:50:39        INFO        FITSReader::showHDU +        BITPIX  =                      8 /Character Information
01-Oct-2026 09:50:38 2026-10-01 13:50:39        INFO        FITSReader::showHDU +        NAXIS   =                      2 /Two-dimensional table
01-Oct-2026 09:50:38 2026-10-01 13:50:39        INFO        FITSReader::showHDU +        NAXIS1  =                    136 /Number of bytes per row
01-Oct-2026 09:50:38 2026-10-01 13:50:39        INFO        FITSReader::showHDU +        NAXIS2  =                      3 /Number of rows
01-Oct-2026 09:50:38 2026-10-01 13:50:39        INFO        FITSReader::showHDU +        PCOUNT  =                      0 /No random parameters
01-Oct-2026 09:50:38 2026-10-01 13:50:39        INFO        FITSReader::showHDU +        GCOUNT  =                      1 /Only one group
01-Oct-2026 09:50:38 2026-10-01 13:50:39        INFO        FITSReader::showHDU +        TFIELDS =                     19 /Number of columns
01-Oct-2026 09:50:38 2026-10-01 13:50:39        INFO        FITSReader::showHDU +               
01-Oct-2026 09:50:38 2026-10-01 13:50:39        INFO        FITSReader::showHDU +               
01-Oct-2026 09:50:38 2026-10-01 13:50:39        INFO        FITSReader::showHDU +        EXTNAME = 'AIPS SU '
01-Oct-2026 09:50:38 2026-10-01 13:50:39        INFO        FITSReader::showHDU +        EXTVER  =                      1
01-Oct-2026 09:50:38 2026-10-01 13:50:39        INFO        FITSReader::showHDU +        NO_IF   =                      1
01-Oct-2026 09:50:38 2026-10-01 13:50:39        INFO        FITSReader::showHDU +        FREQID  =                      1
01-Oct-2026 09:50:38 2026-10-01 13:50:39        INFO        FITSReader::showHDU +               
01-Oct-2026 09:50:38 2026-10-01 13:50:39        INFO        FITSReader::showHDU +        TTYPE1  = 'ID. NO. '
01-Oct-2026 09:50:38 2026-10-01 13:50:39        INFO        FITSReader::showHDU +        TFORM1  = '1J      '
01-Oct-2026 09:50:38 2026-10-01 13:50:39        INFO        FITSReader::showHDU +        TTYPE2  = 'SOURCE  '
01-Oct-2026 09:50:38 2026-10-01 13:50:39        INFO        FITSReader::showHDU +        TFORM2  = '20A     '
01-Oct-2026 09:50:38 2026-10-01 13:50:39        INFO        FITSReader::showHDU +        TTYPE3  = 'QUAL    '
01-Oct-2026 09:50:38 2026-10-01 13:50:39        INFO        FITSReader::showHDU +        TFORM3  = '1J      '
01-Oct-2026 09:50:38 2026-10-01 13:50:39        INFO        FITSReader::showHDU +        TTYPE4  = 'CALCODE '
01-Oct-2026 09:50:38 2026-10-01 13:50:39        INFO        FITSReader::showHDU +        TFORM4  = '4A      '
01-Oct-2026 09:50:38 2026-10-01 13:50:39        INFO        FITSReader::showHDU +        TTYPE5  = 'IFLUX   '
01-Oct-2026 09:50:38 2026-10-01 13:50:39        INFO        FITSReader::showHDU +        TFORM5  = '1E      '
01-Oct-2026 09:50:38 2026-10-01 13:50:39        INFO        FITSReader::showHDU +        TUNIT5  = 'JY      '
01-Oct-2026 09:50:38 2026-10-01 13:50:39        INFO        FITSReader::showHDU +        TTYPE6  = 'QFLUX   '
01-Oct-2026 09:50:38 2026-10-01 13:50:39        INFO        FITSReader::showHDU +        TFORM6  = '1E      '
01-Oct-2026 09:50:38 2026-10-01 13:50:39        INFO        FITSReader::showHDU +        TUNIT6  = 'JY      '
01-Oct-2026 09:50:38 2026-10-01 13:50:39        INFO        FITSReader::showHDU +        TTYPE7  = 'UFLUX   '
01-Oct-2026 09:50:38 2026-10-01 13:50:39        INFO        FITSReader::showHDU +        TFORM7  = '1E      '
01-Oct-2026 09:50:38 2026-10-01 13:50:39        INFO        FITSReader::showHDU +        TUNIT7  = 'JY      '
01-Oct-2026 09:50:38 2026-10-01 13:50:39        INFO        FITSReader::showHDU +        TTYPE8  = 'VFLUX   '
01-Oct-2026 09:50:38 2026-10-01 13:50:39        INFO        FITSReader::showHDU +        TFORM8  = '1E      '
01-Oct-2026 09:50:38 2026-10-01 13:50:39        INFO        FITSReader::showHDU +        TUNIT8  = 'JY      '
01-Oct-2026 09:50:38 2026-10-01 13:50:39        INFO        FITSReader::showHDU +        TTYPE9  = 'FREQOFF '
01-Oct-2026 09:50:38 2026-10-01 13:50:39        INFO        FITSReader::showHDU +        TFORM9  = '1D      '
01-Oct-2026 09:50:38 2026-10-01 13:50:39        INFO        FITSReader::showHDU +        TUNIT9  = 'HZ      '
01-Oct-2026 09:50:38 2026-10-01 13:50:39        INFO        FITSReader::showHDU +        TTYPE10 = 'BANDWIDTH'
01-Oct-2026 09:50:38 2026-10-01 13:50:39        INFO        FITSReader::showHDU +        TFORM10 = '1D      '
01-Oct-2026 09:50:38 2026-10-01 13:50:39        INFO        FITSReader::showHDU +        TUNIT10 = 'HZ      '
01-Oct-2026 09:50:38 2026-10-01 13:50:39        INFO        FITSReader::showHDU +        TTYPE11 = 'RAEPO   '
01-Oct-2026 09:50:38 2026-10-01 13:50:39        INFO        FITSReader::showHDU +        TFORM11 = '1D      '
01-Oct-2026 09:50:38 2026-10-01 13:50:39        INFO        FITSReader::showHDU +        TUNIT11 = 'DEGREES '
01-Oct-2026 09:50:38 2026-10-01 13:50:39        INFO        FITSReader::showHDU +        TTYPE12 = 'DECEPO  '
01-Oct-2026 09:50:38 2026-10-01 13:50:39        INFO        FITSReader::showHDU +        TFORM12 = '1D      '
01-Oct-2026 09:50:38 2026-10-01 13:50:39        INFO        FITSReader::showHDU +        TUNIT12 = 'DEGREES '
01-Oct-2026 09:50:38 2026-10-01 13:50:39        INFO        FITSReader::showHDU +        TTYPE13 = 'EPOCH   '
01-Oct-2026 09:50:38 2026-10-01 13:50:39        INFO        FITSReader::showHDU +        TFORM13 = '1D      '
01-Oct-2026 09:50:38 2026-10-01 13:50:39        INFO        FITSReader::showHDU +        TUNIT13 = 'YEARS   '
01-Oct-2026 09:50:38 2026-10-01 13:50:39        INFO        FITSReader::showHDU +        TTYPE14 = 'RAAPP   '
01-Oct-2026 09:50:38 2026-10-01 13:50:39        INFO        FITSReader::showHDU +        TFORM14 = '1D      '
01-Oct-2026 09:50:38 2026-10-01 13:50:39        INFO        FITSReader::showHDU +        TUNIT14 = 'DEGREES '
01-Oct-2026 09:50:38 2026-10-01 13:50:39        INFO        FITSReader::showHDU +        TTYPE15 = 'DECAPP  '
01-Oct-2026 09:50:38 2026-10-01 13:50:39        INFO        FITSReader::showHDU +        TFORM15 = '1D      '
01-Oct-2026 09:50:38 2026-10-01 13:50:39        INFO        FITSReader::showHDU +        TUNIT15 = 'DEGREES '
01-Oct-2026 09:50:38 2026-10-01 13:50:39        INFO        FITSReader::showHDU +        TTYPE16 = 'LSRVEL  '
01-Oct-2026 09:50:38 2026-10-01 13:50:39        INFO        FITSReader::showHDU +        TFORM16 = '1D      '
01-Oct-2026 09:50:38 2026-10-01 13:50:39        INFO        FITSReader::showHDU +        TUNIT16 = 'M/SEC   '
01-Oct-2026 09:50:38 2026-10-01 13:50:39        INFO        FITSReader::showHDU +        TTYPE17 = 'RESTFREQ'
01-Oct-2026 09:50:38 2026-10-01 13:50:39        INFO        FITSReader::showHDU +        TFORM17 = '1D      '
01-Oct-2026 09:50:38 2026-10-01 13:50:39        INFO        FITSReader::showHDU +        TUNIT17 = 'HZ      '
01-Oct-2026 09:50:38 2026-10-01 13:50:39        INFO        FITSReader::showHDU +        TTYPE18 = 'PMRA    '
01-Oct-2026 09:50:38 2026-10-01 13:50:39        INFO        FITSReader::showHDU +        TFORM18 = '1D      '
01-Oct-2026 09:50:38 2026-10-01 13:50:39        INFO        FITSReader::showHDU +        TUNIT18 = 'DEG/DAY '
01-Oct-2026 09:50:38 2026-10-01 13:50:39        INFO        FITSReader::showHDU +        TTYPE19 = 'PMDEC   '
01-Oct-2026 09:50:38 2026-10-01 13:50:39        INFO        FITSReader::showHDU +        TFORM19 = '1D      '
01-Oct-2026 09:50:38 2026-10-01 13:50:39        INFO        FITSReader::showHDU +        TUNIT19 = 'DEG/DAY '
01-Oct-2026 09:50:38 2026-10-01 13:50:39        INFO        FITSReader::showHDU +               
01-Oct-2026 09:50:38 2026-10-01 13:50:39        INFO        FITSReader::showHDU +        END
01-Oct-2026 09:50:38 2026-10-01 13:50:39        INFO        FITSReader::showBinaryTable         3 rows, 19 cols, 408 bytes total
01-Oct-2026 09:50:38 2026-10-01 13:50:39        INFO        FITSReader::showBinaryTable         the first 20 cols of the first 5 rows:
01-Oct-2026 09:50:38 2026-10-01 13:50:39        INFO        FITSReader::showBinaryTable         0: | 1 | 1331+30500002_0      | 0 |      | 0 | 0 | 0 | 0 | 0 | 1.5502e+06 | -157.215 | 30.5092 | 2000 | -157.263 | 30.5314 | 0 | 1.42041e+09 | 0 | 0 |
01-Oct-2026 09:50:38 2026-10-01 13:50:39        INFO        FITSReader::showBinaryTable +        1: | 2 | 1445+09900002_0      | 0 |      | 0 | 0 | 0 | 0 | 0 | 1.5502e+06 | -138.681 | 9.97669 | 2000 | -138.732 | 9.99458 | 0 | 1.42041e+09 | 0 | 0 |
01-Oct-2026 09:50:38 2026-10-01 13:50:39        INFO        FITSReader::showBinaryTable +        2: | 3 | N5921_2              | 0 |      | 0 | 0 | 0 | 0 | 0 | 1.5502e+06 | -129.5 | 5.06667 | 2000 | -129.552 | 5.08192 | 0 | 1.42041e+09 | 0 | 0 |
01-Oct-2026 09:50:38 2026-10-01 13:50:39        INFO        FITSReader::listFits         <<<------ Binary Table HDU
01-Oct-2026 09:50:38 2026-10-01 13:50:39        INFO        FITSReader::listFits         finish processing of Header-Data Units.
01-Oct-2026 09:50:38 2026-10-01 13:50:39        INFO        MSFitsInput::MSFitsInput        Converting FITS file 'ngc5921.fits' to MeasurementSet 'fromfits.ms'
01-Oct-2026 09:50:38 2026-10-01 13:50:39        INFO        MSFitsInput::setupMeasurementSet        Using tile shape [2, 63, 1040] for VLA with obstype=0
01-Oct-2026 09:50:38 2026-10-01 13:50:39        INFO        MSFitsInput::fillMSMainTable        Reading and writing 22653 visibility groups
01-Oct-2026 09:50:38 2026-10-01 13:50:39        INFO        MSFitsInput::readRandomGroupUVFits        extname=AIPS FQ  nrows=1 ncols=5 rowsize=24 pcount=0 gcount=1
01-Oct-2026 09:50:38 2026-10-01 13:50:39        INFO        MSFitsInput::readRandomGroupUVFits        extname=AIPS AN  nrows=28 ncols=13 rowsize=66 pcount=0 gcount=1
01-Oct-2026 09:50:38 2026-10-01 13:50:39        INFO        MSFitsInput::readRandomGroupUVFits        extname=AIPS SU  nrows=3 ncols=19 rowsize=136 pcount=0 gcount=1
01-Oct-2026 09:50:38 2026-10-01 13:50:39        INFO        MSFitsInput::fillExtraTables        Filling SOURCE table (this may take some time).
01-Oct-2026 09:50:38 2026-10-01 13:50:39        INFO        ms::tofits        By selection 22653 rows to be converted are reduced to 4509
01-Oct-2026 09:50:38 2026-10-01 13:50:39        INFO        MSFitsOutput::write         nchan=63 startchan=0 stepchan=1 avgchan=1
01-Oct-2026 09:50:38 2026-10-01 13:50:39        INFO        MSFitsOutput::write        Converting MeasurementSet /Users/casaci/bamboohome/xml-data/build-dir/CASASPECS-DEVTESTPY312147-TTOARM15P312/casa6/casatestutils/nosedir/test_tool_ms/tab51517_1123 to FITS file 'testfile.fits'
01-Oct-2026 09:50:38 2026-10-01 13:50:39        INFO        MSFitsOutput::_writeMain        Writing DATA column
01-Oct-2026 09:50:38 2026-10-01 13:50:39        INFO        MSFitsOutput::_writeMain        Frequency reference frame is LSRK
01-Oct-2026 09:50:38 2026-10-01 13:50:39        INFO        MSFitsOutput::write        Writing AIPS FQ table
01-Oct-2026 09:50:38 2026-10-01 13:50:39        INFO        MSFitsOutput::writeFQ        Found 1 spectral windows
01-Oct-2026 09:50:38 2026-10-01 13:50:39        INFO        MSFitsOutput::write        Writing AIPS AN table
01-Oct-2026 09:50:38 2026-10-01 13:50:39        INFO        MSFitsOutput::writeAN        Using ITRF frame for antenna positions.
01-Oct-2026 09:50:38 2026-10-01 13:50:39        INFO        MSFitsOutput::writeAN        Found 28 antennas in array #1
01-Oct-2026 09:50:38 test_tool_ms.py::mstool_test_fits::test_list_from_tofits
01-Oct-2026 09:50:38 test ms.listfits, fromfits, tofits
01-Oct-2026 09:50:38 PASSED
01-Oct-2026 09:50:38
01-Oct-2026 09:50:38 2026-10-01 13:50:39        INFO        MSFitsOutput::write         nchan=3 startchan=0 stepchan=1 avgchan=1
01-Oct-2026 09:50:38 2026-10-01 13:50:39        INFO        MSFitsOutput::write        Converting MeasurementSet /opt/casa/data/casatestdata/unittest/mstool/uvfits_test.ms to FITS file 'xyz.uvfits'
01-Oct-2026 09:50:38 2026-10-01 13:50:39        INFO        MSFitsOutput::_writeMain        CORRECTED_DATA does not exist, writing DATA
01-Oct-2026 09:50:38 2026-10-01 13:50:39        INFO        MSFitsOutput::_writeMain        Frequency reference frame is LSRK
01-Oct-2026 09:50:38 2026-10-01 13:50:39        INFO        MSFitsOutput::write        Writing AIPS FQ table
01-Oct-2026 09:50:38 2026-10-01 13:50:39        INFO        MSFitsOutput::writeFQ        Found 2 spectral windows
01-Oct-2026 09:50:38 2026-10-01 13:50:39        INFO        MSFitsOutput::write        Writing AIPS AN table
01-Oct-2026 09:50:38 2026-10-01 13:50:39        INFO        MSFitsOutput::writeAN        Using ITRF frame for antenna positions.
01-Oct-2026 09:50:38 2026-10-01 13:50:39        INFO        MSFitsOutput::writeAN        Found 8 antennas in array #1
01-Oct-2026 09:50:38 2026-10-01 13:50:39        INFO        MSFitsInput::MSFitsInput        Converting FITS file 'xyz.uvfits' to MeasurementSet 'ke.ms'
01-Oct-2026 09:50:38 2026-10-01 13:50:39        INFO        MSFitsInput::setupMeasurementSet        Using tile shape [1, 3, 43690] for SMA with obstype=0
01-Oct-2026 09:50:38 2026-10-01 13:50:39        INFO        MSFitsInput::fillMSMainTableColWise        SOURCE not found in UU VV WW DATE DATE BASELINE FREQSEL
01-Oct-2026 09:50:38 2026-10-01 13:50:39        INFO        MSFitsInput::fillMSMainTableColWise        Reading and writing 630 visibility groups
01-Oct-2026 09:50:38 2026-10-01 13:50:39        INFO        MSFitsInput::readRandomGroupUVFits        extname=AIPS FQ  nrows=2 ncols=5 rowsize=24 pcount=0 gcount=1
01-Oct-2026 09:50:38 2026-10-01 13:50:39        INFO        MSFitsInput::readRandomGroupUVFits        extname=AIPS AN  nrows=8 ncols=13 rowsize=66 pcount=0 gcount=1
01-Oct-2026 09:50:38 2026-10-01 13:50:39        INFO        MSFitsInput::fillExtraTables        Filling SOURCE table (this may take some time).
01-Oct-2026 09:50:38 2026-10-01 13:50:39        WARN        MSFitsInput::fillExtraTable        No systemic velocity for field 0
01-Oct-2026 09:50:38 2026-10-01 13:50:39        WARN        MSFitsInput::fillExtraTable        No rest frequency for field 0
01-Oct-2026 09:50:38 2026-10-01 13:50:39        WARN        MSFitsInput::fillExtraTable        No systemic velocity for field 0
01-Oct-2026 09:50:38 2026-10-01 13:50:39        WARN        MSFitsInput::fillExtraTable        No rest frequency for field 0
01-Oct-2026 09:50:38 test_tool_ms.py::mstool_test_fits::test_receptor_angle
01-Oct-2026 09:50:38 CAS-7081: Test receptor angle is preserved
01-Oct-2026 09:50:38 PASSED
01-Oct-2026 09:50:38
01-Oct-2026 09:50:38 2026-10-01 13:50:39        INFO        MSFitsInput::MSFitsInput        Converting FITS file '/opt/casa/data/casatestdata/unittest/mstool/1331+305_I.UVFITS' to MeasurementSet 'my.ms'
01-Oct-2026 09:50:38 2026-10-01 13:50:39        SEVERE        ms::fromfits        Stokes I cannot be decomposed into proper correlation types without making assumptions. This functionality is not supported at File: ../../msfits/MSFits/MSFitsInput.cc, line: 747 at File: ../../msfits/MSFits/MSFitsInput.cc, line: 597
01-Oct-2026 09:50:38 test_tool_ms.py::mstool_test_fits::test_stokes
01-Oct-2026 09:50:38 Verify fix to CAS_4283, uvfits files containing actual Stokes parameters will not be imported
01-Oct-2026 09:50:38 PASSED
01-Oct-2026 09:50:38
01-Oct-2026 09:50:38 - generated xml file: /Users/casaci/bamboohome/xml-data/build-dir/CASASPECS-DEVTESTPY312147-TTOARM15P312/casa6/casatestutils/nosedir/xml/test_tool_ms/nose.xml -
01-Oct-2026 09:50:38 ======================== 53 passed, 1 warning in 9.87s =========================
01-Oct-2026 09:50:39 ============================= test session starts ==============================
01-Oct-2026 09:50:39 platform darwin -- Python 3.12.8, pytest-9.1.1, pluggy-1.6.0 -- /Users/casaci/bamboohome/xml-data/build-dir/CASASPECS-DEVTESTPY312147-TTOARM15P312/casa6testenv/bin/python
01-Oct-2026 09:50:39 cachedir: .pytest_cache
01-Oct-2026 09:50:39 rootdir: /Users/casaci/bamboohome/xml-data/build-dir/CASASPECS-DEVTESTPY312147-TTOARM15P312/casa6/casatestutils/nosedir/test_tool_msmetadata
01-Oct-2026 09:50:39 configfile: pytest.ini
01-Oct-2026 09:50:40 collecting ... collected 85 items
01-Oct-2026 09:50:40
01-Oct-2026 09:50:40
01-Oct-2026 09:50:40 2026-10-01 13:50:41        INFO        msmetadata_cmpt.cc::open        Performing internal consistency checks on /opt/casa/data/casatestdata/unittest/msmetadata/MSMetaData.ms...
01-Oct-2026 09:50:40 2026-10-01 13:50:41        SEVERE        msmetadata_cmpt.cc::chanwidths        Exception Reported: From/to units not consistent. Cannot convert Hz to km/s at File: /Users/casaci/bamboohome/xml-data/build-dir/CASASPECS-DBC257-BPO15AP312/casainstall/include/casacore/casa/Quanta/Quantum.tcc, line: 259
01-Oct-2026 09:50:40 test_tool_msmetadata.py::msmetadata_test::test_CAS7463
01-Oct-2026 09:50:40 PASSED
01-Oct-2026 09:50:40
01-Oct-2026 09:50:40 2026-10-01 13:50:41        INFO        msmetadata_cmpt.cc::open        Performing internal consistency checks on /opt/casa/data/casatestdata/unittest/msmetadata/MSMetaData.ms...
01-Oct-2026 09:50:40 2026-10-01 13:50:41        INFO        MSFitsInput::MSFitsInput        Converting FITS file '/opt/casa/data/casatestdata/unittest/msmetadata/W3OH_MC.UVFITS' to MeasurementSet 'lala.ms'
01-Oct-2026 09:50:40 2026-10-01 13:50:41        INFO        MSFitsInput::setupMeasurementSet        Using tile shape [1, 38, 3449] for VLA with obstype=0
01-Oct-2026 09:50:40 2026-10-01 13:50:41        INFO        MSFitsInput::fillMSMainTableColWise        SOURCE not found in UU---SIN VV---SIN WW---SIN BASELINE DATE DATE
01-Oct-2026 09:50:40 2026-10-01 13:50:41        INFO        MSFitsInput::fillMSMainTableColWise        FREQSEL not found in UU---SIN VV---SIN WW---SIN BASELINE DATE DATE
01-Oct-2026 09:50:40 2026-10-01 13:50:41        INFO        MSFitsInput::fillMSMainTableColWise        Reading and writing 16311 visibility groups
01-Oct-2026 09:50:40 2026-10-01 13:50:41        INFO        MSFitsInput::readRandomGroupUVFits        extname=AIPS NX  nrows=1 ncols=7 rowsize=28 pcount=0 gcount=1
01-Oct-2026 09:50:40 2026-10-01 13:50:41        INFO        MSFitsInput::readRandomGroupUVFits        Skipping table, duplicate or unrecognized type: AIPS NX
01-Oct-2026 09:50:40 2026-10-01 13:50:41        INFO        MSFitsInput::readRandomGroupUVFits        extname=AIPS FQ  nrows=1 ncols=5 rowsize=24 pcount=0 gcount=1
01-Oct-2026 09:50:40 2026-10-01 13:50:41        INFO        MSFitsInput::readRandomGroupUVFits        extname=AIPS WX  nrows=155 ncols=11 rowsize=48 pcount=0 gcount=1
01-Oct-2026 09:50:40 2026-10-01 13:50:41        INFO        MSFitsInput::readRandomGroupUVFits        Skipping table, duplicate or unrecognized type: AIPS WX
01-Oct-2026 09:50:40 2026-10-01 13:50:41        INFO        MSFitsInput::readRandomGroupUVFits        extname=AIPS OF  nrows=100 ncols=7 rowsize=28 pcount=0 gcount=1
01-Oct-2026 09:50:40 2026-10-01 13:50:41        INFO        MSFitsInput::readRandomGroupUVFits        Skipping table, duplicate or unrecognized type: AIPS OF
01-Oct-2026 09:50:40 2026-10-01 13:50:41        INFO        MSFitsInput::readRandomGroupUVFits        extname=AIPS AN  nrows=29 ncols=14 rowsize=78 pcount=0 gcount=1
01-Oct-2026 09:50:40 2026-10-01 13:50:41        INFO        MSFitsInput::fillAntennaTable        This looks like an old VLA archive UVFITS file
01-Oct-2026 09:50:40 2026-10-01 13:50:41        INFO        MSFitsInput::fillAntennaTable        UVFITS file telescope position is 2.13393e-09 meters from CASA Observatories table VLA position
01-Oct-2026 09:50:40 2026-10-01 13:50:41        INFO        MSFitsInput::fillAntennaTable        Performing transformation of antenna positions from coordinate frame used by MODCOMPs to ITRF
01-Oct-2026 09:50:40 2026-10-01 13:50:41        INFO        MSFitsInput::fillExtraTables        Filling SOURCE table (this may take some time).
01-Oct-2026 09:50:40 2026-10-01 13:50:41        WARN        MSFitsInput::fillExtraTable        No systemic velocity for field 0
01-Oct-2026 09:50:40 2026-10-01 13:50:41        WARN        MSFitsInput::fillExtraTable        No rest frequency for field 0
01-Oct-2026 09:50:40 2026-10-01 13:50:41        INFO        msmetadata_cmpt.cc::open        Performing internal consistency checks on lala.ms...
01-Oct-2026 09:50:40 test_tool_msmetadata.py::msmetadata_test::test_CAS7837
01-Oct-2026 09:50:40 Test corner case with no intents to make sure it doesn't segfault
01-Oct-2026 09:50:40 PASSED
01-Oct-2026 09:50:40
01-Oct-2026 09:50:40 2026-10-01 13:50:41        INFO        msmetadata_cmpt.cc::open        Performing internal consistency checks on /opt/casa/data/casatestdata/unittest/msmetadata/MSMetaData.ms...
01-Oct-2026 09:50:40 2026-10-01 13:50:41        INFO        msmetadata_cmpt.cc::open        Performing internal consistency checks on cas7986.ms...
01-Oct-2026 09:50:40 2026-10-01 13:50:41        SEVERE        ms::close        Exception Reported: Exception: Illegal ANTENNA1 value 9 found in main table. /Users/casaci/bamboohome/xml-data/build-dir/CASASPECS-DEVTESTPY312147-TTOARM15P312/casa6/casatestutils/nosedir/test_tool_msmetadata/cas7986.ms/ANTENNA only has 8 rows (IDs).
01-Oct-2026 09:50:40 2026-10-01 13:50:41        SEVERE        ms::close+        ... thrown by void casa::MSChecker::checkReferentialIntegrity() const at File: /Users/casaci/bamboohome/xml-data/build-dir/CASASPECS-DBC257-BPO15AP312/casa6/casatools/src/code/msvis/MSVis/MSChecker.cc, line: 78
01-Oct-2026 09:50:40 2026-10-01 13:50:41        INFO        msmetadata_cmpt.cc::open        Performing internal consistency checks on cas7986.ms...
01-Oct-2026 09:50:40 2026-10-01 13:50:41        SEVERE        msmetadata_cmpt.cc::open        Exception Reported: Exception: Illegal ANTENNA1 value 9 found in main table. /Users/casaci/bamboohome/xml-data/build-dir/CASASPECS-DEVTESTPY312147-TTOARM15P312/casa6/casatestutils/nosedir/test_tool_msmetadata/cas7986.ms/ANTENNA only has 8 rows (IDs).
01-Oct-2026 09:50:40 2026-10-01 13:50:41        SEVERE        msmetadata_cmpt.cc::open+        ... thrown by void casa::MSChecker::checkReferentialIntegrity() const at File: /Users/casaci/bamboohome/xml-data/build-dir/CASASPECS-DBC257-BPO15AP312/casa6/casatools/src/code/msvis/MSVis/MSChecker.cc, line: 78
01-Oct-2026 09:50:40 2026-10-01 13:50:41        INFO        msmetadata_cmpt.cc::open        Performing internal consistency checks on cas7986.ms...
01-Oct-2026 09:50:40 2026-10-01 13:50:41        SEVERE        ms::close        Exception Reported: Exception: Illegal ANTENNA2 value 9 found in main table. /Users/casaci/bamboohome/xml-data/build-dir/CASASPECS-DEVTESTPY312147-TTOARM15P312/casa6/casatestutils/nosedir/test_tool_msmetadata/cas7986.ms/ANTENNA only has 8 rows (IDs).
01-Oct-2026 09:50:40 2026-10-01 13:50:41        SEVERE        ms::close+        ... thrown by void casa::MSChecker::checkReferentialIntegrity() const at File: /Users/casaci/bamboohome/xml-data/build-dir/CASASPECS-DBC257-BPO15AP312/casa6/casatools/src/code/msvis/MSVis/MSChecker.cc, line: 78
01-Oct-2026 09:50:40 2026-10-01 13:50:41        INFO        msmetadata_cmpt.cc::open        Performing internal consistency checks on cas7986.ms...
01-Oct-2026 09:50:40 2026-10-01 13:50:41        SEVERE        msmetadata_cmpt.cc::open        Exception Reported: Exception: Illegal ANTENNA2 value 9 found in main table. /Users/casaci/bamboohome/xml-data/build-dir/CASASPECS-DEVTESTPY312147-TTOARM15P312/casa6/casatestutils/nosedir/test_tool_msmetadata/cas7986.ms/ANTENNA only has 8 rows (IDs).
01-Oct-2026 09:50:40 2026-10-01 13:50:41        SEVERE        msmetadata_cmpt.cc::open+        ... thrown by void casa::MSChecker::checkReferentialIntegrity() const at File: /Users/casaci/bamboohome/xml-data/build-dir/CASASPECS-DBC257-BPO15AP312/casa6/casatools/src/code/msvis/MSVis/MSChecker.cc, line: 78
01-Oct-2026 09:50:40 2026-10-01 13:50:41        INFO        msmetadata_cmpt.cc::open        Performing internal consistency checks on cas7986.ms...
01-Oct-2026 09:50:40 2026-10-01 13:50:41        SEVERE        ms::close        Exception Reported: Exception: Illegal DATA_DESC_ID value 9 found in main table. /Users/casaci/bamboohome/xml-data/build-dir/CASASPECS-DEVTESTPY312147-TTOARM15P312/casa6/casatestutils/nosedir/test_tool_msmetadata/cas7986.ms/DATA_DESCRIPTION only has 3 rows (IDs).
01-Oct-2026 09:50:40 2026-10-01 13:50:41        SEVERE        ms::close+        ... thrown by void casa::MSChecker::checkReferentialIntegrity() const at File: /Users/casaci/bamboohome/xml-data/build-dir/CASASPECS-DBC257-BPO15AP312/casa6/casatools/src/code/msvis/MSVis/MSChecker.cc, line: 78
01-Oct-2026 09:50:40 2026-10-01 13:50:41        INFO        msmetadata_cmpt.cc::open        Performing internal consistency checks on cas7986.ms...
01-Oct-2026 09:50:40 2026-10-01 13:50:41        SEVERE        msmetadata_cmpt.cc::open        Exception Reported: Exception: Illegal DATA_DESC_ID value 9 found in main table. /Users/casaci/bamboohome/xml-data/build-dir/CASASPECS-DEVTESTPY312147-TTOARM15P312/casa6/casatestutils/nosedir/test_tool_msmetadata/cas7986.ms/DATA_DESCRIPTION only has 3 rows (IDs).
01-Oct-2026 09:50:40 2026-10-01 13:50:41        SEVERE        msmetadata_cmpt.cc::open+        ... thrown by void casa::MSChecker::checkReferentialIntegrity() const at File: /Users/casaci/bamboohome/xml-data/build-dir/CASASPECS-DBC257-BPO15AP312/casa6/casatools/src/code/msvis/MSVis/MSChecker.cc, line: 78
01-Oct-2026 09:50:41 2026-10-01 13:50:41        INFO        msmetadata_cmpt.cc::open        Performing internal consistency checks on cas7986.ms...
01-Oct-2026 09:50:41 2026-10-01 13:50:41        SEVERE        ms::close        Exception Reported: Exception: Illegal FIELD_ID value 9 found in main table. /Users/casaci/bamboohome/xml-data/build-dir/CASASPECS-DEVTESTPY312147-TTOARM15P312/casa6/casatestutils/nosedir/test_tool_msmetadata/cas7986.ms/FIELD only has 1 rows (IDs).
01-Oct-2026 09:50:41 2026-10-01 13:50:41        SEVERE        ms::close+        ... thrown by void casa::MSChecker::checkReferentialIntegrity() const at File: /Users/casaci/bamboohome/xml-data/build-dir/CASASPECS-DBC257-BPO15AP312/casa6/casatools/src/code/msvis/MSVis/MSChecker.cc, line: 78
01-Oct-2026 09:50:41 2026-10-01 13:50:41        INFO        msmetadata_cmpt.cc::open        Performing internal consistency checks on cas7986.ms...
01-Oct-2026 09:50:41 2026-10-01 13:50:41        SEVERE        msmetadata_cmpt.cc::open        Exception Reported: Exception: Illegal FIELD_ID value 9 found in main table. /Users/casaci/bamboohome/xml-data/build-dir/CASASPECS-DEVTESTPY312147-TTOARM15P312/casa6/casatestutils/nosedir/test_tool_msmetadata/cas7986.ms/FIELD only has 1 rows (IDs).
01-Oct-2026 09:50:41 2026-10-01 13:50:41        SEVERE        msmetadata_cmpt.cc::open+        ... thrown by void casa::MSChecker::checkReferentialIntegrity() const at File: /Users/casaci/bamboohome/xml-data/build-dir/CASASPECS-DBC257-BPO15AP312/casa6/casatools/src/code/msvis/MSVis/MSChecker.cc, line: 78
01-Oct-2026 09:50:41 test_tool_msmetadata.py::msmetadata_test::test_CAS7986
01-Oct-2026 09:50:41 Verify datasets with referential integrity issues cause errors
01-Oct-2026 09:50:41 PASSED
01-Oct-2026 09:50:41
01-Oct-2026 09:50:41 2026-10-01 13:50:41        INFO        msmetadata_cmpt.cc::open        Performing internal consistency checks on /opt/casa/data/casatestdata/unittest/msmetadata/MSMetaData.ms...
01-Oct-2026 09:50:41 2026-10-01 13:50:41        INFO        msmetadata_cmpt.cc::open        Performing internal consistency checks on /opt/casa/data/casatestdata/unittest/msmetadata/fdmtdm.ms...
01-Oct-2026 09:50:41 test_tool_msmetadata.py::msmetadata_test::test_alma_fdmtdm_heavy_online_averaging
01-Oct-2026 09:50:41 CAS-14435 proper fdm/tdm identification in cases
01-Oct-2026 09:50:41 of heavy online averaging
01-Oct-2026 09:50:41 PASSED
01-Oct-2026 09:50:41
01-Oct-2026 09:50:41 2026-10-01 13:50:41        INFO        msmetadata_cmpt.cc::open        Performing internal consistency checks on /opt/casa/data/casatestdata/unittest/msmetadata/MSMetaData.ms...
01-Oct-2026 09:50:41 test_tool_msmetadata.py::msmetadata_test::test_almaspws
01-Oct-2026 09:50:41 Test almaspws()
01-Oct-2026 09:50:41 PASSED
01-Oct-2026 09:50:41
01-Oct-2026 09:50:41 2026-10-01 13:50:41        INFO        msmetadata_cmpt.cc::open        Performing internal consistency checks on /opt/casa/data/casatestdata/unittest/msmetadata/MSMetaData.ms...
01-Oct-2026 09:50:41 test_tool_msmetadata.py::msmetadata_test::test_antennadiamter
01-Oct-2026 09:50:41 Test msmetadata.antennadiameter
01-Oct-2026 09:50:41 PASSED
01-Oct-2026 09:50:41
01-Oct-2026 09:50:41 2026-10-01 13:50:41        INFO        msmetadata_cmpt.cc::open        Performing internal consistency checks on /opt/casa/data/casatestdata/unittest/msmetadata/MSMetaData.ms...
01-Oct-2026 09:50:41 test_tool_msmetadata.py::msmetadata_test::test_antennanames_and_antennaids
01-Oct-2026 09:50:41 Test antennanames() and antennaids()
01-Oct-2026 09:50:41 PASSED
01-Oct-2026 09:50:41
01-Oct-2026 09:50:41 2026-10-01 13:50:41        INFO        msmetadata_cmpt.cc::open        Performing internal consistency checks on /opt/casa/data/casatestdata/unittest/msmetadata/MSMetaData.ms...
01-Oct-2026 09:50:41 2026-10-01 13:50:41        INFO        MSMetaData::_computeScanAndSubScanProperties         Computing scan and subscan properties...
01-Oct-2026 09:50:41 2026-10-01 13:50:41        SEVERE        msmetadata_cmpt.cc::antennasforscan        Exception Reported: Exception: No matching scans found.
01-Oct-2026 09:50:41 2026-10-01 13:50:41        SEVERE        msmetadata_cmpt.cc::antennasforscan+        ... thrown by std::set<ScanKey> casac::msmetadata::_getScanKeys(long, long, long) const at File: /private/var/folders/60/83wxljbx2vlfbx_hy0yfv8rc0000gn/T/build-via-sdist-3dumqb1j/casatools-6.7.7.7a14849.dev4/src/tools/msmetadata/msmetadata_cmpt.cc, line: 2485
01-Oct-2026 09:50:41 2026-10-01 13:50:41        SEVERE        msmetadata_cmpt.cc::antennasforscan        Exception Reported: Exception: No matching scans found.
01-Oct-2026 09:50:41 2026-10-01 13:50:41        SEVERE        msmetadata_cmpt.cc::antennasforscan+        ... thrown by std::set<ScanKey> casac::msmetadata::_getScanKeys(long, long, long) const at File: /private/var/folders/60/83wxljbx2vlfbx_hy0yfv8rc0000gn/T/build-via-sdist-3dumqb1j/casatools-6.7.7.7a14849.dev4/src/tools/msmetadata/msmetadata_cmpt.cc, line: 2485
01-Oct-2026 09:50:41 test_tool_msmetadata.py::msmetadata_test::test_antennasforscan
01-Oct-2026 09:50:41 Test msmetadata.antennasforscan()
01-Oct-2026 09:50:41 PASSED
01-Oct-2026 09:50:41
01-Oct-2026 09:50:41 2026-10-01 13:50:41        INFO        msmetadata_cmpt.cc::open        Performing internal consistency checks on /opt/casa/data/casatestdata/unittest/msmetadata/MSMetaData.ms...
01-Oct-2026 09:50:41 2026-10-01 13:50:41        SEVERE        msmetadata_cmpt.cc::antennastations        Exception Reported: No antenna ID may be less than zero when multiple IDs specified.
01-Oct-2026 09:50:41 2026-10-01 13:50:41        SEVERE        msmetadata_cmpt.cc::antennastations        Exception Reported: Exception: MSMetaData::_hasAntennaID: Requested antenna ID 20 is greater than or equal to the number of records (15) in this MS's ANTENNA table.
01-Oct-2026 09:50:41 2026-10-01 13:50:41        SEVERE        msmetadata_cmpt.cc::antennastations+        ... thrown by void casacore::MSMetaData::_hasAntennaID(Int) at File: ../../ms/MSOper/MSMetaData.cc, line: 4932
01-Oct-2026 09:50:41 2026-10-01 13:50:41        SEVERE        msmetadata_cmpt.cc::antennastations        Exception Reported: Exception: MSMetaData::_hasAntennaID: Requested antenna ID 20 is greater than or equal to the number of records (15) in this MS's ANTENNA table.
01-Oct-2026 09:50:41 2026-10-01 13:50:41        SEVERE        msmetadata_cmpt.cc::antennastations+        ... thrown by void casacore::MSMetaData::_hasAntennaID(Int) at File: ../../ms/MSOper/MSMetaData.cc, line: 4932
01-Oct-2026 09:50:41 test_tool_msmetadata.py::msmetadata_test::test_antennastations
01-Oct-2026 09:50:41 Test antennastations()
01-Oct-2026 09:50:41 PASSED
01-Oct-2026 09:50:41
01-Oct-2026 09:50:41 2026-10-01 13:50:41        INFO        msmetadata_cmpt.cc::open        Performing internal consistency checks on /opt/casa/data/casatestdata/unittest/msmetadata/MSMetaData.ms...
01-Oct-2026 09:50:41 2026-10-01 13:50:41        SEVERE        msmetadata_cmpt.cc::bandwidths        Exception Reported: Exception: Spectral window ID 50 out of range, must be less than or equal to 39.
01-Oct-2026 09:50:41 2026-10-01 13:50:41        SEVERE        msmetadata_cmpt.cc::bandwidths+        ... thrown by void casac::msmetadata::_checkSpwId(int, bool) const at File: /private/var/folders/60/83wxljbx2vlfbx_hy0yfv8rc0000gn/T/build-via-sdist-3dumqb1j/casatools-6.7.7.7a14849.dev4/src/tools/msmetadata/msmetadata_cmpt.cc, line: 2449
01-Oct-2026 09:50:41 2026-10-01 13:50:41        SEVERE        msmetadata_cmpt.cc::bandwidths        Exception Reported: Exception: Spectral window ID 50 out of range, must be less than or equal to 39.
01-Oct-2026 09:50:41 2026-10-01 13:50:41        SEVERE        msmetadata_cmpt.cc::bandwidths+        ... thrown by void casac::msmetadata::_checkSpwId(int, bool) const at File: /private/var/folders/60/83wxljbx2vlfbx_hy0yfv8rc0000gn/T/build-via-sdist-3dumqb1j/casatools-6.7.7.7a14849.dev4/src/tools/msmetadata/msmetadata_cmpt.cc, line: 2449
01-Oct-2026 09:50:41 2026-10-01 13:50:41        SEVERE        msmetadata_cmpt.cc::bandwidths        Exception Reported: Exception: When specified as an array, no element of spws may be < 0.
01-Oct-2026 09:50:41 2026-10-01 13:50:41        SEVERE        msmetadata_cmpt.cc::bandwidths+        ... thrown by variant *casac::msmetadata::bandwidths(const variant &) at File: /private/var/folders/60/83wxljbx2vlfbx_hy0yfv8rc0000gn/T/build-via-sdist-3dumqb1j/casatools-6.7.7.7a14849.dev4/src/tools/msmetadata/msmetadata_cmpt.cc, line: 578
01-Oct-2026 09:50:41 test_tool_msmetadata.py::msmetadata_test::test_bandwidths
01-Oct-2026 09:50:41 Test bandwidths()
01-Oct-2026 09:50:41 PASSED
01-Oct-2026 09:50:41
01-Oct-2026 09:50:41 2026-10-01 13:50:41        INFO        msmetadata_cmpt.cc::open        Performing internal consistency checks on /opt/casa/data/casatestdata/unittest/msmetadata/MSMetaData.ms...
01-Oct-2026 09:50:41 test_tool_msmetadata.py::msmetadata_test::test_chanavgspws
01-Oct-2026 09:50:41 Test chanavgspws()
01-Oct-2026 09:50:41 PASSED
01-Oct-2026 09:50:41
01-Oct-2026 09:50:41 2026-10-01 13:50:41        INFO        msmetadata_cmpt.cc::open        Performing internal consistency checks on /opt/casa/data/casatestdata/unittest/msmetadata/MSMetaData.ms...
01-Oct-2026 09:50:41 test_tool_msmetadata.py::msmetadata_test::test_chaneffbws
01-Oct-2026 09:50:41 Test chaneffbws()
01-Oct-2026 09:50:41 PASSED
01-Oct-2026 09:50:41
01-Oct-2026 09:50:41 2026-10-01 13:50:41        INFO        msmetadata_cmpt.cc::open        Performing internal consistency checks on /opt/casa/data/casatestdata/unittest/msmetadata/MSMetaData.ms...
01-Oct-2026 09:50:41 test_tool_msmetadata.py::msmetadata_test::test_chanres
01-Oct-2026 09:50:41 Test chanres()
01-Oct-2026 09:50:41 PASSED
01-Oct-2026 09:50:41
01-Oct-2026 09:50:41 2026-10-01 13:50:41        INFO        msmetadata_cmpt.cc::open        Performing internal consistency checks on /opt/casa/data/casatestdata/unittest/msmetadata/MSMetaData.ms...
01-Oct-2026 09:50:41 2026-10-01 13:50:41        SEVERE        msmetadata_cmpt.cc::chanwidths        Exception Reported: Exception: Spectral window ID 50 out of range, must be nonnegative and less than or equal to 39.
01-Oct-2026 09:50:41 2026-10-01 13:50:41        SEVERE        msmetadata_cmpt.cc::chanwidths+        ... thrown by void casac::msmetadata::_checkSpwId(int, bool) const at File: /private/var/folders/60/83wxljbx2vlfbx_hy0yfv8rc0000gn/T/build-via-sdist-3dumqb1j/casatools-6.7.7.7a14849.dev4/src/tools/msmetadata/msmetadata_cmpt.cc, line: 2449
01-Oct-2026 09:50:41 2026-10-01 13:50:41        SEVERE        msmetadata_cmpt.cc::chanwidths        Exception Reported: Exception: Spectral window ID -2 out of range, must be nonnegative and less than or equal to 39.
01-Oct-2026 09:50:41 2026-10-01 13:50:41        SEVERE        msmetadata_cmpt.cc::chanwidths+        ... thrown by void casac::msmetadata::_checkSpwId(int, bool) const at File: /private/var/folders/60/83wxljbx2vlfbx_hy0yfv8rc0000gn/T/build-via-sdist-3dumqb1j/casatools-6.7.7.7a14849.dev4/src/tools/msmetadata/msmetadata_cmpt.cc, line: 2449
01-Oct-2026 09:50:41 2026-10-01 13:50:41        SEVERE        msmetadata_cmpt.cc::chanwidths        Exception Reported: Tool is not attached to an MS. Use open()
01-Oct-2026 09:50:41 2026-10-01 13:50:41        SEVERE        msmetadata_cmpt.cc::chanfreqs        Exception Reported: Tool is not attached to an MS. Use open()
01-Oct-2026 09:50:41 2026-10-01 13:50:41        SEVERE        msmetadata_cmpt.cc::meanfreq        Exception Reported: Tool is not attached to an MS. Use open()
01-Oct-2026 09:50:41 2026-10-01 13:50:41        SEVERE        msmetadata_cmpt.cc::sideband        Exception Reported: Tool is not attached to an MS. Use open()
01-Oct-2026 09:50:41 2026-10-01 13:50:41        SEVERE        msmetadata_cmpt.cc::effexposuretime        Exception Reported: Tool is not attached to an MS. Use open()
01-Oct-2026 09:50:41 test_tool_msmetadata.py::msmetadata_test::test_chanwidths
01-Oct-2026 09:50:41 Test chanwidths()
01-Oct-2026 09:50:41 PASSED
01-Oct-2026 09:50:41
01-Oct-2026 09:50:41 2026-10-01 13:50:41        INFO        msmetadata_cmpt.cc::open        Performing internal consistency checks on /opt/casa/data/casatestdata/unittest/msmetadata/MSMetaData.ms...
01-Oct-2026 09:50:41 test_tool_msmetadata.py::msmetadata_test::test_corrbit
01-Oct-2026 09:50:41 Test corrbit()
01-Oct-2026 09:50:41 PASSED
01-Oct-2026 09:50:41
01-Oct-2026 09:50:41 2026-10-01 13:50:41        INFO        msmetadata_cmpt.cc::open        Performing internal consistency checks on /opt/casa/data/casatestdata/unittest/msmetadata/MSMetaData.ms...
01-Oct-2026 09:50:41 2026-10-01 13:50:41        SEVERE        msmetadata_cmpt.cc::corrprodsforpol        Exception Reported: Exception: Polarization ID cannot be negative.
01-Oct-2026 09:50:41 2026-10-01 13:50:41        SEVERE        msmetadata_cmpt.cc::corrprodsforpol+        ... thrown by void casac::msmetadata::_checkPolId(int, bool) const at File: /private/var/folders/60/83wxljbx2vlfbx_hy0yfv8rc0000gn/T/build-via-sdist-3dumqb1j/casatools-6.7.7.7a14849.dev4/src/tools/msmetadata/msmetadata_cmpt.cc, line: 2459
01-Oct-2026 09:50:41 2026-10-01 13:50:41        SEVERE        msmetadata_cmpt.cc::corrprodsforpol        Exception Reported: Exception: Polarization ID 2 out of range, must be less than 2.
01-Oct-2026 09:50:41 2026-10-01 13:50:41        SEVERE        msmetadata_cmpt.cc::corrprodsforpol+        ... thrown by void casac::msmetadata::_checkPolId(int, bool) const at File: /private/var/folders/60/83wxljbx2vlfbx_hy0yfv8rc0000gn/T/build-via-sdist-3dumqb1j/casatools-6.7.7.7a14849.dev4/src/tools/msmetadata/msmetadata_cmpt.cc, line: 2458
01-Oct-2026 09:50:41 test_tool_msmetadata.py::msmetadata_test::test_corrprodsforpol
01-Oct-2026 09:50:41 Test msmetadata.corrprodssforpol()
01-Oct-2026 09:50:41 PASSED
01-Oct-2026 09:50:41
01-Oct-2026 09:50:41 2026-10-01 13:50:41        INFO        msmetadata_cmpt.cc::open        Performing internal consistency checks on /opt/casa/data/casatestdata/unittest/msmetadata/MSMetaData.ms...
01-Oct-2026 09:50:41 2026-10-01 13:50:41        SEVERE        msmetadata_cmpt.cc::corrtypesforpol        Exception Reported: Exception: Polarization ID cannot be negative.
01-Oct-2026 09:50:41 2026-10-01 13:50:41        SEVERE        msmetadata_cmpt.cc::corrtypesforpol+        ... thrown by void casac::msmetadata::_checkPolId(int, bool) const at File: /private/var/folders/60/83wxljbx2vlfbx_hy0yfv8rc0000gn/T/build-via-sdist-3dumqb1j/casatools-6.7.7.7a14849.dev4/src/tools/msmetadata/msmetadata_cmpt.cc, line: 2459
01-Oct-2026 09:50:41 2026-10-01 13:50:41        SEVERE        msmetadata_cmpt.cc::corrtypesforpol        Exception Reported: Exception: Polarization ID 2 out of range, must be less than 2.
01-Oct-2026 09:50:41 2026-10-01 13:50:41        SEVERE        msmetadata_cmpt.cc::corrtypesforpol+        ... thrown by void casac::msmetadata::_checkPolId(int, bool) const at File: /private/var/folders/60/83wxljbx2vlfbx_hy0yfv8rc0000gn/T/build-via-sdist-3dumqb1j/casatools-6.7.7.7a14849.dev4/src/tools/msmetadata/msmetadata_cmpt.cc, line: 2458
01-Oct-2026 09:50:41 test_tool_msmetadata.py::msmetadata_test::test_corrtypesforpol
01-Oct-2026 09:50:41 Test msmetadata.corrtypesforpol()
01-Oct-2026 09:50:41 PASSED
01-Oct-2026 09:50:41
01-Oct-2026 09:50:41 2026-10-01 13:50:41        INFO        msmetadata_cmpt.cc::open        Performing internal consistency checks on /opt/casa/data/casatestdata/unittest/msmetadata/MSMetaData.ms...
01-Oct-2026 09:50:41 test_tool_msmetadata.py::msmetadata_test::test_datadescids
01-Oct-2026 09:50:41 Test datadescids()
01-Oct-2026 09:50:41 PASSED
01-Oct-2026 09:50:41
01-Oct-2026 09:50:41 2026-10-01 13:50:41        INFO        msmetadata_cmpt.cc::open        Performing internal consistency checks on /opt/casa/data/casatestdata/unittest/msmetadata/MSMetaData.ms...
01-Oct-2026 09:50:41 2026-10-01 13:50:41        SEVERE        msmetadata_cmpt.cc::exposuretime        Exception Reported: Exception: MS has no data description ID for spectral window ID 0 and polarization ID 0.
01-Oct-2026 09:50:41 2026-10-01 13:50:41        SEVERE        msmetadata_cmpt.cc::exposuretime+        ... thrown by record *casac::msmetadata::exposuretime(long, long, long, long, long) at File: /private/var/folders/60/83wxljbx2vlfbx_hy0yfv8rc0000gn/T/build-via-sdist-3dumqb1j/casatools-6.7.7.7a14849.dev4/src/tools/msmetadata/msmetadata_cmpt.cc, line: 821
01-Oct-2026 09:50:41 2026-10-01 13:50:41        INFO        MSMetaData::_computeScanAndSubScanProperties         Computing scan and subscan properties...
01-Oct-2026 09:50:41 test_tool_msmetadata.py::msmetadata_test::test_exposuretime
01-Oct-2026 09:50:41 Test exposuretime()
01-Oct-2026 09:50:41 PASSED
01-Oct-2026 09:50:41
01-Oct-2026 09:50:41 2026-10-01 13:50:41        INFO        msmetadata_cmpt.cc::open        Performing internal consistency checks on /opt/casa/data/casatestdata/unittest/msmetadata/MSMetaData.ms...
01-Oct-2026 09:50:41 test_tool_msmetadata.py::msmetadata_test::test_fdmspws
01-Oct-2026 09:50:41 Test fdmspws()
01-Oct-2026 09:50:41 PASSED
01-Oct-2026 09:50:41
01-Oct-2026 09:50:41 2026-10-01 13:50:41        INFO        msmetadata_cmpt.cc::open        Performing internal consistency checks on /opt/casa/data/casatestdata/unittest/msmetadata/MSMetaData.ms...
01-Oct-2026 09:50:41 test_tool_msmetadata.py::msmetadata_test::test_fieldnames
01-Oct-2026 09:50:41 PASSED
01-Oct-2026 09:50:41
01-Oct-2026 09:50:41 2026-10-01 13:50:41        INFO        msmetadata_cmpt.cc::open        Performing internal consistency checks on /opt/casa/data/casatestdata/unittest/msmetadata/MSMetaData.ms...
01-Oct-2026 09:50:41 test_tool_msmetadata.py::msmetadata_test::test_fieldsforintent
01-Oct-2026 09:50:41 Test fieldsforintent()
01-Oct-2026 09:50:41 PASSED
01-Oct-2026 09:50:41
01-Oct-2026 09:50:41 2026-10-01 13:50:41        INFO        msmetadata_cmpt.cc::open        Performing internal consistency checks on /opt/casa/data/casatestdata/unittest/msmetadata/MSMetaData.ms...
01-Oct-2026 09:50:41 test_tool_msmetadata.py::msmetadata_test::test_fieldsforname
01-Oct-2026 09:50:41 Test fieldforname()
01-Oct-2026 09:50:41 PASSED
01-Oct-2026 09:50:41
01-Oct-2026 09:50:41 2026-10-01 13:50:41        INFO        msmetadata_cmpt.cc::open        Performing internal consistency checks on /opt/casa/data/casatestdata/unittest/msmetadata/MSMetaData.ms...
01-Oct-2026 09:50:41 2026-10-01 13:50:41        INFO        MSMetaData::_computeScanAndSubScanProperties         Computing scan and subscan properties...
01-Oct-2026 09:50:41 2026-10-01 13:50:41        SEVERE        msmetadata_cmpt.cc::fieldsforscans        Exception Reported: Exception: When asmap is true, both obsid and arrayid must be nonnegative.
01-Oct-2026 09:50:41 2026-10-01 13:50:41        SEVERE        msmetadata_cmpt.cc::fieldsforscans+        ... thrown by variant *casac::msmetadata::fieldsforscans(const vector<long> &, const bool, long, long, bool) at File: /private/var/folders/60/83wxljbx2vlfbx_hy0yfv8rc0000gn/T/build-via-sdist-3dumqb1j/casatools-6.7.7.7a14849.dev4/src/tools/msmetadata/msmetadata_cmpt.cc, line: 947
01-Oct-2026 09:50:41 test_tool_msmetadata.py::msmetadata_test::test_fieldsforscan
01-Oct-2026 09:50:41 Test fieldsforscan() and fieldsforscans()
01-Oct-2026 09:50:41 PASSED
01-Oct-2026 09:50:41
01-Oct-2026 09:50:41 2026-10-01 13:50:41        INFO        msmetadata_cmpt.cc::open        Performing internal consistency checks on /opt/casa/data/casatestdata/unittest/msmetadata/MSMetaData.ms...
01-Oct-2026 09:50:41 test_tool_msmetadata.py::msmetadata_test::test_fieldsforsource
01-Oct-2026 09:50:41 Test fieldsforsource() and fieldsforsources()
01-Oct-2026 09:50:41 PASSED
01-Oct-2026 09:50:41
01-Oct-2026 09:50:41 2026-10-01 13:50:41        INFO        msmetadata_cmpt.cc::open        Performing internal consistency checks on /opt/casa/data/casatestdata/unittest/msmetadata/MSMetaData.ms...
01-Oct-2026 09:50:41 2026-10-01 13:50:41        INFO        MSMetaData::_computeScanAndSubScanProperties         Computing scan and subscan properties...
01-Oct-2026 09:50:41 test_tool_msmetadata.py::msmetadata_test::test_fieldsforspw
01-Oct-2026 09:50:41 Test fieldsforspw()
01-Oct-2026 09:50:41 PASSED
01-Oct-2026 09:50:41
01-Oct-2026 09:50:41 2026-10-01 13:50:41        INFO        msmetadata_cmpt.cc::open        Performing internal consistency checks on /opt/casa/data/casatestdata/unittest/msmetadata/MSMetaData.ms...
01-Oct-2026 09:50:41 test_tool_msmetadata.py::msmetadata_test::test_fieldsfortimes
01-Oct-2026 09:50:41 Test fieldsfortimes()
01-Oct-2026 09:50:41 PASSED
01-Oct-2026 09:50:41
01-Oct-2026 09:50:41 2026-10-01 13:50:41        INFO        msmetadata_cmpt.cc::open        Performing internal consistency checks on /opt/casa/data/casatestdata/unittest/msmetadata/MSMetaData.ms...
01-Oct-2026 09:50:41 test_tool_msmetadata.py::msmetadata_test::test_intents
01-Oct-2026 09:50:41 Test intents()
01-Oct-2026 09:50:41 PASSED
01-Oct-2026 09:50:41
01-Oct-2026 09:50:41 2026-10-01 13:50:41        INFO        msmetadata_cmpt.cc::open        Performing internal consistency checks on /opt/casa/data/casatestdata/unittest/msmetadata/MSMetaData.ms...
01-Oct-2026 09:50:41 test_tool_msmetadata.py::msmetadata_test::test_intentsforfield
01-Oct-2026 09:50:41 Test intentsforfield()
01-Oct-2026 09:50:41 PASSED
01-Oct-2026 09:50:41
01-Oct-2026 09:50:41 2026-10-01 13:50:41        INFO        msmetadata_cmpt.cc::open        Performing internal consistency checks on /opt/casa/data/casatestdata/unittest/msmetadata/MSMetaData.ms...
01-Oct-2026 09:50:41 2026-10-01 13:50:41        INFO        MSMetaData::_computeScanAndSubScanProperties         Computing scan and subscan properties...
01-Oct-2026 09:50:41 test_tool_msmetadata.py::msmetadata_test::test_intentsforscan
01-Oct-2026 09:50:41 Test intentsforscan()
01-Oct-2026 09:50:41 PASSED
01-Oct-2026 09:50:41
01-Oct-2026 09:50:41 2026-10-01 13:50:41        INFO        msmetadata_cmpt.cc::open        Performing internal consistency checks on /opt/casa/data/casatestdata/unittest/msmetadata/MSMetaData.ms...
01-Oct-2026 09:50:41 test_tool_msmetadata.py::msmetadata_test::test_intentsforspw
01-Oct-2026 09:50:41 Test intentsforspw()
01-Oct-2026 09:50:41 PASSED
01-Oct-2026 09:50:41
01-Oct-2026 09:50:41 2026-10-01 13:50:41        INFO        msmetadata_cmpt.cc::open        Performing internal consistency checks on /opt/casa/data/casatestdata/unittest/msmetadata/MSMetaData.ms...
01-Oct-2026 09:50:41 test_tool_msmetadata.py::msmetadata_test::test_name
01-Oct-2026 09:50:41 Test name(), CAS-6817
01-Oct-2026 09:50:41 PASSED
01-Oct-2026 09:50:41
01-Oct-2026 09:50:41 2026-10-01 13:50:41        INFO        msmetadata_cmpt.cc::open        Performing internal consistency checks on /opt/casa/data/casatestdata/unittest/msmetadata/MSMetaData.ms...
01-Oct-2026 09:50:41 test_tool_msmetadata.py::msmetadata_test::test_namesforfields
01-Oct-2026 09:50:41 Test namesforfields()
01-Oct-2026 09:50:41 PASSED
01-Oct-2026 09:50:41
01-Oct-2026 09:50:41 2026-10-01 13:50:41        INFO        msmetadata_cmpt.cc::open        Performing internal consistency checks on /opt/casa/data/casatestdata/unittest/msmetadata/MSMetaData.ms...
01-Oct-2026 09:50:41 2026-10-01 13:50:41        SEVERE        msmetadata_cmpt.cc::namesforspws        Exception Reported: Exception: Spectral window ID must be nonnegative..
01-Oct-2026 09:50:41 2026-10-01 13:50:41        SEVERE        msmetadata_cmpt.cc::namesforspws+        ... thrown by vector<string> casac::msmetadata::namesforspws(const variant &) at File: /private/var/folders/60/83wxljbx2vlfbx_hy0yfv8rc0000gn/T/build-via-sdist-3dumqb1j/casatools-6.7.7.7a14849.dev4/src/tools/msmetadata/msmetadata_cmpt.cc, line: 1171
01-Oct-2026 09:50:41 2026-10-01 13:50:41        SEVERE        msmetadata_cmpt.cc::namesforspws        Exception Reported: Exception: All spectral window IDs must be nonnegative..
01-Oct-2026 09:50:41 2026-10-01 13:50:41        SEVERE        msmetadata_cmpt.cc::namesforspws+        ... thrown by vector<string> casac::msmetadata::namesforspws(const variant &) at File: /private/var/folders/60/83wxljbx2vlfbx_hy0yfv8rc0000gn/T/build-via-sdist-3dumqb1j/casatools-6.7.7.7a14849.dev4/src/tools/msmetadata/msmetadata_cmpt.cc, line: 1184
01-Oct-2026 09:50:41 2026-10-01 13:50:41        SEVERE        msmetadata_cmpt.cc::namesforspws        Exception Reported: Exception: Spectral window ID must be less than total number of spws.
01-Oct-2026 09:50:41 2026-10-01 13:50:41        SEVERE        msmetadata_cmpt.cc::namesforspws+        ... thrown by vector<string> casac::msmetadata::namesforspws(const variant &) at File: /private/var/folders/60/83wxljbx2vlfbx_hy0yfv8rc0000gn/T/build-via-sdist-3dumqb1j/casatools-6.7.7.7a14849.dev4/src/tools/msmetadata/msmetadata_cmpt.cc, line: 1175
01-Oct-2026 09:50:41 2026-10-01 13:50:41        SEVERE        msmetadata_cmpt.cc::namesforspws        Exception Reported: Exception: All spectral window IDs must be less than the total number of spws.
01-Oct-2026 09:50:41 2026-10-01 13:50:41        SEVERE        msmetadata_cmpt.cc::namesforspws+        ... thrown by vector<string> casac::msmetadata::namesforspws(const variant &) at File: /private/var/folders/60/83wxljbx2vlfbx_hy0yfv8rc0000gn/T/build-via-sdist-3dumqb1j/casatools-6.7.7.7a14849.dev4/src/tools/msmetadata/msmetadata_cmpt.cc, line: 1189
01-Oct-2026 09:50:41 test_tool_msmetadata.py::msmetadata_test::test_namesforspws
01-Oct-2026 09:50:41 Test namesforspws()
01-Oct-2026 09:50:41 PASSED
01-Oct-2026 09:50:41
01-Oct-2026 09:50:41 2026-10-01 13:50:41        INFO        msmetadata_cmpt.cc::open        Performing internal consistency checks on /opt/casa/data/casatestdata/unittest/msmetadata/MSMetaData.ms...
01-Oct-2026 09:50:41 test_tool_msmetadata.py::msmetadata_test::test_nantennas
01-Oct-2026 09:50:41 Test nantennas()
01-Oct-2026 09:50:41 PASSED
01-Oct-2026 09:50:41
01-Oct-2026 09:50:41 2026-10-01 13:50:41        INFO        msmetadata_cmpt.cc::open        Performing internal consistency checks on /opt/casa/data/casatestdata/unittest/msmetadata/MSMetaData.ms...
01-Oct-2026 09:50:41 test_tool_msmetadata.py::msmetadata_test::test_narrays
01-Oct-2026 09:50:41 Test narrays()
01-Oct-2026 09:50:41 PASSED
01-Oct-2026 09:50:41
01-Oct-2026 09:50:41 2026-10-01 13:50:41        INFO        msmetadata_cmpt.cc::open        Performing internal consistency checks on /opt/casa/data/casatestdata/unittest/msmetadata/MSMetaData.ms...
01-Oct-2026 09:50:41 test_tool_msmetadata.py::msmetadata_test::test_nbaselines
01-Oct-2026 09:50:41 Verify nbaselines()
01-Oct-2026 09:50:41 PASSED
01-Oct-2026 09:50:41
01-Oct-2026 09:50:41 2026-10-01 13:50:41        INFO        msmetadata_cmpt.cc::open        Performing internal consistency checks on /opt/casa/data/casatestdata/unittest/msmetadata/MSMetaData.ms...
01-Oct-2026 09:50:41 test_tool_msmetadata.py::msmetadata_test::test_ncorrforpol
01-Oct-2026 09:50:41 Test msmetadata.ncorrforpol()
01-Oct-2026 09:50:41 PASSED
01-Oct-2026 09:50:41
01-Oct-2026 09:50:41 2026-10-01 13:50:41        INFO        msmetadata_cmpt.cc::open        Performing internal consistency checks on /opt/casa/data/casatestdata/unittest/msmetadata/MSMetaData.ms...
01-Oct-2026 09:50:41 test_tool_msmetadata.py::msmetadata_test::test_nfields
01-Oct-2026 09:50:41 Test nfields()
01-Oct-2026 09:50:41 PASSED
01-Oct-2026 09:50:41
01-Oct-2026 09:50:41 2026-10-01 13:50:41        INFO        msmetadata_cmpt.cc::open        Performing internal consistency checks on /opt/casa/data/casatestdata/unittest/msmetadata/MSMetaData.ms...
01-Oct-2026 09:50:41 test_tool_msmetadata.py::msmetadata_test::test_nobservations
01-Oct-2026 09:50:41 Test nobservations()
01-Oct-2026 09:50:41 PASSED
01-Oct-2026 09:50:41
01-Oct-2026 09:50:41 2026-10-01 13:50:41        INFO        msmetadata_cmpt.cc::open        Performing internal consistency checks on /opt/casa/data/casatestdata/unittest/msmetadata/MSMetaData.ms...
01-Oct-2026 09:50:41 2026-10-01 13:50:41        INFO        MSMetaData::_computeScanAndSubScanProperties         Computing scan and subscan properties...
01-Oct-2026 09:50:41 test_tool_msmetadata.py::msmetadata_test::test_nscans
01-Oct-2026 09:50:41 Test nscans()
01-Oct-2026 09:50:41 PASSED
01-Oct-2026 09:50:41
01-Oct-2026 09:50:41 2026-10-01 13:50:41        INFO        msmetadata_cmpt.cc::open        Performing internal consistency checks on /opt/casa/data/casatestdata/unittest/msmetadata/MSMetaData.ms...
01-Oct-2026 09:50:41 test_tool_msmetadata.py::msmetadata_test::test_nsources
01-Oct-2026 09:50:41 PASSED
01-Oct-2026 09:50:41
01-Oct-2026 09:50:41 2026-10-01 13:50:41        INFO        msmetadata_cmpt.cc::open        Performing internal consistency checks on /opt/casa/data/casatestdata/unittest/msmetadata/MSMetaData.ms...
01-Oct-2026 09:50:41 test_tool_msmetadata.py::msmetadata_test::test_nspw
01-Oct-2026 09:50:41 Test nspw()
01-Oct-2026 09:50:41 PASSED
01-Oct-2026 09:50:41
01-Oct-2026 09:50:41 2026-10-01 13:50:41        INFO        msmetadata_cmpt.cc::open        Performing internal consistency checks on /opt/casa/data/casatestdata/unittest/msmetadata/MSMetaData.ms...
01-Oct-2026 09:50:41 test_tool_msmetadata.py::msmetadata_test::test_nstates
01-Oct-2026 09:50:41 Test nstates()
01-Oct-2026 09:50:41 PASSED
01-Oct-2026 09:50:41
01-Oct-2026 09:50:41 2026-10-01 13:50:41        INFO        msmetadata_cmpt.cc::open        Performing internal consistency checks on /opt/casa/data/casatestdata/unittest/msmetadata/MSMetaData.ms...
01-Oct-2026 09:50:41 test_tool_msmetadata.py::msmetadata_test::test_nvis
01-Oct-2026 09:50:41 Test nvis()
01-Oct-2026 09:50:41 PASSED
01-Oct-2026 09:50:41
01-Oct-2026 09:50:41 2026-10-01 13:50:41        INFO        msmetadata_cmpt.cc::open        Performing internal consistency checks on /opt/casa/data/casatestdata/unittest/msmetadata/MSMetaData.ms...
01-Oct-2026 09:50:41 test_tool_msmetadata.py::msmetadata_test::test_observers
01-Oct-2026 09:50:41 Test msmetadata.observers()
01-Oct-2026 09:50:41 PASSED
01-Oct-2026 09:50:41
01-Oct-2026 09:50:41 2026-10-01 13:50:41        INFO        msmetadata_cmpt.cc::open        Performing internal consistency checks on /opt/casa/data/casatestdata/unittest/msmetadata/MSMetaData.ms...
01-Oct-2026 09:50:41 test_tool_msmetadata.py::msmetadata_test::test_pointingdirection
01-Oct-2026 09:50:41 Test pointingdirection(), CAS-5878
01-Oct-2026 09:50:41 PASSED
01-Oct-2026 09:50:41
01-Oct-2026 09:50:41 2026-10-01 13:50:41        INFO        msmetadata_cmpt.cc::open        Performing internal consistency checks on /opt/casa/data/casatestdata/unittest/msmetadata/MSMetaData.ms...
01-Oct-2026 09:50:41 test_tool_msmetadata.py::msmetadata_test::test_polidfordatadesc
01-Oct-2026 09:50:41 Test msmetadata.polidfordatadesc()
01-Oct-2026 09:50:41 PASSED
01-Oct-2026 09:50:41
01-Oct-2026 09:50:41 2026-10-01 13:50:41        INFO        msmetadata_cmpt.cc::open        Performing internal consistency checks on /opt/casa/data/casatestdata/unittest/msmetadata/MSMetaData.ms...
01-Oct-2026 09:50:41 test_tool_msmetadata.py::msmetadata_test::test_projects
01-Oct-2026 09:50:41 Test msmetadata.projects()
01-Oct-2026 09:50:41 PASSED
01-Oct-2026 09:50:41
01-Oct-2026 09:50:41 2026-10-01 13:50:41        INFO        msmetadata_cmpt.cc::open        Performing internal consistency checks on /opt/casa/data/casatestdata/unittest/msmetadata/MSMetaData.ms...
01-Oct-2026 09:50:41 test_tool_msmetadata.py::msmetadata_test::test_propermotions
01-Oct-2026 09:50:41 Test msmetadata.propermotions()
01-Oct-2026 09:50:41 PASSED
01-Oct-2026 09:50:41
01-Oct-2026 09:50:41 2026-10-01 13:50:41        INFO        msmetadata_cmpt.cc::open        Performing internal consistency checks on /opt/casa/data/casatestdata/unittest/msmetadata/MSMetaData.ms...
01-Oct-2026 09:50:41 test_tool_msmetadata.py::msmetadata_test::test_refdir
01-Oct-2026 09:50:41 Test msmetadata.refdir()
01-Oct-2026 09:50:41 PASSED
01-Oct-2026 09:50:41
01-Oct-2026 09:50:41 2026-10-01 13:50:41        INFO        msmetadata_cmpt.cc::open        Performing internal consistency checks on /opt/casa/data/casatestdata/unittest/msmetadata/MSMetaData.ms...
01-Oct-2026 09:50:41 test_tool_msmetadata.py::msmetadata_test::test_reffreq
01-Oct-2026 09:50:41 Test msmetadata.reffreq
01-Oct-2026 09:50:41 PASSED
01-Oct-2026 09:50:41
01-Oct-2026 09:50:41 2026-10-01 13:50:41        INFO        msmetadata_cmpt.cc::open        Performing internal consistency checks on /opt/casa/data/casatestdata/unittest/msmetadata/MSMetaData.ms...
01-Oct-2026 09:50:41 2026-10-01 13:50:41        SEVERE        msmetadata_cmpt.cc::restfreqs        Exception Reported: Exception: sourceid cannot be negative.
01-Oct-2026 09:50:41 2026-10-01 13:50:41        SEVERE        msmetadata_cmpt.cc::restfreqs+        ... thrown by variant *casac::msmetadata::restfreqs(long, long) at File: /private/var/folders/60/83wxljbx2vlfbx_hy0yfv8rc0000gn/T/build-via-sdist-3dumqb1j/casatools-6.7.7.7a14849.dev4/src/tools/msmetadata/msmetadata_cmpt.cc, line: 1521
01-Oct-2026 09:50:41 2026-10-01 13:50:41        SEVERE        msmetadata_cmpt.cc::restfreqs        Exception Reported: Exception: Spectral window ID -1 out of range, must be nonnegative and less than or equal to 39.
01-Oct-2026 09:50:41 2026-10-01 13:50:41        SEVERE        msmetadata_cmpt.cc::restfreqs+        ... thrown by void casac::msmetadata::_checkSpwId(int, bool) const at File: /private/var/folders/60/83wxljbx2vlfbx_hy0yfv8rc0000gn/T/build-via-sdist-3dumqb1j/casatools-6.7.7.7a14849.dev4/src/tools/msmetadata/msmetadata_cmpt.cc, line: 2449
01-Oct-2026 09:50:41 2026-10-01 13:50:41        SEVERE        msmetadata_cmpt.cc::restfreqs        Exception Reported: Exception: SOURCE table does not contain a row with SOURCE_ID=50 and SPECTRAL_WINDOW_ID=0.
01-Oct-2026 09:50:41 2026-10-01 13:50:41        SEVERE        msmetadata_cmpt.cc::restfreqs+        ... thrown by variant *casac::msmetadata::restfreqs(long, long) at File: /private/var/folders/60/83wxljbx2vlfbx_hy0yfv8rc0000gn/T/build-via-sdist-3dumqb1j/casatools-6.7.7.7a14849.dev4/src/tools/msmetadata/msmetadata_cmpt.cc, line: 1531
01-Oct-2026 09:50:41 2026-10-01 13:50:41        SEVERE        msmetadata_cmpt.cc::restfreqs        Exception Reported: Exception: Spectral window ID 50 out of range, must be nonnegative and less than or equal to 39.
01-Oct-2026 09:50:41 2026-10-01 13:50:41        SEVERE        msmetadata_cmpt.cc::restfreqs+        ... thrown by void casac::msmetadata::_checkSpwId(int, bool) const at File: /private/var/folders/60/83wxljbx2vlfbx_hy0yfv8rc0000gn/T/build-via-sdist-3dumqb1j/casatools-6.7.7.7a14849.dev4/src/tools/msmetadata/msmetadata_cmpt.cc, line: 2449
01-Oct-2026 09:50:41 test_tool_msmetadata.py::msmetadata_test::test_restfreqs
01-Oct-2026 09:50:41 Test restfreqs()
01-Oct-2026 09:50:41 PASSED
01-Oct-2026 09:50:41
01-Oct-2026 09:50:41 2026-10-01 13:50:41        INFO        msmetadata_cmpt.cc::open        Performing internal consistency checks on /opt/casa/data/casatestdata/unittest/msmetadata/MSMetaData.ms...
01-Oct-2026 09:50:41 2026-10-01 13:50:42        INFO        msmetadata_cmpt.cc::open        Performing internal consistency checks on /opt/casa/data/casatestdata/unittest/msmetadata/uid___A002_Xa1f062_X37e3.ms...
01-Oct-2026 09:50:41 2026-10-01 13:50:42        INFO        msmetadata_cmpt.cc::open        Performing internal consistency checks on /opt/casa/data/casatestdata/unittest/msmetadata/uid___A002_X7b13df_X68f.ms...
01-Oct-2026 09:50:41 test_tool_msmetadata.py::msmetadata_test::test_rxbands
01-Oct-2026 09:50:41 CAS-13973 test rxbands() method
01-Oct-2026 09:50:41 PASSED
01-Oct-2026 09:50:41
01-Oct-2026 09:50:41 2026-10-01 13:50:42        INFO        msmetadata_cmpt.cc::open        Performing internal consistency checks on /opt/casa/data/casatestdata/unittest/msmetadata/MSMetaData.ms...
01-Oct-2026 09:50:41 2026-10-01 13:50:42        INFO        MSMetaData::_computeScanAndSubScanProperties         Computing scan and subscan properties...
01-Oct-2026 09:50:41 test_tool_msmetadata.py::msmetadata_test::test_scannumbers
01-Oct-2026 09:50:41 Test scannumbers()
01-Oct-2026 09:50:41 PASSED
01-Oct-2026 09:50:41
01-Oct-2026 09:50:41 2026-10-01 13:50:42        INFO        msmetadata_cmpt.cc::open        Performing internal consistency checks on /opt/casa/data/casatestdata/unittest/msmetadata/MSMetaData.ms...
01-Oct-2026 09:50:41 2026-10-01 13:50:42        INFO        MSMetaData::_computeScanAndSubScanProperties         Computing scan and subscan properties...
01-Oct-2026 09:50:41 test_tool_msmetadata.py::msmetadata_test::test_scansforfield
01-Oct-2026 09:50:41 Test scansforfield() and scansforfields()
01-Oct-2026 09:50:41 PASSED
01-Oct-2026 09:50:41
01-Oct-2026 09:50:41 2026-10-01 13:50:42        INFO        msmetadata_cmpt.cc::open        Performing internal consistency checks on /opt/casa/data/casatestdata/unittest/msmetadata/MSMetaData.ms...
01-Oct-2026 09:50:41 2026-10-01 13:50:42        INFO        MSMetaData::_computeScanAndSubScanProperties         Computing scan and subscan properties...
01-Oct-2026 09:50:41 test_tool_msmetadata.py::msmetadata_test::test_scansforintent
01-Oct-2026 09:50:41 Test scansforintent()
01-Oct-2026 09:50:41 PASSED
01-Oct-2026 09:50:41
01-Oct-2026 09:50:41 2026-10-01 13:50:42        INFO        msmetadata_cmpt.cc::open        Performing internal consistency checks on /opt/casa/data/casatestdata/unittest/msmetadata/MSMetaData.ms...
01-Oct-2026 09:50:41 2026-10-01 13:50:42        INFO        MSMetaData::_computeScanAndSubScanProperties         Computing scan and subscan properties...
01-Oct-2026 09:50:41 test_tool_msmetadata.py::msmetadata_test::test_scansforspw
01-Oct-2026 09:50:41 Test scansforspw() and scansforspws()
01-Oct-2026 09:50:41 PASSED
01-Oct-2026 09:50:41
01-Oct-2026 09:50:41 2026-10-01 13:50:42        INFO        msmetadata_cmpt.cc::open        Performing internal consistency checks on /opt/casa/data/casatestdata/unittest/msmetadata/MSMetaData.ms...
01-Oct-2026 09:50:41 2026-10-01 13:50:42        INFO        MSMetaData::_computeScanAndSubScanProperties         Computing scan and subscan properties...
01-Oct-2026 09:50:41 test_tool_msmetadata.py::msmetadata_test::test_scansforstate
01-Oct-2026 09:50:41 Test scansforstate()
01-Oct-2026 09:50:41 PASSED
01-Oct-2026 09:50:41
01-Oct-2026 09:50:41 2026-10-01 13:50:42        INFO        msmetadata_cmpt.cc::open        Performing internal consistency checks on /opt/casa/data/casatestdata/unittest/msmetadata/MSMetaData.ms...
01-Oct-2026 09:50:41 2026-10-01 13:50:42        INFO        MSMetaData::_computeScanAndSubScanProperties         Computing scan and subscan properties...
01-Oct-2026 09:50:41 test_tool_msmetadata.py::msmetadata_test::test_scansfortimes
01-Oct-2026 09:50:41 Test scansfortimes()
01-Oct-2026 09:50:41 PASSED
01-Oct-2026 09:50:41
01-Oct-2026 09:50:41 2026-10-01 13:50:42        INFO        msmetadata_cmpt.cc::open        Performing internal consistency checks on /opt/casa/data/casatestdata/unittest/msmetadata/MSMetaData.ms...
01-Oct-2026 09:50:41 test_tool_msmetadata.py::msmetadata_test::test_schedule
01-Oct-2026 09:50:41 Test msmetadata.schedule()
01-Oct-2026 09:50:41 PASSED
01-Oct-2026 09:50:41
01-Oct-2026 09:50:41 2026-10-01 13:50:42        INFO        msmetadata_cmpt.cc::open        Performing internal consistency checks on /opt/casa/data/casatestdata/unittest/msmetadata/MSMetaData.ms...
01-Oct-2026 09:50:41 test_tool_msmetadata.py::msmetadata_test::test_sideband
01-Oct-2026 09:50:41 PASSED
01-Oct-2026 09:50:41
01-Oct-2026 09:50:41 2026-10-01 13:50:42        INFO        msmetadata_cmpt.cc::open        Performing internal consistency checks on /opt/casa/data/casatestdata/unittest/msmetadata/MSMetaData.ms...
01-Oct-2026 09:50:41 test_tool_msmetadata.py::msmetadata_test::test_sourcedirs
01-Oct-2026 09:50:41 Test msmetadata.sourcedirs()
01-Oct-2026 09:50:41 PASSED
01-Oct-2026 09:50:41
01-Oct-2026 09:50:41 2026-10-01 13:50:42        INFO        msmetadata_cmpt.cc::open        Performing internal consistency checks on /opt/casa/data/casatestdata/unittest/msmetadata/MSMetaData.ms...
01-Oct-2026 09:50:41 2026-10-01 13:50:42        SEVERE        msmetadata_cmpt.cc::sourceidforfield        Exception Reported: Exception: Antenna ID -1 out of range, must be less than 6.
01-Oct-2026 09:50:41 2026-10-01 13:50:42        SEVERE        msmetadata_cmpt.cc::sourceidforfield+        ... thrown by void casac::msmetadata::_checkFieldId(int, bool) const at File: /private/var/folders/60/83wxljbx2vlfbx_hy0yfv8rc0000gn/T/build-via-sdist-3dumqb1j/casatools-6.7.7.7a14849.dev4/src/tools/msmetadata/msmetadata_cmpt.cc, line: 2430
01-Oct-2026 09:50:41 2026-10-01 13:50:42        SEVERE        msmetadata_cmpt.cc::sourceidforfield        Exception Reported: Exception: Antenna ID 6 out of range, must be less than 6.
01-Oct-2026 09:50:41 2026-10-01 13:50:42        SEVERE        msmetadata_cmpt.cc::sourceidforfield+        ... thrown by void casac::msmetadata::_checkFieldId(int, bool) const at File: /private/var/folders/60/83wxljbx2vlfbx_hy0yfv8rc0000gn/T/build-via-sdist-3dumqb1j/casatools-6.7.7.7a14849.dev4/src/tools/msmetadata/msmetadata_cmpt.cc, line: 2430
01-Oct-2026 09:50:41 test_tool_msmetadata.py::msmetadata_test::test_sourceidforfield
01-Oct-2026 09:50:41 Test msmetadata.sourceidforfield()
01-Oct-2026 09:50:41 PASSED
01-Oct-2026 09:50:41
01-Oct-2026 09:50:41 2026-10-01 13:50:42        INFO        msmetadata_cmpt.cc::open        Performing internal consistency checks on /opt/casa/data/casatestdata/unittest/msmetadata/MSMetaData.ms...
01-Oct-2026 09:50:41 test_tool_msmetadata.py::msmetadata_test::test_sourceidsfromsourcetable
01-Oct-2026 09:50:41 Test msmetadata.sourceidsfromsourcetable()
01-Oct-2026 09:50:41 PASSED
01-Oct-2026 09:50:41
01-Oct-2026 09:50:41 2026-10-01 13:50:42        INFO        msmetadata_cmpt.cc::open        Performing internal consistency checks on /opt/casa/data/casatestdata/unittest/msmetadata/MSMetaData.ms...
01-Oct-2026 09:50:41 test_tool_msmetadata.py::msmetadata_test::test_sourcenames
01-Oct-2026 09:50:41 Test msmetadata.sourcenames()
01-Oct-2026 09:50:41 PASSED
01-Oct-2026 09:50:41
01-Oct-2026 09:50:41 2026-10-01 13:50:42        INFO        msmetadata_cmpt.cc::open        Performing internal consistency checks on /opt/casa/data/casatestdata/unittest/msmetadata/MSMetaData.ms...
01-Oct-2026 09:50:41 test_tool_msmetadata.py::msmetadata_test::test_spwfordatadesc
01-Oct-2026 09:50:41 Test msmetadata.spwfordatadesc()
01-Oct-2026 09:50:41 PASSED
01-Oct-2026 09:50:41
01-Oct-2026 09:50:41 2026-10-01 13:50:42        INFO        msmetadata_cmpt.cc::open        Performing internal consistency checks on /opt/casa/data/casatestdata/unittest/msmetadata/MSMetaData.ms...
01-Oct-2026 09:50:41 test_tool_msmetadata.py::msmetadata_test::test_spwsforbasebands
01-Oct-2026 09:50:41 Test spwsforbasebands()
01-Oct-2026 09:50:41 PASSED
01-Oct-2026 09:50:41
01-Oct-2026 09:50:41 2026-10-01 13:50:42        INFO        msmetadata_cmpt.cc::open        Performing internal consistency checks on /opt/casa/data/casatestdata/unittest/msmetadata/MSMetaData.ms...
01-Oct-2026 09:50:41 2026-10-01 13:50:42        INFO        MSMetaData::_computeScanAndSubScanProperties         Computing scan and subscan properties...
01-Oct-2026 09:50:41 test_tool_msmetadata.py::msmetadata_test::test_spwsforfield
01-Oct-2026 09:50:41 Test spwsforfield() and spwsforfields()
01-Oct-2026 09:50:41 PASSED
01-Oct-2026 09:50:41
01-Oct-2026 09:50:41 2026-10-01 13:50:42        INFO        msmetadata_cmpt.cc::open        Performing internal consistency checks on /opt/casa/data/casatestdata/unittest/msmetadata/MSMetaData.ms...
01-Oct-2026 09:50:41 test_tool_msmetadata.py::msmetadata_test::test_spwsforintent
01-Oct-2026 09:50:41 Test spwsforintent()
01-Oct-2026 09:50:41 PASSED
01-Oct-2026 09:50:41
01-Oct-2026 09:50:41 2026-10-01 13:50:42        INFO        msmetadata_cmpt.cc::open        Performing internal consistency checks on /opt/casa/data/casatestdata/unittest/msmetadata/MSMetaData.ms...
01-Oct-2026 09:50:41 2026-10-01 13:50:42        WARN        msmetadata_cmpt.cc::spwsfornames        Specified spw named blah is not present in MS
01-Oct-2026 09:50:41 test_tool_msmetadata.py::msmetadata_test::test_spwsfornames
01-Oct-2026 09:50:41 Test spwsfornames()
01-Oct-2026 09:50:41 PASSED
01-Oct-2026 09:50:41
01-Oct-2026 09:50:41 2026-10-01 13:50:42        INFO        msmetadata_cmpt.cc::open        Performing internal consistency checks on /opt/casa/data/casatestdata/unittest/msmetadata/MSMetaData.ms...
01-Oct-2026 09:50:41 2026-10-01 13:50:42        INFO        MSMetaData::_computeScanAndSubScanProperties         Computing scan and subscan properties...
01-Oct-2026 09:50:41 test_tool_msmetadata.py::msmetadata_test::test_spwsforscan
01-Oct-2026 09:50:41 Test spwsforscan() and spwsforscans()
01-Oct-2026 09:50:41 PASSED
01-Oct-2026 09:50:41
01-Oct-2026 09:50:41 2026-10-01 13:50:42        INFO        msmetadata_cmpt.cc::open        Performing internal consistency checks on /opt/casa/data/casatestdata/unittest/msmetadata/MSMetaData.ms...
01-Oct-2026 09:50:41 2026-10-01 13:50:42        INFO        MSMetaData::_computeScanAndSubScanProperties         Computing scan and subscan properties...
01-Oct-2026 09:50:41 test_tool_msmetadata.py::msmetadata_test::test_statesforscan
01-Oct-2026 09:50:41 Test statesforscan() and statesforscans()
01-Oct-2026 09:50:41 PASSED
01-Oct-2026 09:50:41
01-Oct-2026 09:50:41 2026-10-01 13:50:42        INFO        msmetadata_cmpt.cc::open        Performing internal consistency checks on /opt/casa/data/casatestdata/unittest/msmetadata/MSMetaData.ms...
01-Oct-2026 09:50:41 2026-10-01 13:50:42        INFO        msmetadata_cmpt.cc::open        Performing internal consistency checks on /opt/casa/data/casatestdata/unittest/msmetadata/uid___A002_Xa1f062_X37e3.ms...
01-Oct-2026 09:50:41 test_tool_msmetadata.py::msmetadata_test::test_subwindows
01-Oct-2026 09:50:41 CAS-13973 test subwindows() method
01-Oct-2026 09:50:41 PASSED
01-Oct-2026 09:50:41
01-Oct-2026 09:50:41 2026-10-01 13:50:42        INFO        msmetadata_cmpt.cc::open        Performing internal consistency checks on /opt/casa/data/casatestdata/unittest/msmetadata/MSMetaData.ms...
01-Oct-2026 09:50:41 2026-10-01 13:50:42        INFO        msmetadata_cmpt.cc::open        Performing internal consistency checks on /opt/casa/data/casatestdata/unittest/msmetadata/uid___A002_Xd7be9d_X4838-spw16-18-20-22.ms...
01-Oct-2026 09:50:41 test_tool_msmetadata.py::msmetadata_test::test_tdm_fdm
01-Oct-2026 09:50:41 Verify change to algorithm used for FDM and TDM windows CAS-13362
01-Oct-2026 09:50:41 PASSED
01-Oct-2026 09:50:41
01-Oct-2026 09:50:41 2026-10-01 13:50:42        INFO        msmetadata_cmpt.cc::open        Performing internal consistency checks on /opt/casa/data/casatestdata/unittest/msmetadata/MSMetaData.ms...
01-Oct-2026 09:50:41 test_tool_msmetadata.py::msmetadata_test::test_tdmspws
01-Oct-2026 09:50:41 Test tdmspws()
01-Oct-2026 09:50:41 PASSED
01-Oct-2026 09:50:41
01-Oct-2026 09:50:41 2026-10-01 13:50:42        INFO        msmetadata_cmpt.cc::open        Performing internal consistency checks on /opt/casa/data/casatestdata/unittest/msmetadata/MSMetaData.ms...
01-Oct-2026 09:50:41 test_tool_msmetadata.py::msmetadata_test::test_telescopenames
01-Oct-2026 09:50:41 Test observatorynames()
01-Oct-2026 09:50:41 PASSED
01-Oct-2026 09:50:41
01-Oct-2026 09:50:41 2026-10-01 13:50:42        INFO        msmetadata_cmpt.cc::open        Performing internal consistency checks on /opt/casa/data/casatestdata/unittest/msmetadata/MSMetaData.ms...
01-Oct-2026 09:50:41 test_tool_msmetadata.py::msmetadata_test::test_timerforobs
01-Oct-2026 09:50:41 Test msmetadata.timerforobs()
01-Oct-2026 09:50:41 PASSED
01-Oct-2026 09:50:41
01-Oct-2026 09:50:41 2026-10-01 13:50:42        INFO        msmetadata_cmpt.cc::open        Performing internal consistency checks on /opt/casa/data/casatestdata/unittest/msmetadata/MSMetaData.ms...
01-Oct-2026 09:50:41 test_tool_msmetadata.py::msmetadata_test::test_timesforfield
01-Oct-2026 09:50:41 Test timesforfield()
01-Oct-2026 09:50:41 PASSED
01-Oct-2026 09:50:41
01-Oct-2026 09:50:41 2026-10-01 13:50:42        INFO        msmetadata_cmpt.cc::open        Performing internal consistency checks on /opt/casa/data/casatestdata/unittest/msmetadata/MSMetaData.ms...
01-Oct-2026 09:50:41 test_tool_msmetadata.py::msmetadata_test::test_timesforintent
01-Oct-2026 09:50:41 Test timesforintent(), CAS-6919
01-Oct-2026 09:50:41 PASSED
01-Oct-2026 09:50:41
01-Oct-2026 09:50:41 2026-10-01 13:50:42        INFO        msmetadata_cmpt.cc::open        Performing internal consistency checks on /opt/casa/data/casatestdata/unittest/msmetadata/MSMetaData.ms...
01-Oct-2026 09:50:41 2026-10-01 13:50:42        INFO        MSMetaData::_computeScanAndSubScanProperties         Computing scan and subscan properties...
01-Oct-2026 09:50:41 test_tool_msmetadata.py::msmetadata_test::test_timesforscan
01-Oct-2026 09:50:41 Test timesforscan()
01-Oct-2026 09:50:41 PASSED
01-Oct-2026 09:50:41
01-Oct-2026 09:50:41 2026-10-01 13:50:42        INFO        msmetadata_cmpt.cc::open        Performing internal consistency checks on /opt/casa/data/casatestdata/unittest/msmetadata/MSMetaData.ms...
01-Oct-2026 09:50:41 2026-10-01 13:50:42        INFO        MSMetaData::_computeScanAndSubScanProperties         Computing scan and subscan properties...
01-Oct-2026 09:50:41 test_tool_msmetadata.py::msmetadata_test::test_timesforscans
01-Oct-2026 09:50:41 Test timesforscans()
01-Oct-2026 09:50:41 PASSED
01-Oct-2026 09:50:41
01-Oct-2026 09:50:41 2026-10-01 13:50:42        INFO        msmetadata_cmpt.cc::open        Performing internal consistency checks on /opt/casa/data/casatestdata/unittest/msmetadata/MSMetaData.ms...
01-Oct-2026 09:50:41 2026-10-01 13:50:42        INFO        MSMetaData::_computeScanAndSubScanProperties         Computing scan and subscan properties...
01-Oct-2026 09:50:41 test_tool_msmetadata.py::msmetadata_test::test_timesforspws
01-Oct-2026 09:50:41 Verify timesforspws()
01-Oct-2026 09:50:41 PASSED
01-Oct-2026 09:50:41
01-Oct-2026 09:50:41 2026-10-01 13:50:42        INFO        msmetadata_cmpt.cc::open        Performing internal consistency checks on /opt/casa/data/casatestdata/unittest/msmetadata/MSMetaData.ms...
01-Oct-2026 09:50:41 2026-10-01 13:50:42        SEVERE        msmetadata_cmpt.cc::transitions        Exception Reported: Exception: sourceid cannot be negative.
01-Oct-2026 09:50:41 2026-10-01 13:50:42        SEVERE        msmetadata_cmpt.cc::transitions+        ... thrown by variant *casac::msmetadata::transitions(long, long) at File: /private/var/folders/60/83wxljbx2vlfbx_hy0yfv8rc0000gn/T/build-via-sdist-3dumqb1j/casatools-6.7.7.7a14849.dev4/src/tools/msmetadata/msmetadata_cmpt.cc, line: 2272
01-Oct-2026 09:50:41 2026-10-01 13:50:42        SEVERE        msmetadata_cmpt.cc::transitions        Exception Reported: Exception: Spectral window ID -1 out of range, must be nonnegative and less than or equal to 39.
01-Oct-2026 09:50:41 2026-10-01 13:50:42        SEVERE        msmetadata_cmpt.cc::transitions+        ... thrown by void casac::msmetadata::_checkSpwId(int, bool) const at File: /private/var/folders/60/83wxljbx2vlfbx_hy0yfv8rc0000gn/T/build-via-sdist-3dumqb1j/casatools-6.7.7.7a14849.dev4/src/tools/msmetadata/msmetadata_cmpt.cc, line: 2449
01-Oct-2026 09:50:41 2026-10-01 13:50:42        SEVERE        msmetadata_cmpt.cc::transitions        Exception Reported: Exception: SOURCE table does not contain a row with SOURCE_ID=50 and SPECTRAL_WINDOW_ID=0.
01-Oct-2026 09:50:41 2026-10-01 13:50:42        SEVERE        msmetadata_cmpt.cc::transitions+        ... thrown by variant *casac::msmetadata::transitions(long, long) at File: /private/var/folders/60/83wxljbx2vlfbx_hy0yfv8rc0000gn/T/build-via-sdist-3dumqb1j/casatools-6.7.7.7a14849.dev4/src/tools/msmetadata/msmetadata_cmpt.cc, line: 2282
01-Oct-2026 09:50:41 2026-10-01 13:50:42        SEVERE        msmetadata_cmpt.cc::transitions        Exception Reported: Exception: Spectral window ID 50 out of range, must be nonnegative and less than or equal to 39.
01-Oct-2026 09:50:41 2026-10-01 13:50:42        SEVERE        msmetadata_cmpt.cc::transitions+        ... thrown by void casac::msmetadata::_checkSpwId(int, bool) const at File: /private/var/folders/60/83wxljbx2vlfbx_hy0yfv8rc0000gn/T/build-via-sdist-3dumqb1j/casatools-6.7.7.7a14849.dev4/src/tools/msmetadata/msmetadata_cmpt.cc, line: 2449
01-Oct-2026 09:50:41 test_tool_msmetadata.py::msmetadata_test::test_transitions
01-Oct-2026 09:50:41 Test transitions()
01-Oct-2026 09:50:41 PASSED
01-Oct-2026 09:50:41
01-Oct-2026 09:50:41 2026-10-01 13:50:42        INFO        msmetadata_cmpt.cc::open        Performing internal consistency checks on /opt/casa/data/casatestdata/unittest/msmetadata/MSMetaData.ms...
01-Oct-2026 09:50:41 test_tool_msmetadata.py::msmetadata_test::test_wvrspws
01-Oct-2026 09:50:41 Test wvrspws()
01-Oct-2026 09:50:41 PASSED
01-Oct-2026 09:50:41
01-Oct-2026 09:50:41 - generated xml file: /Users/casaci/bamboohome/xml-data/build-dir/CASASPECS-DEVTESTPY312147-TTOARM15P312/casa6/casatestutils/nosedir/xml/test_tool_msmetadata/nose.xml -
01-Oct-2026 09:50:41 ======================== 85 passed, 1 warning in 2.81s =========================
01-Oct-2026 09:50:41
01-Oct-2026 09:50:41
01-Oct-2026 09:50:41 Setting Working Directory: /Users/casaci/bamboohome/xml-data/build-dir/CASASPECS-DEVTESTPY312147-TTOARM15P312/casa6/casatestutils/nosedir/test_tool_msuvbinner/
01-Oct-2026 09:50:41 Test Directory: /Users/casaci/bamboohome/xml-data/build-dir/CASASPECS-DEVTESTPY312147-TTOARM15P312/casa6/casatestutils/nosedir/test_tool_msuvbinner
01-Oct-2026 09:50:41
01-Oct-2026 09:50:41 Running Command: pytest --junitxml=/Users/casaci/bamboohome/xml-data/build-dir/CASASPECS-DEVTESTPY312147-TTOARM15P312/casa6/casatestutils/nosedir/xml/test_tool_msuvbinner/nose.xml -s --disable-pytest-warnings --verbose -ra --tb=short /Users/casaci/bamboohome/xml-data/build-dir/CASASPECS-DEVTESTPY312147-TTOARM15P312/casa6/casatestutils/nosedir/test_tool_msuvbinner/
01-Oct-2026 09:50:41
01-Oct-2026 09:50:41 Setting Working Directory: /Users/casaci/bamboohome/xml-data/build-dir/CASASPECS-DEVTESTPY312147-TTOARM15P312/casa6/casatestutils/nosedir/test_tool_table/
01-Oct-2026 09:50:41 Test Directory: /Users/casaci/bamboohome/xml-data/build-dir/CASASPECS-DEVTESTPY312147-TTOARM15P312/casa6/casatestutils/nosedir/test_tool_table
01-Oct-2026 09:50:41
01-Oct-2026 09:50:41 Running Command: pytest --junitxml=/Users/casaci/bamboohome/xml-data/build-dir/CASASPECS-DEVTESTPY312147-TTOARM15P312/casa6/casatestutils/nosedir/xml/test_tool_table/nose.xml -s --disable-pytest-warnings --verbose -ra --tb=short /Users/casaci/bamboohome/xml-data/build-dir/CASASPECS-DEVTESTPY312147-TTOARM15P312/casa6/casatestutils/nosedir/test_tool_table/
01-Oct-2026 09:50:41
01-Oct-2026 09:50:41 Setting Working Directory: /Users/casaci/bamboohome/xml-data/build-dir/CASASPECS-DEVTESTPY312147-TTOARM15P312/casa6/casatestutils/nosedir/test_tool_coordsys/
01-Oct-2026 09:50:41 Test Directory: /Users/casaci/bamboohome/xml-data/build-dir/CASASPECS-DEVTESTPY312147-TTOARM15P312/casa6/casatestutils/nosedir/test_tool_coordsys
01-Oct-2026 09:50:41
01-Oct-2026 09:50:41 Running Command: pytest --junitxml=/Users/casaci/bamboohome/xml-data/build-dir/CASASPECS-DEVTESTPY312147-TTOARM15P312/casa6/casatestutils/nosedir/xml/test_tool_coordsys/nose.xml -s --disable-pytest-warnings --verbose -ra --tb=short /Users/casaci/bamboohome/xml-data/build-dir/CASASPECS-DEVTESTPY312147-TTOARM15P312/casa6/casatestutils/nosedir/test_tool_coordsys/
01-Oct-2026 09:50:41
01-Oct-2026 09:50:41 Setting Working Directory: /Users/casaci/bamboohome/xml-data/build-dir/CASASPECS-DEVTESTPY312147-TTOARM15P312/casa6/casatestutils/nosedir/test_tool_calanalysis/
01-Oct-2026 09:50:41 Test Directory: /Users/casaci/bamboohome/xml-data/build-dir/CASASPECS-DEVTESTPY312147-TTOARM15P312/casa6/casatestutils/nosedir/test_tool_calanalysis
01-Oct-2026 09:50:41
01-Oct-2026 09:50:41 Running Command: pytest --junitxml=/Users/casaci/bamboohome/xml-data/build-dir/CASASPECS-DEVTESTPY312147-TTOARM15P312/casa6/casatestutils/nosedir/xml/test_tool_calanalysis/nose.xml -s --disable-pytest-warnings --verbose -ra --tb=short /Users/casaci/bamboohome/xml-data/build-dir/CASASPECS-DEVTESTPY312147-TTOARM15P312/casa6/casatestutils/nosedir/test_tool_calanalysis/
01-Oct-2026 09:50:41
01-Oct-2026 09:50:41 Setting Working Directory: /Users/casaci/bamboohome/xml-data/build-dir/CASASPECS-DEVTESTPY312147-TTOARM15P312/casa6/casatestutils/nosedir/test_tool_agentflagger/
01-Oct-2026 09:50:41 Test Directory: /Users/casaci/bamboohome/xml-data/build-dir/CASASPECS-DEVTESTPY312147-TTOARM15P312/casa6/casatestutils/nosedir/test_tool_agentflagger
01-Oct-2026 09:50:41
01-Oct-2026 09:50:41 Running Command: pytest --junitxml=/Users/casaci/bamboohome/xml-data/build-dir/CASASPECS-DEVTESTPY312147-TTOARM15P312/casa6/casatestutils/nosedir/xml/test_tool_agentflagger/nose.xml -s --disable-pytest-warnings --verbose -ra --tb=short /Users/casaci/bamboohome/xml-data/build-dir/CASASPECS-DEVTESTPY312147-TTOARM15P312/casa6/casatestutils/nosedir/test_tool_agentflagger/
01-Oct-2026 09:50:41
01-Oct-2026 09:50:41 Setting Working Directory: /Users/casaci/bamboohome/xml-data/build-dir/CASASPECS-DEVTESTPY312147-TTOARM15P312/casa6/casatestutils/nosedir/test_tool_image_regrid/
01-Oct-2026 09:50:41 Test Directory: /Users/casaci/bamboohome/xml-data/build-dir/CASASPECS-DEVTESTPY312147-TTOARM15P312/casa6/casatestutils/nosedir/test_tool_image_regrid
01-Oct-2026 09:50:41
01-Oct-2026 09:50:41 Running Command: pytest --junitxml=/Users/casaci/bamboohome/xml-data/build-dir/CASASPECS-DEVTESTPY312147-TTOARM15P312/casa6/casatestutils/nosedir/xml/test_tool_image_regrid/nose.xml -s --disable-pytest-warnings --verbose -ra --tb=short /Users/casaci/bamboohome/xml-data/build-dir/CASASPECS-DEVTESTPY312147-TTOARM15P312/casa6/casatestutils/nosedir/test_tool_image_regrid/
01-Oct-2026 09:50:41
01-Oct-2026 09:50:41 Setting Working Directory: /Users/casaci/bamboohome/xml-data/build-dir/CASASPECS-DEVTESTPY312147-TTOARM15P312/casa6/casatestutils/nosedir/test_tool_sdm_toms/
01-Oct-2026 09:50:41 Test Directory: /Users/casaci/bamboohome/xml-data/build-dir/CASASPECS-DEVTESTPY312147-TTOARM15P312/casa6/casatestutils/nosedir/test_tool_sdm_toms
01-Oct-2026 09:50:41
01-Oct-2026 09:50:41 Running Command: pytest --junitxml=/Users/casaci/bamboohome/xml-data/build-dir/CASASPECS-DEVTESTPY312147-TTOARM15P312/casa6/casatestutils/nosedir/xml/test_tool_sdm_toms/nose.xml -s --disable-pytest-warnings --verbose -ra --tb=short /Users/casaci/bamboohome/xml-data/build-dir/CASASPECS-DEVTESTPY312147-TTOARM15P312/casa6/casatestutils/nosedir/test_tool_sdm_toms/
01-Oct-2026 09:50:41
01-Oct-2026 09:50:41 Setting Working Directory: /Users/casaci/bamboohome/xml-data/build-dir/CASASPECS-DEVTESTPY312147-TTOARM15P312/casa6/casatestutils/nosedir/test_tool_synthesisutils/
01-Oct-2026 09:50:41 Test Directory: /Users/casaci/bamboohome/xml-data/build-dir/CASASPECS-DEVTESTPY312147-TTOARM15P312/casa6/casatestutils/nosedir/test_tool_synthesisutils
01-Oct-2026 09:50:41
01-Oct-2026 09:50:41 Running Command: pytest --junitxml=/Users/casaci/bamboohome/xml-data/build-dir/CASASPECS-DEVTESTPY312147-TTOARM15P312/casa6/casatestutils/nosedir/xml/test_tool_synthesisutils/nose.xml -s --disable-pytest-warnings --verbose -ra --tb=short /Users/casaci/bamboohome/xml-data/build-dir/CASASPECS-DEVTESTPY312147-TTOARM15P312/casa6/casatestutils/nosedir/test_tool_synthesisutils/
01-Oct-2026 09:50:41
01-Oct-2026 09:50:41 Setting Working Directory: /Users/casaci/bamboohome/xml-data/build-dir/CASASPECS-DEVTESTPY312147-TTOARM15P312/casa6/casatestutils/nosedir/test_tool_image/
01-Oct-2026 09:50:41 Test Directory: /Users/casaci/bamboohome/xml-data/build-dir/CASASPECS-DEVTESTPY312147-TTOARM15P312/casa6/casatestutils/nosedir/test_tool_image
01-Oct-2026 09:50:41
01-Oct-2026 09:50:41 Running Command: pytest --junitxml=/Users/casaci/bamboohome/xml-data/build-dir/CASASPECS-DEVTESTPY312147-TTOARM15P312/casa6/casatestutils/nosedir/xml/test_tool_image/nose.xml -s --disable-pytest-warnings --verbose -ra --tb=short /Users/casaci/bamboohome/xml-data/build-dir/CASASPECS-DEVTESTPY312147-TTOARM15P312/casa6/casatestutils/nosedir/test_tool_image/
01-Oct-2026 09:50:41
01-Oct-2026 09:50:41 Setting Working Directory: /Users/casaci/bamboohome/xml-data/build-dir/CASASPECS-DEVTESTPY312147-TTOARM15P312/casa6/casatestutils/nosedir/test_tool_ms_statwt/
01-Oct-2026 09:50:41 Test Directory: /Users/casaci/bamboohome/xml-data/build-dir/CASASPECS-DEVTESTPY312147-TTOARM15P312/casa6/casatestutils/nosedir/test_tool_ms_statwt
01-Oct-2026 09:50:41
01-Oct-2026 09:50:41 Running Command: pytest --junitxml=/Users/casaci/bamboohome/xml-data/build-dir/CASASPECS-DEVTESTPY312147-TTOARM15P312/casa6/casatestutils/nosedir/xml/test_tool_ms_statwt/nose.xml -s --disable-pytest-warnings --verbose -ra --tb=short /Users/casaci/bamboohome/xml-data/build-dir/CASASPECS-DEVTESTPY312147-TTOARM15P312/casa6/casatestutils/nosedir/test_tool_ms_statwt/
01-Oct-2026 09:50:41
01-Oct-2026 09:50:41 Setting Working Directory: /Users/casaci/bamboohome/xml-data/build-dir/CASASPECS-DEVTESTPY312147-TTOARM15P312/casa6/casatestutils/nosedir/test_tool_regionmanager/
01-Oct-2026 09:50:41 Test Directory: /Users/casaci/bamboohome/xml-data/build-dir/CASASPECS-DEVTESTPY312147-TTOARM15P312/casa6/casatestutils/nosedir/test_tool_regionmanager
01-Oct-2026 09:50:41
01-Oct-2026 09:50:41 Running Command: pytest --junitxml=/Users/casaci/bamboohome/xml-data/build-dir/CASASPECS-DEVTESTPY312147-TTOARM15P312/casa6/casatestutils/nosedir/xml/test_tool_regionmanager/nose.xml -s --disable-pytest-warnings --verbose -ra --tb=short /Users/casaci/bamboohome/xml-data/build-dir/CASASPECS-DEVTESTPY312147-TTOARM15P312/casa6/casatestutils/nosedir/test_tool_regionmanager/
01-Oct-2026 09:50:41
01-Oct-2026 09:50:41 Setting Working Directory: /Users/casaci/bamboohome/xml-data/build-dir/CASASPECS-DEVTESTPY312147-TTOARM15P312/casa6/casatestutils/nosedir/test_tool_calibrater/
01-Oct-2026 09:50:41 Test Directory: /Users/casaci/bamboohome/xml-data/build-dir/CASASPECS-DEVTESTPY312147-TTOARM15P312/casa6/casatestutils/nosedir/test_tool_calibrater
01-Oct-2026 09:50:41
01-Oct-2026 09:50:41 Running Command: pytest --junitxml=/Users/casaci/bamboohome/xml-data/build-dir/CASASPECS-DEVTESTPY312147-TTOARM15P312/casa6/casatestutils/nosedir/xml/test_tool_calibrater/nose.xml -s --disable-pytest-warnings --verbose -ra --tb=short /Users/casaci/bamboohome/xml-data/build-dir/CASASPECS-DEVTESTPY312147-TTOARM15P312/casa6/casatestutils/nosedir/test_tool_calibrater/
01-Oct-2026 09:50:41
01-Oct-2026 09:50:41 Setting Working Directory: /Users/casaci/bamboohome/xml-data/build-dir/CASASPECS-DEVTESTPY312147-TTOARM15P312/casa6/casatestutils/nosedir/test_tool_imagepol/
01-Oct-2026 09:50:41 Test Directory: /Users/casaci/bamboohome/xml-data/build-dir/CASASPECS-DEVTESTPY312147-TTOARM15P312/casa6/casatestutils/nosedir/test_tool_imagepol
01-Oct-2026 09:50:41
01-Oct-2026 09:50:41 Running Command: pytest --junitxml=/Users/casaci/bamboohome/xml-data/build-dir/CASASPECS-DEVTESTPY312147-TTOARM15P312/casa6/casatestutils/nosedir/xml/test_tool_imagepol/nose.xml -s --disable-pytest-warnings --verbose -ra --tb=short /Users/casaci/bamboohome/xml-data/build-dir/CASASPECS-DEVTESTPY312147-TTOARM15P312/casa6/casatestutils/nosedir/test_tool_imagepol/
01-Oct-2026 09:50:41
01-Oct-2026 09:50:41 Setting Working Directory: /Users/casaci/bamboohome/xml-data/build-dir/CASASPECS-DEVTESTPY312147-TTOARM15P312/casa6/casatestutils/nosedir/test_tool_logsink/
01-Oct-2026 09:50:41 Test Directory: /Users/casaci/bamboohome/xml-data/build-dir/CASASPECS-DEVTESTPY312147-TTOARM15P312/casa6/casatestutils/nosedir/test_tool_logsink
01-Oct-2026 09:50:41
01-Oct-2026 09:50:41 Running Command: pytest --junitxml=/Users/casaci/bamboohome/xml-data/build-dir/CASASPECS-DEVTESTPY312147-TTOARM15P312/casa6/casatestutils/nosedir/xml/test_tool_logsink/nose.xml -s --disable-pytest-warnings --verbose -ra --tb=short /Users/casaci/bamboohome/xml-data/build-dir/CASASPECS-DEVTESTPY312147-TTOARM15P312/casa6/casatestutils/nosedir/test_tool_logsink/
01-Oct-2026 09:50:41
01-Oct-2026 09:50:41 Setting Working Directory: /Users/casaci/bamboohome/xml-data/build-dir/CASASPECS-DEVTESTPY312147-TTOARM15P312/casa6/casatestutils/nosedir/test_tool_measures/
01-Oct-2026 09:50:41 Test Directory: /Users/casaci/bamboohome/xml-data/build-dir/CASASPECS-DEVTESTPY312147-TTOARM15P312/casa6/casatestutils/nosedir/test_tool_measures
01-Oct-2026 09:50:41
01-Oct-2026 09:50:41 Running Command: pytest --junitxml=/Users/casaci/bamboohome/xml-data/build-dir/CASASPECS-DEVTESTPY312147-TTOARM15P312/casa6/casatestutils/nosedir/xml/test_tool_measures/nose.xml -s --disable-pytest-warnings --verbose -ra --tb=short /Users/casaci/bamboohome/xml-data/build-dir/CASASPECS-DEVTESTPY312147-TTOARM15P312/casa6/casatestutils/nosedir/test_tool_measures/
01-Oct-2026 09:50:41
01-Oct-2026 09:50:41 Setting Working Directory: /Users/casaci/bamboohome/xml-data/build-dir/CASASPECS-DEVTESTPY312147-TTOARM15P312/casa6/casatestutils/nosedir/test_tool_quanta/
01-Oct-2026 09:50:41 Test Directory: /Users/casaci/bamboohome/xml-data/build-dir/CASASPECS-DEVTESTPY312147-TTOARM15P312/casa6/casatestutils/nosedir/test_tool_quanta
01-Oct-2026 09:50:41
01-Oct-2026 09:50:41 Running Command: pytest --junitxml=/Users/casaci/bamboohome/xml-data/build-dir/CASASPECS-DEVTESTPY312147-TTOARM15P312/casa6/casatestutils/nosedir/xml/test_tool_quanta/nose.xml -s --disable-pytest-warnings --verbose -ra --tb=short /Users/casaci/bamboohome/xml-data/build-dir/CASASPECS-DEVTESTPY312147-TTOARM15P312/casa6/casatestutils/nosedir/test_tool_quanta/
01-Oct-2026 09:50:41
01-Oct-2026 09:50:41 Setting Working Directory: /Users/casaci/bamboohome/xml-data/build-dir/CASASPECS-DEVTESTPY312147-TTOARM15P312/casa6/casatestutils/nosedir/test_tool_simulator/
01-Oct-2026 09:50:41 Test Directory: /Users/casaci/bamboohome/xml-data/build-dir/CASASPECS-DEVTESTPY312147-TTOARM15P312/casa6/casatestutils/nosedir/test_tool_simulator
01-Oct-2026 09:50:41
01-Oct-2026 09:50:41 Running Command: pytest --junitxml=/Users/casaci/bamboohome/xml-data/build-dir/CASASPECS-DEVTESTPY312147-TTOARM15P312/casa6/casatestutils/nosedir/xml/test_tool_simulator/nose.xml -s --disable-pytest-warnings --verbose -ra --tb=short /Users/casaci/bamboohome/xml-data/build-dir/CASASPECS-DEVTESTPY312147-TTOARM15P312/casa6/casatestutils/nosedir/test_tool_simulator/
01-Oct-2026 09:50:41
01-Oct-2026 09:50:41 Setting Working Directory: /Users/casaci/bamboohome/xml-data/build-dir/CASASPECS-DEVTESTPY312147-TTOARM15P312/casa6/casatestutils/nosedir/test_tool_vpmanager/
01-Oct-2026 09:50:41 Test Directory: /Users/casaci/bamboohome/xml-data/build-dir/CASASPECS-DEVTESTPY312147-TTOARM15P312/casa6/casatestutils/nosedir/test_tool_vpmanager
01-Oct-2026 09:50:41
01-Oct-2026 09:50:41 Running Command: pytest --junitxml=/Users/casaci/bamboohome/xml-data/build-dir/CASASPECS-DEVTESTPY312147-TTOARM15P312/casa6/casatestutils/nosedir/xml/test_tool_vpmanager/nose.xml -s --disable-pytest-warnings --verbose -ra --tb=short /Users/casaci/bamboohome/xml-data/build-dir/CASASPECS-DEVTESTPY312147-TTOARM15P312/casa6/casatestutils/nosedir/test_tool_vpmanager/
01-Oct-2026 09:50:41
01-Oct-2026 09:50:41 Setting Working Directory: /Users/casaci/bamboohome/xml-data/build-dir/CASASPECS-DEVTESTPY312147-TTOARM15P312/casa6/casatestutils/nosedir/test_tool_image_statistics/
01-Oct-2026 09:50:41 Test Directory: /Users/casaci/bamboohome/xml-data/build-dir/CASASPECS-DEVTESTPY312147-TTOARM15P312/casa6/casatestutils/nosedir/test_tool_image_statistics
01-Oct-2026 09:50:41
01-Oct-2026 09:50:41 Running Command: pytest --junitxml=/Users/casaci/bamboohome/xml-data/build-dir/CASASPECS-DEVTESTPY312147-TTOARM15P312/casa6/casatestutils/nosedir/xml/test_tool_image_statistics/nose.xml -s --disable-pytest-warnings --verbose -ra --tb=short /Users/casaci/bamboohome/xml-data/build-dir/CASASPECS-DEVTESTPY312147-TTOARM15P312/casa6/casatestutils/nosedir/test_tool_image_statistics/
01-Oct-2026 09:50:41
01-Oct-2026 09:50:41 Setting Working Directory: /Users/casaci/bamboohome/xml-data/build-dir/CASASPECS-DEVTESTPY312147-TTOARM15P312/casa6/casatestutils/nosedir/test_tool_image_pv/
01-Oct-2026 09:50:41 Test Directory: /Users/casaci/bamboohome/xml-data/build-dir/CASASPECS-DEVTESTPY312147-TTOARM15P312/casa6/casatestutils/nosedir/test_tool_image_pv
01-Oct-2026 09:50:41
01-Oct-2026 09:50:41 Running Command: pytest --junitxml=/Users/casaci/bamboohome/xml-data/build-dir/CASASPECS-DEVTESTPY312147-TTOARM15P312/casa6/casatestutils/nosedir/xml/test_tool_image_pv/nose.xml -s --disable-pytest-warnings --verbose -ra --tb=short /Users/casaci/bamboohome/xml-data/build-dir/CASASPECS-DEVTESTPY312147-TTOARM15P312/casa6/casatestutils/nosedir/test_tool_image_pv/
01-Oct-2026 09:50:41
01-Oct-2026 09:50:41 Setting Working Directory: /Users/casaci/bamboohome/xml-data/build-dir/CASASPECS-DEVTESTPY312147-TTOARM15P312/casa6/casatestutils/nosedir/test_tool_image_subimage/
01-Oct-2026 09:50:41 Test Directory: /Users/casaci/bamboohome/xml-data/build-dir/CASASPECS-DEVTESTPY312147-TTOARM15P312/casa6/casatestutils/nosedir/test_tool_image_subimage
01-Oct-2026 09:50:41
01-Oct-2026 09:50:41 Running Command: pytest --junitxml=/Users/casaci/bamboohome/xml-data/build-dir/CASASPECS-DEVTESTPY312147-TTOARM15P312/casa6/casatestutils/nosedir/xml/test_tool_image_subimage/nose.xml -s --disable-pytest-warnings --verbose -ra --tb=short /Users/casaci/bamboohome/xml-data/build-dir/CASASPECS-DEVTESTPY312147-TTOARM15P312/casa6/casatestutils/nosedir/test_tool_image_subimage/
01-Oct-2026 09:50:41
01-Oct-2026 09:50:41 Setting Working Directory: /Users/casaci/bamboohome/xml-data/build-dir/CASASPECS-DEVTESTPY312147-TTOARM15P312/casa6/casatestutils/nosedir/test_tool_image_pbcor/
01-Oct-2026 09:50:41 Test Directory: /Users/casaci/bamboohome/xml-data/build-dir/CASASPECS-DEVTESTPY312147-TTOARM15P312/casa6/casatestutils/nosedir/test_tool_image_pbcor
01-Oct-2026 09:50:41
01-Oct-2026 09:50:41 Running Command: pytest --junitxml=/Users/casaci/bamboohome/xml-data/build-dir/CASASPECS-DEVTESTPY312147-TTOARM15P312/casa6/casatestutils/nosedir/xml/test_tool_image_pbcor/nose.xml -s --disable-pytest-warnings --verbose -ra --tb=short /Users/casaci/bamboohome/xml-data/build-dir/CASASPECS-DEVTESTPY312147-TTOARM15P312/casa6/casatestutils/nosedir/test_tool_image_pbcor/
01-Oct-2026 09:50:41
01-Oct-2026 09:50:41 Setting Working Directory: /Users/casaci/bamboohome/xml-data/build-dir/CASASPECS-DEVTESTPY312147-TTOARM15P312/casa6/casatestutils/nosedir/test_tool_ms/
01-Oct-2026 09:50:41 Test Directory: /Users/casaci/bamboohome/xml-data/build-dir/CASASPECS-DEVTESTPY312147-TTOARM15P312/casa6/casatestutils/nosedir/test_tool_ms
01-Oct-2026 09:50:41
01-Oct-2026 09:50:41 Running Command: pytest --junitxml=/Users/casaci/bamboohome/xml-data/build-dir/CASASPECS-DEVTESTPY312147-TTOARM15P312/casa6/casatestutils/nosedir/xml/test_tool_ms/nose.xml -s --disable-pytest-warnings --verbose -ra --tb=short /Users/casaci/bamboohome/xml-data/build-dir/CASASPECS-DEVTESTPY312147-TTOARM15P312/casa6/casatestutils/nosedir/test_tool_ms/
01-Oct-2026 09:50:41
01-Oct-2026 09:50:41 Setting Working Directory: /Users/casaci/bamboohome/xml-data/build-dir/CASASPECS-DEVTESTPY312147-TTOARM15P312/casa6/casatestutils/nosedir/test_tool_msmetadata/
01-Oct-2026 09:50:41 Test Directory: /Users/casaci/bamboohome/xml-data/build-dir/CASASPECS-DEVTESTPY312147-TTOARM15P312/casa6/casatestutils/nosedir/test_tool_msmetadata
01-Oct-2026 09:50:41
01-Oct-2026 09:50:41 Running Command: pytest --junitxml=/Users/casaci/bamboohome/xml-data/build-dir/CASASPECS-DEVTESTPY312147-TTOARM15P312/casa6/casatestutils/nosedir/xml/test_tool_msmetadata/nose.xml -s --disable-pytest-warnings --verbose -ra --tb=short /Users/casaci/bamboohome/xml-data/build-dir/CASASPECS-DEVTESTPY312147-TTOARM15P312/casa6/casatestutils/nosedir/test_tool_msmetadata/
01-Oct-2026 09:50:41 Finished task 'Test wheel' with result: Success
01-Oct-2026 09:50:41 Starting task 'Parse tests' of type 'com.atlassian.bamboo.plugins.testresultparser:task.testresultparser.junit'
01-Oct-2026 09:50:41 Parsing test results under /Users/casaci/bamboohome/xml-data/build-dir/CASASPECS-DEVTESTPY312147-TTOARM15P312...
01-Oct-2026 09:50:42 Finished task 'Parse tests' with result: Success
01-Oct-2026 09:50:42
Substituting variable: ${bamboo.agentId} with 142606339
01-Oct-2026 09:50:42
Substituting variable: ${bamboo.agentId} with 142606339
01-Oct-2026 09:50:42 Starting task 'Upload wheels' of type 'com.atlassian.bamboo.plugins.scripttask:task.builder.script'
01-Oct-2026 09:50:42
Beginning to execute external process for build 'CASASPECS - Dev Test 3.12 - CAS-14849 - Test Tools macOS 15 Py3.12 #6 (CASASPECS-DEVTESTPY312147-TTOARM15P312-6)'
... running command line:
/Users/casaci/bamboohome/temp/CASASPECS-DEVTESTPY312147-TTOARM15P312-6-ScriptBuildTask-17594854366184552454.sh
... in: /Users/casaci/bamboohome/xml-data/build-dir/CASASPECS-DEVTESTPY312147-TTOARM15P312
01-Oct-2026 09:50:42 Cloning into 'casa-build-utils'...
01-Oct-2026 09:50:42 /Users/casaci/bamboohome/xml-data/build-dir/CASASPECS-DEVTESTPY312147-TTOARM15P312
01-Oct-2026 09:50:44 Collecting twine
01-Oct-2026 09:50:44   Using cached twine-6.2.0-py3-none-any.whl (42 kB)
01-Oct-2026 09:50:44 Collecting rich>=12.0.0
01-Oct-2026 09:50:44   Using cached rich-15.0.0-py3-none-any.whl (310 kB)
01-Oct-2026 09:50:44 Collecting id
01-Oct-2026 09:50:44   Using cached id-1.6.1-py3-none-any.whl (14 kB)
01-Oct-2026 09:50:44 Collecting urllib3>=1.26.0
01-Oct-2026 09:50:44   Using cached urllib3-2.6.3-py3-none-any.whl (131 kB)
01-Oct-2026 09:50:44 Collecting requests-toolbelt!=0.9.0,>=0.8.0
01-Oct-2026 09:50:44   Using cached requests_toolbelt-1.0.0-py2.py3-none-any.whl (54 kB)
01-Oct-2026 09:50:44 Collecting keyring>=21.2.0
01-Oct-2026 09:50:44   Using cached keyring-25.7.0-py3-none-any.whl (39 kB)
01-Oct-2026 09:50:44 Collecting requests>=2.20
01-Oct-2026 09:50:44   Using cached requests-2.32.5-py3-none-any.whl (64 kB)
01-Oct-2026 09:50:44 Collecting readme-renderer>=35.0
01-Oct-2026 09:50:44   Using cached readme_renderer-44.0-py3-none-any.whl (13 kB)
01-Oct-2026 09:50:44 Collecting rfc3986>=1.4.0
01-Oct-2026 09:50:44   Using cached rfc3986-2.0.0-py2.py3-none-any.whl (31 kB)
01-Oct-2026 09:50:44 Collecting packaging>=24.0
01-Oct-2026 09:50:44   Using cached packaging-26.3-py3-none-any.whl (129 kB)
01-Oct-2026 09:50:44 Collecting importlib-metadata>=3.6
01-Oct-2026 09:50:44   Using cached importlib_metadata-8.7.1-py3-none-any.whl (27 kB)
01-Oct-2026 09:50:44 Collecting zipp>=3.20
01-Oct-2026 09:50:44   Using cached zipp-3.23.1-py3-none-any.whl (10 kB)
01-Oct-2026 09:50:44 Collecting jaraco.classes
01-Oct-2026 09:50:44   Using cached jaraco.classes-3.4.0-py3-none-any.whl (6.8 kB)
01-Oct-2026 09:50:44 Collecting jaraco.context
01-Oct-2026 09:50:44   Using cached jaraco_context-6.1.1-py3-none-any.whl (7.0 kB)
01-Oct-2026 09:50:44 Collecting jaraco.functools
01-Oct-2026 09:50:44   Using cached jaraco_functools-4.4.0-py3-none-any.whl (10 kB)
01-Oct-2026 09:50:44 Collecting nh3>=0.2.14
01-Oct-2026 09:50:44   Using cached nh3-0.3.7-cp38-abi3-macosx_10_12_x86_64.macosx_11_0_arm64.macosx_10_12_universal2.whl (1.5 MB)
01-Oct-2026 09:50:44 Collecting Pygments>=2.5.1
01-Oct-2026 09:50:44   Using cached pygments-2.21.0-py3-none-any.whl (1.3 MB)
01-Oct-2026 09:50:45 Collecting docutils>=0.21.2
01-Oct-2026 09:50:45   Using cached docutils-0.23-py3-none-any.whl (634 kB)
01-Oct-2026 09:50:45 Collecting certifi>=2017.4.17
01-Oct-2026 09:50:45   Using cached certifi-2026.7.22-py3-none-any.whl (136 kB)
01-Oct-2026 09:50:45 Collecting charset_normalizer<4,>=2
01-Oct-2026 09:50:45   Using cached charset_normalizer-3.5.2-cp39-cp39-macosx_10_9_universal2.whl (374 kB)
01-Oct-2026 09:50:45 Collecting idna<4,>=2.5
01-Oct-2026 09:50:45   Using cached idna-3.20-py3-none-any.whl (69 kB)
01-Oct-2026 09:50:45 Collecting markdown-it-py>=2.2.0
01-Oct-2026 09:50:45   Using cached markdown_it_py-3.0.0-py3-none-any.whl (87 kB)
01-Oct-2026 09:50:45 Collecting mdurl~=0.1
01-Oct-2026 09:50:45   Using cached mdurl-0.1.2-py3-none-any.whl (10.0 kB)
01-Oct-2026 09:50:45 Collecting more-itertools
01-Oct-2026 09:50:45   Using cached more_itertools-10.8.0-py3-none-any.whl (69 kB)
01-Oct-2026 09:50:45 Collecting backports.tarfile
01-Oct-2026 09:50:45   Using cached backports.tarfile-1.2.0-py3-none-any.whl (30 kB)
01-Oct-2026 09:50:45 Installing collected packages: zipp, urllib3, more-itertools, mdurl, idna, charset-normalizer, certifi, backports.tarfile, requests, Pygments, nh3, markdown-it-py, jaraco.functools, jaraco.context, jaraco.classes, importlib-metadata, docutils, rich, rfc3986, requests-toolbelt, readme-renderer, packaging, keyring, id, twine
01-Oct-2026 09:50:46 Successfully installed Pygments-2.21.0 backports.tarfile-1.2.0 certifi-2026.7.22 charset-normalizer-3.5.2 docutils-0.23 id-1.6.1 idna-3.20 importlib-metadata-8.7.1 jaraco.classes-3.4.0 jaraco.context-6.1.1 jaraco.functools-4.4.0 keyring-25.7.0 markdown-it-py-3.0.0 mdurl-0.1.2 more-itertools-10.8.0 nh3-0.3.7 packaging-26.3 readme-renderer-44.0 requests-2.32.5 requests-toolbelt-1.0.0 rfc3986-2.0.0 rich-15.0.0 twine-6.2.0 urllib3-2.6.3 zipp-3.23.1
01-Oct-2026 09:50:46 WARNING: You are using pip version 21.2.4; however, version 26.0.1 is available.
01-Oct-2026 09:50:46 You should consider upgrading via the '/Users/casaci/bamboohome/xml-data/build-dir/CASASPECS-DEVTESTPY312147-TTOARM15P312/wheeldirectory/casa6testenv/bin/python3 -m pip install --upgrade pip' command.
01-Oct-2026 09:50:46 /Users/casaci/bamboohome/xml-data/build-dir/CASASPECS-DEVTESTPY312147-TTOARM15P312/wheeldirectory/casa6testenv/lib/python3.9/site-packages/urllib3/__init__.py:35: NotOpenSSLWarning: urllib3 v2 only supports OpenSSL 1.1.1+, currently the 'ssl' module is compiled with 'LibreSSL 2.8.3'. See: https://github.com/urllib3/urllib3/issues/3020
01-Oct-2026 09:50:46   warnings.warn(
01-Oct-2026 09:50:47 Uploading distributions to
01-Oct-2026 09:50:47 https://casa-pip.nrao.edu:443/repository/casa-dev-wheel/
01-Oct-2026 09:50:47 Uploading casatools-6.7.7.7a14849.dev4-cp312-cp312-macosx_15_0_arm64.whl
01-Oct-2026 09:50:47
01-Oct-2026 09:50:47   0% ━━━━━━━━━━━━━━━━━━━━━━━━━━━━━━━━━━━━━━━━ 0.0/72.1 MB • --:-- • ?
01-Oct-2026 09:50:47   9% ━━━╸━━━━━━━━━━━━━━━━━━━━━━━━━━━━━━━━━━━━ 6.8/72.1 MB • 00:01 • 92.9 MB/s
01-Oct-2026 09:50:47 17% ━━━━━━╸━━━━━━━━━━━━━━━━━━━━━━━━━━━━━━━━━ 12.2/72.1 MB • 00:01 • 66.5 MB/s
01-Oct-2026 09:50:47 21% ━━━━━━━━╺━━━━━━━━━━━━━━━━━━━━━━━━━━━━━━━ 15.2/72.1 MB • 00:02 • 56.6 MB/s
01-Oct-2026 09:50:47 25% ━━━━━━━━━━╺━━━━━━━━━━━━━━━━━━━━━━━━━━━━━ 18.1/72.1 MB • 00:02 • 43.9 MB/s
01-Oct-2026 09:50:47 31% ━━━━━━━━━━━━╺━━━━━━━━━━━━━━━━━━━━━━━━━━━ 22.3/72.1 MB • 00:02 • 37.2 MB/s
01-Oct-2026 09:50:47 36% ━━━━━━━━━━━━━━╺━━━━━━━━━━━━━━━━━━━━━━━━━ 25.9/72.1 MB • 00:02 • 33.3 MB/s
01-Oct-2026 09:50:47 39% ━━━━━━━━━━━━━━━╸━━━━━━━━━━━━━━━━━━━━━━━━ 28.3/72.1 MB • 00:02 • 30.8 MB/s
01-Oct-2026 09:50:48 45% ━━━━━━━━━━━━━━━━━━╺━━━━━━━━━━━━━━━━━━━━━ 32.7/72.1 MB • 00:02 • 33.1 MB/s
01-Oct-2026 09:50:48 50% ━━━━━━━━━━━━━━━━━━━╸━━━━━━━━━━━━━━━━━━━━ 36.0/72.1 MB • 00:02 • 33.3 MB/s
01-Oct-2026 09:50:48 54% ━━━━━━━━━━━━━━━━━━━━━╺━━━━━━━━━━━━━━━━━━ 38.8/72.1 MB • 00:02 • 33.3 MB/s
01-Oct-2026 09:50:48 60% ━━━━━━━━━━━━━━━━━━━━━━━╸━━━━━━━━━━━━━━━━ 43.3/72.1 MB • 00:01 • 33.2 MB/s
01-Oct-2026 09:50:48 65% ━━━━━━━━━━━━━━━━━━━━━━━━━╸━━━━━━━━━━━━━━ 46.6/72.1 MB • 00:01 • 33.3 MB/s
01-Oct-2026 09:50:48 68% ━━━━━━━━━━━━━━━━━━━━━━━━━━━╺━━━━━━━━━━━━ 49.4/72.1 MB • 00:01 • 31.1 MB/s
01-Oct-2026 09:50:48 74% ━━━━━━━━━━━━━━━━━━━━━━━━━━━━━╸━━━━━━━━━━ 53.2/72.1 MB • 00:01 • 32.7 MB/s
01-Oct-2026 09:50:48 79% ━━━━━━━━━━━━━━━━━━━━━━━━━━━━━━━╸━━━━━━━━ 57.1/72.1 MB • 00:01 • 33.6 MB/s
01-Oct-2026 09:50:48 84% ━━━━━━━━━━━━━━━━━━━━━━━━━━━━━━━━━╺━━━━━━ 60.4/72.1 MB • 00:01 • 32.6 MB/s
01-Oct-2026 09:50:49 90% ━━━━━━━━━━━━━━━━━━━━━━━━━━━━━━━━━━━╸━━━━ 64.8/72.1 MB • 00:01 • 33.6 MB/s
01-Oct-2026 09:50:49 94% ━━━━━━━━━━━━━━━━━━━━━━━━━━━━━━━━━━━━━╺━━ 67.6/72.1 MB • 00:01 • 33.7 MB/s
01-Oct-2026 09:50:49 98% ━━━━━━━━━━━━━━━━━━━━━━━━━━━━━━━━━━━━━━━╺ 70.8/72.1 MB • 00:01 • 32.8 MB/s
01-Oct-2026 09:50:49 100% ━━━━━━━━━━━━━━━━━━━━━━━━━━━━━━━━━━━━━━━━ 72.1/72.1 MB • 00:02 • 33.5 MB/s
01-Oct-2026 09:50:49 100% ━━━━━━━━━━━━━━━━━━━━━━━━━━━━━━━━━━━━━━━━ 72.1/72.1 MB • 00:02 • 33.5 MB/s
01-Oct-2026 09:50:49 100% ━━━━━━━━━━━━━━━━━━━━━━━━━━━━━━━━━━━━━━━━ 72.1/72.1 MB • 00:02 • 33.5 MB/s
01-Oct-2026 09:50:49 /Users/casaci/bamboohome/xml-data/build-dir/CASASPECS-DEVTESTPY312147-TTOARM15P312
01-Oct-2026 09:50:49 Finished task 'Upload wheels' with result: Success
01-Oct-2026 09:50:49 Running post build plugin 'Docker Container Cleanup'
01-Oct-2026 09:50:49 Running post build plugin 'NCover Results Collector'
01-Oct-2026 09:50:49 Running post build plugin 'Build Results Label Collector'
01-Oct-2026 09:50:49 Running post build plugin 'Clover Results Collector'
01-Oct-2026 09:50:49 Running post build plugin 'npm Cache Cleanup'
01-Oct-2026 09:50:49 Running post build plugin 'Artifact Copier'
01-Oct-2026 09:50:49 Finalising the build...
01-Oct-2026 09:50:49 Stopping timer.
01-Oct-2026 09:50:49 Build CASASPECS-DEVTESTPY312147-TTOARM15P312-6 completed.
01-Oct-2026 09:50:51 Running on server: post build plugin 'Build Hanging Detection Configuration'
01-Oct-2026 09:50:51 Running on server: post build plugin 'NCover Results Collector'
01-Oct-2026 09:50:51 Running on server: post build plugin 'Build Labeller'
01-Oct-2026 09:50:51 Running on server: post build plugin 'Clover Delta Calculator'
01-Oct-2026 09:50:51 Running on server: post build plugin 'Maven Dependencies Postprocessor'
01-Oct-2026 09:50:51 All post build plugins have finished
01-Oct-2026 09:50:51 Generating build results summary...
01-Oct-2026 09:50:51 Saving build results to disk...
01-Oct-2026 09:50:55 Store variable context...
01-Oct-2026 09:50:55 Finished building CASASPECS-DEVTESTPY312147-TTOARM15P312-6.