Build: #6 failed

Job: Test Tasks macOS 15 Py3.12 failed

Build log

The build generated 506 lines of output. Download or view full build log.

01-Oct-2026 09:38:16 Build CASASPECS - Dev Test 3.12 - CAS-14849 - Test Tasks macOS 15 Py3.12 #6 (CASASPECS-DEVTESTPY312147-TTARM15PY312-6) is being prepared for building on agent cbt-macos15-test-4, bamboo version: 9.6.26
01-Oct-2026 09:38:16 Remote agent on host cbt-macos15-test-4
01-Oct-2026 09:38:16 Build working directory is /Users/casaci/bamboohome/xml-data/build-dir/CASASPECS-DEVTESTPY312147-TTARM15PY312
01-Oct-2026 09:38:16 Executing build CASASPECS - Dev Test 3.12 - CAS-14849 - Test Tasks macOS 15 Py3.12 #6 (CASASPECS-DEVTESTPY312147-TTARM15PY312-6)
01-Oct-2026 09:38:16 Starting task 'Source Code Checkout' of type 'com.atlassian.bamboo.plugins.vcs:task.vcs.checkout'
01-Oct-2026 09:38:16 Build always requires a clean checkout
01-Oct-2026 09:38:16 Cleaning build directory '/Users/casaci/bamboohome/xml-data/build-dir/CASASPECS-DEVTESTPY312147-TTARM15PY312'
01-Oct-2026 09:38:22 Checking out into /Users/casaci/bamboohome/xml-data/build-dir/CASASPECS-DEVTESTPY312147-TTARM15PY312
01-Oct-2026 09:38:22 Updating source code to revision: b7c9977a194ec0f6d5ce3a54c3a47be204959703
01-Oct-2026 09:38:22 Fetching 'refs/heads/CAS-14849' from 'ssh://git@open-bitbucket.nrao.edu:7999/casa/casa6.git'.
01-Oct-2026 09:38:22 Warning: Permanently added '[127.0.0.1]:49161' (RSA) to the list of known hosts.
01-Oct-2026 09:38:23 Checking out revision b7c9977a194ec0f6d5ce3a54c3a47be204959703.
01-Oct-2026 09:38:23 Creating local git repository in '/Users/casaci/bamboohome/xml-data/build-dir/CASASPECS-DEVTESTPY312147-TTARM15PY312/.git'.
01-Oct-2026 09:38:23 Cloning into '/Users/casaci/bamboohome/xml-data/build-dir/CASASPECS-DEVTESTPY312147-TTARM15PY312'...
01-Oct-2026 09:38:23 done.
01-Oct-2026 09:38:25 Switched to a new branch 'CAS-14849'
01-Oct-2026 09:38:25 branch 'CAS-14849' set up to track 'origin/CAS-14849'.
01-Oct-2026 09:38:25 Submodule 'casatools/casacore' (https://github.com/casacore/casacore.git) registered for path 'casatools/casacore'
01-Oct-2026 09:38:25 Submodule 'casatools/grpc-source' (https://github.com/grpc/grpc) registered for path 'casatools/grpc-source'
01-Oct-2026 09:38:25 Cloning into '/Users/casaci/bamboohome/xml-data/build-dir/CASASPECS-DEVTESTPY312147-TTARM15PY312/casatools/casacore'...
01-Oct-2026 09:38:37 Cloning into '/Users/casaci/bamboohome/xml-data/build-dir/CASASPECS-DEVTESTPY312147-TTARM15PY312/casatools/grpc-source'...
01-Oct-2026 09:39:11 Submodule path 'casatools/casacore': checked out 'aaf72eb7edd5a5fecefa78ca04713233b7b6ffd6'
01-Oct-2026 09:39:12 Submodule path 'casatools/grpc-source': checked out 'cca868ac8f3641df4003a82b7fc54c921e14f765'
01-Oct-2026 09:39:12 Submodule 'third_party/abseil-cpp' (https://github.com/abseil/abseil-cpp) registered for path 'casatools/grpc-source/third_party/abseil-cpp'
01-Oct-2026 09:39:12 Submodule 'third_party/benchmark' (https://github.com/google/benchmark) registered for path 'casatools/grpc-source/third_party/benchmark'
01-Oct-2026 09:39:12 Submodule 'third_party/bloaty' (https://github.com/google/bloaty.git) registered for path 'casatools/grpc-source/third_party/bloaty'
01-Oct-2026 09:39:12 Submodule 'third_party/boringssl' (https://github.com/google/boringssl.git) registered for path 'casatools/grpc-source/third_party/boringssl'
01-Oct-2026 09:39:12 Submodule 'third_party/boringssl-with-bazel' (https://github.com/google/boringssl.git) registered for path 'casatools/grpc-source/third_party/boringssl-with-bazel'
01-Oct-2026 09:39:12 Submodule 'third_party/cares/cares' (https://github.com/c-ares/c-ares.git) registered for path 'casatools/grpc-source/third_party/cares/cares'
01-Oct-2026 09:39:12 Submodule 'third_party/gflags' (https://github.com/gflags/gflags.git) registered for path 'casatools/grpc-source/third_party/gflags'
01-Oct-2026 09:39:12 Submodule 'third_party/googletest' (https://github.com/google/googletest.git) registered for path 'casatools/grpc-source/third_party/googletest'
01-Oct-2026 09:39:12 Submodule 'third_party/protobuf' (https://github.com/google/protobuf.git) registered for path 'casatools/grpc-source/third_party/protobuf'
01-Oct-2026 09:39:12 Submodule 'third_party/zlib' (https://github.com/madler/zlib) registered for path 'casatools/grpc-source/third_party/zlib'
01-Oct-2026 09:39:12 Cloning into '/Users/casaci/bamboohome/xml-data/build-dir/CASASPECS-DEVTESTPY312147-TTARM15PY312/casatools/grpc-source/third_party/abseil-cpp'...
01-Oct-2026 09:39:14 Cloning into '/Users/casaci/bamboohome/xml-data/build-dir/CASASPECS-DEVTESTPY312147-TTARM15PY312/casatools/grpc-source/third_party/benchmark'...
01-Oct-2026 09:39:14 Cloning into '/Users/casaci/bamboohome/xml-data/build-dir/CASASPECS-DEVTESTPY312147-TTARM15PY312/casatools/grpc-source/third_party/bloaty'...
01-Oct-2026 09:39:14 Cloning into '/Users/casaci/bamboohome/xml-data/build-dir/CASASPECS-DEVTESTPY312147-TTARM15PY312/casatools/grpc-source/third_party/boringssl'...
01-Oct-2026 09:39:26 Cloning into '/Users/casaci/bamboohome/xml-data/build-dir/CASASPECS-DEVTESTPY312147-TTARM15PY312/casatools/grpc-source/third_party/boringssl-with-bazel'...
01-Oct-2026 09:39:36 Cloning into '/Users/casaci/bamboohome/xml-data/build-dir/CASASPECS-DEVTESTPY312147-TTARM15PY312/casatools/grpc-source/third_party/cares/cares'...
01-Oct-2026 09:39:37 Cloning into '/Users/casaci/bamboohome/xml-data/build-dir/CASASPECS-DEVTESTPY312147-TTARM15PY312/casatools/grpc-source/third_party/gflags'...
01-Oct-2026 09:39:37 Cloning into '/Users/casaci/bamboohome/xml-data/build-dir/CASASPECS-DEVTESTPY312147-TTARM15PY312/casatools/grpc-source/third_party/googletest'...
01-Oct-2026 09:39:38 Cloning into '/Users/casaci/bamboohome/xml-data/build-dir/CASASPECS-DEVTESTPY312147-TTARM15PY312/casatools/grpc-source/third_party/protobuf'...
01-Oct-2026 09:39:51 Cloning into '/Users/casaci/bamboohome/xml-data/build-dir/CASASPECS-DEVTESTPY312147-TTARM15PY312/casatools/grpc-source/third_party/zlib'...
01-Oct-2026 09:39:52 Submodule path 'casatools/grpc-source/third_party/abseil-cpp': checked out 'cc4bed2d74f7c8717e31f9579214ab52a9c9c610'
01-Oct-2026 09:39:52 Submodule path 'casatools/grpc-source/third_party/benchmark': checked out '5b7683f49e1e9223cf9927b24f6fd3d6bd82e3f8'
01-Oct-2026 09:39:52 Submodule path 'casatools/grpc-source/third_party/bloaty': checked out '73594cde8c9a52a102c4341c244c833aa61b9c06'
01-Oct-2026 09:39:52 Submodule 'third_party/googletest' (https://github.com/google/googletest.git) registered for path 'casatools/grpc-source/third_party/bloaty/third_party/googletest'
01-Oct-2026 09:39:52 Submodule 'third_party/libFuzzer' (https://chromium.googlesource.com/chromium/llvm-project/llvm/lib/Fuzzer) registered for path 'casatools/grpc-source/third_party/bloaty/third_party/libFuzzer'
01-Oct-2026 09:39:52 Submodule 'third_party/re2' (https://github.com/google/re2) registered for path 'casatools/grpc-source/third_party/bloaty/third_party/re2'
01-Oct-2026 09:39:52 Cloning into '/Users/casaci/bamboohome/xml-data/build-dir/CASASPECS-DEVTESTPY312147-TTARM15PY312/casatools/grpc-source/third_party/bloaty/third_party/googletest'...
01-Oct-2026 09:39:53 Cloning into '/Users/casaci/bamboohome/xml-data/build-dir/CASASPECS-DEVTESTPY312147-TTARM15PY312/casatools/grpc-source/third_party/bloaty/third_party/libFuzzer'...
01-Oct-2026 09:39:53 Cloning into '/Users/casaci/bamboohome/xml-data/build-dir/CASASPECS-DEVTESTPY312147-TTARM15PY312/casatools/grpc-source/third_party/bloaty/third_party/re2'...
01-Oct-2026 09:39:54 Submodule path 'casatools/grpc-source/third_party/bloaty/third_party/googletest': checked out 'a2b8a8e07628e5fd60644b6dd99c1b5e7d7f1f47'
01-Oct-2026 09:39:54 Submodule path 'casatools/grpc-source/third_party/bloaty/third_party/libFuzzer': checked out '1b543d6e5073b56be214394890c9193979a3d7e1'
01-Oct-2026 09:39:54 Submodule path 'casatools/grpc-source/third_party/bloaty/third_party/re2': checked out 'c964d9b07816f9b52ca692e23b8b3dba33beec54'
01-Oct-2026 09:39:55 Submodule path 'casatools/grpc-source/third_party/boringssl': checked out 'be2ee342d3781ddb954f91f8a7e660c6f59e87e5'
01-Oct-2026 09:39:55 Submodule path 'casatools/grpc-source/third_party/boringssl-with-bazel': checked out '886e7d75368e3f4fab3f4d0d3584e4abfc557755'
01-Oct-2026 09:39:55 Submodule path 'casatools/grpc-source/third_party/cares/cares': checked out '3be1924221e1326df520f8498d704a5c4c8d0cce'
01-Oct-2026 09:39:55 Submodule path 'casatools/grpc-source/third_party/gflags': checked out '30dbc81fb5ffdc98ea9b14b1918bfe4e8779b26e'
01-Oct-2026 09:39:55 Submodule 'doc' (https://github.com/gflags/gflags.git) registered for path 'casatools/grpc-source/third_party/gflags/doc'
01-Oct-2026 09:39:55 Cloning into '/Users/casaci/bamboohome/xml-data/build-dir/CASASPECS-DEVTESTPY312147-TTARM15PY312/casatools/grpc-source/third_party/gflags/doc'...
01-Oct-2026 09:39:56 Submodule path 'casatools/grpc-source/third_party/gflags/doc': checked out '971dd2a4fadac9cdab174c523c22df79efd63aa5'
01-Oct-2026 09:39:56 Submodule path 'casatools/grpc-source/third_party/googletest': checked out 'ec44c6c1675c25b9827aacd08c02433cccde7780'
01-Oct-2026 09:39:56 Submodule path 'casatools/grpc-source/third_party/protobuf': checked out '2761122b810fe8861004ae785cc3ab39f384d342'
01-Oct-2026 09:39:56 Submodule 'third_party/benchmark' (https://github.com/google/benchmark.git) registered for path 'casatools/grpc-source/third_party/protobuf/third_party/benchmark'
01-Oct-2026 09:39:56 Cloning into '/Users/casaci/bamboohome/xml-data/build-dir/CASASPECS-DEVTESTPY312147-TTARM15PY312/casatools/grpc-source/third_party/protobuf/third_party/benchmark'...
01-Oct-2026 09:39:57 Submodule path 'casatools/grpc-source/third_party/protobuf/third_party/benchmark': checked out '360e66c1c4777c99402cf8cd535aa510fee16573'
01-Oct-2026 09:39:57 Submodule path 'casatools/grpc-source/third_party/zlib': checked out 'cacf7f1d4e3d44d871b605da3b647f07d718623f'
01-Oct-2026 09:39:57 Updated source code to revision: b7c9977a194ec0f6d5ce3a54c3a47be204959703
01-Oct-2026 09:39:57 Finished task 'Source Code Checkout' with result: Success
01-Oct-2026 09:39:57 Running pre-build action: Build Log Labeller Pre Build Action
01-Oct-2026 09:39:57 Running pre-build action: VCS Version Collector
01-Oct-2026 09:39:57 Build CASASPECS - Dev Test 3.12 - CAS-14849 - Test Tasks macOS 15 Py3.12 #6 (CASASPECS-DEVTESTPY312147-TTARM15PY312-6) started building on agent 'cbt-macos15-test-4' (Remote agent on host cbt-macos15-test-4)
01-Oct-2026 09:39:57 Starting task 'Update data' of type 'com.atlassian.bamboo.plugins.scripttask:task.builder.script'
01-Oct-2026 09:39:57
Beginning to execute external process for build 'CASASPECS - Dev Test 3.12 - CAS-14849 - Test Tasks macOS 15 Py3.12 #6 (CASASPECS-DEVTESTPY312147-TTARM15PY312-6)'
... running command line:
/Users/casaci/bamboohome/temp/CASASPECS-DEVTESTPY312147-TTARM15PY312-6-ScriptBuildTask-16028951203464359745.sh
... in: /Users/casaci/bamboohome/xml-data/build-dir/CASASPECS-DEVTESTPY312147-TTARM15PY312
01-Oct-2026 09:39:57 Already up to date.
01-Oct-2026 09:39:57 Updating ce38223d..486e9fb7
01-Oct-2026 09:39:57 error: Your local changes to the following files would be overwritten by merge:
01-Oct-2026 09:39:57         nrao/VLA/CalModels/3C138_K.im/table.dat
01-Oct-2026 09:39:57         nrao/VLA/CalModels/3C138_K.im/table.lock
01-Oct-2026 09:39:57 Please commit your changes or stash them before you merge.
01-Oct-2026 09:39:57 Aborting
01-Oct-2026 09:39:57 Done
01-Oct-2026 09:39:57 Finished task 'Update data' with result: Success
01-Oct-2026 09:39:57 Starting task 'Create wheel directory' of type 'com.atlassian.bamboo.plugins.scripttask:task.builder.script'
01-Oct-2026 09:39:57
Beginning to execute external process for build 'CASASPECS - Dev Test 3.12 - CAS-14849 - Test Tasks macOS 15 Py3.12 #6 (CASASPECS-DEVTESTPY312147-TTARM15PY312-6)'
... running command line:
/Users/casaci/bamboohome/temp/CASASPECS-DEVTESTPY312147-TTARM15PY312-6-ScriptBuildTask-8297208978822667492.sh
... in: /Users/casaci/bamboohome/xml-data/build-dir/CASASPECS-DEVTESTPY312147-TTARM15PY312
01-Oct-2026 09:39:57 Finished task 'Create wheel directory' with result: Success
01-Oct-2026 09:39:57 Starting task 'Get macOS 15 wheels' of type 'com.atlassian.bamboo.plugins.bamboo-artifact-downloader-plugin:artifactdownloadertask'
01-Oct-2026 09:39:57 Preparing to download plan result CASASPECS-DBC257-6 artifact: Non required shared artifact Http Compression On : [macOS 15 py3.12 tasks wheel], patterns: [casatasks*.whl] anchored at: [wheels]
01-Oct-2026 09:39:57 Retrieving artifact macOS 15 py3.12 tasks wheel for CASASPECS-DBC257-6 using Bamboo server artifact handler
01-Oct-2026 09:39:57 Artifact [macOS 15 py3.12 tasks wheel] downloaded successfully in 167.1 ms to wheeldirectory/
01-Oct-2026 09:39:57 Preparing to download plan result CASASPECS-DBC257-6 artifact: Non required shared artifact Http Compression On : [macOS 15 casatestutils 3.12], patterns: [casatestutils*.whl] anchored at: [wheels]
01-Oct-2026 09:39:57 Retrieving artifact macOS 15 casatestutils 3.12 for CASASPECS-DBC257-6 using Bamboo server artifact handler
01-Oct-2026 09:39:57 Artifact [macOS 15 casatestutils 3.12] downloaded successfully in 14.48 ms to wheeldirectory/
01-Oct-2026 09:39:57 Preparing to download plan result CASASPECS-DBC257-6 artifact: Non required shared artifact Http Compression On : [macOS 15 py3.12 tools wheel], patterns: [casatools*.whl] anchored at: [wheels]
01-Oct-2026 09:39:57 Retrieving artifact macOS 15 py3.12 tools wheel for CASASPECS-DBC257-6 using Bamboo server artifact handler
01-Oct-2026 09:40:01 Artifact [macOS 15 py3.12 tools wheel] downloaded successfully in 3.898 s to wheeldirectory/
01-Oct-2026 09:40:01 Finished task 'Get macOS 15 wheels' with result: Success
01-Oct-2026 09:40:01
Substituting variable: ${bamboo.repository.branch.name} with CAS-14849
01-Oct-2026 09:40:01
Substituting variable: ${bamboo.planRepository.branchName} with CAS-14849
01-Oct-2026 09:40:01 Starting task 'Test wheel' of type 'com.atlassian.bamboo.plugins.scripttask:task.builder.script'
01-Oct-2026 09:40:01
Beginning to execute external process for build 'CASASPECS - Dev Test 3.12 - CAS-14849 - Test Tasks macOS 15 Py3.12 #6 (CASASPECS-DEVTESTPY312147-TTARM15PY312-6)'
... running command line:
/Users/casaci/bamboohome/temp/CASASPECS-DEVTESTPY312147-TTARM15PY312-6-ScriptBuildTask-8063122787572917390.sh
... in: /Users/casaci/bamboohome/xml-data/build-dir/CASASPECS-DEVTESTPY312147-TTARM15PY312
01-Oct-2026 09:40:01 branch: CAS-14849
01-Oct-2026 09:40:01 branch: CAS-14849
01-Oct-2026 09:40:01 Testing wheel
01-Oct-2026 09:40:01   % Total    % Received % Xferd  Average Speed   Time    Time     Time  Current
01-Oct-2026 09:40:01                                  Dload  Upload   Total   Spent    Left  Speed
01-Oct-2026 09:40:01
01-Oct-2026 09:40:01   0     0    0     0    0     0      0      0 --:--:-- --:--:-- --:--:--     0
01-Oct-2026 09:40:02 16 9419k   16 1578k    0     0  25.5M      0 --:--:-- --:--:-- --:--:-- 25.2M
01-Oct-2026 09:40:02 100 9419k  100 9419k    0     0  52.0M      0 --:--:-- --:--:-- --:--:-- 51.9M
01-Oct-2026 09:40:06 Ticket fix version: CASA 6.ACTIVE
01-Oct-2026 09:40:06 No matching version found
01-Oct-2026 09:40:06   % Total    % Received % Xferd  Average Speed   Time    Time     Time  Current
01-Oct-2026 09:40:06                                  Dload  Upload   Total   Spent    Left  Speed
01-Oct-2026 09:40:06
01-Oct-2026 09:40:06   0     0    0     0    0     0      0      0 --:--:-- --:--:-- --:--:--     0
01-Oct-2026 09:40:06 100   201  100   201    0     0   4623      0 --:--:-- --:--:-- --:--:--  4674
01-Oct-2026 09:40:06   % Total    % Received % Xferd  Average Speed   Time    Time     Time  Current
01-Oct-2026 09:40:06                                  Dload  Upload   Total   Spent    Left  Speed
01-Oct-2026 09:40:06
01-Oct-2026 09:40:06   0     0    0     0    0     0      0      0 --:--:-- --:--:-- --:--:--     0
01-Oct-2026 09:40:06 100   511  100   511    0     0  18926      0 --:--:-- --:--:-- --:--:-- 19653
01-Oct-2026 09:40:06 bamboo_jira_components:''
01-Oct-2026 09:40:06 bamboo_testlist:''
01-Oct-2026 09:40:11 atlutil components: casaconfig
01-Oct-2026 09:40:11 Ticket components: casaconfig
01-Oct-2026 09:42:24 Switched to a new branch 'CAS-14849'
01-Oct-2026 09:42:24 branch 'CAS-14849' set up to track 'origin/CAS-14849'.
01-Oct-2026 09:42:24 Updated 0 paths from fb45b40137
01-Oct-2026 09:42:24 Updated 0 paths from 8bbfc69a0b
01-Oct-2026 09:42:24 Requirement already satisfied: pip in /Users/casaci/bamboohome/xml-data/build-dir/CASASPECS-DEVTESTPY312147-TTARM15PY312/casa6testenv/lib/python3.12/site-packages (24.3.1)
01-Oct-2026 09:42:25 Collecting pip
01-Oct-2026 09:42:25   Downloading pip-26.2.1-py3-none-any.whl.metadata (4.6 kB)
01-Oct-2026 09:42:25 Collecting setuptools
01-Oct-2026 09:42:25   Downloading setuptools-84.0.0-py3-none-any.whl.metadata (6.6 kB)
01-Oct-2026 09:42:25 Collecting wheel
01-Oct-2026 09:42:25   Downloading wheel-0.48.0-py3-none-any.whl.metadata (2.3 kB)
01-Oct-2026 09:42:25 Collecting packaging>=24.0 (from wheel)
01-Oct-2026 09:42:25   Downloading packaging-26.3-py3-none-any.whl.metadata (3.5 kB)
01-Oct-2026 09:42:25 Downloading pip-26.2.1-py3-none-any.whl (1.8 MB)
01-Oct-2026 09:42:25    ━━━━━━━━━━━━━━━━━━━━━━━━━━━━━━━━━━━━━━━━ 1.8/1.8 MB 53.4 MB/s eta 0:00:00
01-Oct-2026 09:42:25 Downloading setuptools-84.0.0-py3-none-any.whl (818 kB)
01-Oct-2026 09:42:25    ━━━━━━━━━━━━━━━━━━━━━━━━━━━━━━━━━━━━━━━━ 818.2/818.2 kB 58.8 MB/s eta 0:00:00
01-Oct-2026 09:42:25 Downloading wheel-0.48.0-py3-none-any.whl (33 kB)
01-Oct-2026 09:42:25 Downloading packaging-26.3-py3-none-any.whl (129 kB)
01-Oct-2026 09:42:25 Installing collected packages: setuptools, pip, packaging, wheel
01-Oct-2026 09:42:25   Attempting uninstall: pip
01-Oct-2026 09:42:25     Found existing installation: pip 24.3.1
01-Oct-2026 09:42:25     Uninstalling pip-24.3.1:
01-Oct-2026 09:42:25       Successfully uninstalled pip-24.3.1
01-Oct-2026 09:42:26 Successfully installed packaging-26.3 pip-26.2.1 setuptools-84.0.0 wheel-0.48.0
01-Oct-2026 09:42:26 Looking in indexes: https://pypi.org/simple, https://test.pypi.org/simple
01-Oct-2026 09:42:26 Collecting casaconfig==1.5.2
01-Oct-2026 09:42:26   Downloading casaconfig-1.5.2-py3-none-any.whl.metadata (4.0 kB)
01-Oct-2026 09:42:27 Collecting certifi>=2023.5.7 (from casaconfig==1.5.2)
01-Oct-2026 09:42:27   Using cached certifi-2026.7.22-py3-none-any.whl.metadata (2.5 kB)
01-Oct-2026 09:42:27 Downloading casaconfig-1.5.2-py3-none-any.whl (77 kB)
01-Oct-2026 09:42:27 Using cached certifi-2026.7.22-py3-none-any.whl (136 kB)
01-Oct-2026 09:42:27 Installing collected packages: certifi, casaconfig
01-Oct-2026 09:42:27
01-Oct-2026 09:42:27 Successfully installed casaconfig-1.5.2 certifi-2026.7.22
01-Oct-2026 09:42:27 Collecting scipy
01-Oct-2026 09:42:27   Downloading scipy-1.18.1-cp312-cp312-macosx_14_0_arm64.whl.metadata (62 kB)
01-Oct-2026 09:42:27 Collecting numpy
01-Oct-2026 09:42:27   Downloading numpy-2.5.3-cp312-cp312-macosx_14_0_arm64.whl.metadata (6.6 kB)
01-Oct-2026 09:42:27 Downloading scipy-1.18.1-cp312-cp312-macosx_14_0_arm64.whl (20.5 MB)
01-Oct-2026 09:42:27    ━━━━━━━━━━━━━━━━━━━━━━━━━━━━━━━━━━━━━━━━ 20.5/20.5 MB 79.0 MB/s  0:00:00
01-Oct-2026 09:42:27 Downloading numpy-2.5.3-cp312-cp312-macosx_14_0_arm64.whl (5.4 MB)
01-Oct-2026 09:42:27    ━━━━━━━━━━━━━━━━━━━━━━━━━━━━━━━━━━━━━━━━ 5.4/5.4 MB 87.3 MB/s  0:00:00
01-Oct-2026 09:42:28 Installing collected packages: numpy, scipy
01-Oct-2026 09:42:31
01-Oct-2026 09:42:31 Successfully installed numpy-2.5.3 scipy-1.18.1
01-Oct-2026 09:42:32 Processing ./casatools-6.7.7.7a14849.dev4-cp312-cp312-macosx_15_0_arm64.whl
01-Oct-2026 09:42:32 Requirement already satisfied: numpy in /Users/casaci/bamboohome/xml-data/build-dir/CASASPECS-DEVTESTPY312147-TTARM15PY312/casa6testenv/lib/python3.12/site-packages (from casatools==6.7.7.7a14849.dev4) (2.5.3)
01-Oct-2026 09:42:32 Requirement already satisfied: casaconfig in /Users/casaci/bamboohome/xml-data/build-dir/CASASPECS-DEVTESTPY312147-TTARM15PY312/casa6testenv/lib/python3.12/site-packages (from casatools==6.7.7.7a14849.dev4) (1.5.2)
01-Oct-2026 09:42:32 Requirement already satisfied: certifi>=2023.5.7 in /Users/casaci/bamboohome/xml-data/build-dir/CASASPECS-DEVTESTPY312147-TTARM15PY312/casa6testenv/lib/python3.12/site-packages (from casaconfig->casatools==6.7.7.7a14849.dev4) (2026.7.22)
01-Oct-2026 09:42:32 Installing collected packages: casatools
01-Oct-2026 09:42:32 Successfully installed casatools-6.7.7.7a14849.dev4
01-Oct-2026 09:42:33 Processing ./casatasks-6.7.7.7a14849.dev4-py3-none-any.whl
01-Oct-2026 09:42:33 Requirement already satisfied: casatools==6.7.7.7a14849.dev4 in /Users/casaci/bamboohome/xml-data/build-dir/CASASPECS-DEVTESTPY312147-TTARM15PY312/casa6testenv/lib/python3.12/site-packages (from casatasks==6.7.7.7a14849.dev4) (6.7.7.7a14849.dev4)
01-Oct-2026 09:42:33 Collecting matplotlib (from casatasks==6.7.7.7a14849.dev4)
01-Oct-2026 09:42:33   Using cached matplotlib-3.11.2-cp312-cp312-macosx_11_0_arm64.whl.metadata (80 kB)
01-Oct-2026 09:42:33 Requirement already satisfied: scipy in /Users/casaci/bamboohome/xml-data/build-dir/CASASPECS-DEVTESTPY312147-TTARM15PY312/casa6testenv/lib/python3.12/site-packages (from casatasks==6.7.7.7a14849.dev4) (1.18.1)
01-Oct-2026 09:42:33 Requirement already satisfied: certifi in /Users/casaci/bamboohome/xml-data/build-dir/CASASPECS-DEVTESTPY312147-TTARM15PY312/casa6testenv/lib/python3.12/site-packages (from casatasks==6.7.7.7a14849.dev4) (2026.7.22)
01-Oct-2026 09:42:33 Collecting pyerfa (from casatasks==6.7.7.7a14849.dev4)
01-Oct-2026 09:42:33   Using cached pyerfa-2.0.1.5-cp39-abi3-macosx_11_0_arm64.whl.metadata (5.7 kB)
01-Oct-2026 09:42:33 Requirement already satisfied: numpy in /Users/casaci/bamboohome/xml-data/build-dir/CASASPECS-DEVTESTPY312147-TTARM15PY312/casa6testenv/lib/python3.12/site-packages (from casatools==6.7.7.7a14849.dev4->casatasks==6.7.7.7a14849.dev4) (2.5.3)
01-Oct-2026 09:42:33 Requirement already satisfied: casaconfig in /Users/casaci/bamboohome/xml-data/build-dir/CASASPECS-DEVTESTPY312147-TTARM15PY312/casa6testenv/lib/python3.12/site-packages (from casatools==6.7.7.7a14849.dev4->casatasks==6.7.7.7a14849.dev4) (1.5.2)
01-Oct-2026 09:42:33 Collecting contourpy>=1.0.1 (from matplotlib->casatasks==6.7.7.7a14849.dev4)
01-Oct-2026 09:42:33   Using cached contourpy-1.4.0-cp312-cp312-macosx_11_0_arm64.whl.metadata (3.8 kB)
01-Oct-2026 09:42:33 Collecting cycler>=0.10 (from matplotlib->casatasks==6.7.7.7a14849.dev4)
01-Oct-2026 09:42:33   Using cached cycler-0.12.1-py3-none-any.whl.metadata (3.8 kB)
01-Oct-2026 09:42:33 Collecting fonttools>=4.28.2 (from matplotlib->casatasks==6.7.7.7a14849.dev4)
01-Oct-2026 09:42:33   Using cached fonttools-4.66.1-cp312-cp312-macosx_10_13_universal2.whl.metadata (130 kB)
01-Oct-2026 09:42:33 Collecting kiwisolver>=1.3.1 (from matplotlib->casatasks==6.7.7.7a14849.dev4)
01-Oct-2026 09:42:33   Using cached kiwisolver-1.5.1-cp312-cp312-macosx_11_0_arm64.whl.metadata (5.2 kB)
01-Oct-2026 09:42:33 Requirement already satisfied: packaging>=20.0 in /Users/casaci/bamboohome/xml-data/build-dir/CASASPECS-DEVTESTPY312147-TTARM15PY312/casa6testenv/lib/python3.12/site-packages (from matplotlib->casatasks==6.7.7.7a14849.dev4) (26.3)
01-Oct-2026 09:42:33 Collecting pillow>=9 (from matplotlib->casatasks==6.7.7.7a14849.dev4)
01-Oct-2026 09:42:33   Using cached pillow-12.3.0-cp312-cp312-macosx_11_0_arm64.whl.metadata (9.1 kB)
01-Oct-2026 09:42:33 Collecting pyparsing>=3 (from matplotlib->casatasks==6.7.7.7a14849.dev4)
01-Oct-2026 09:42:33   Using cached pyparsing-3.3.3-py3-none-any.whl.metadata (5.9 kB)
01-Oct-2026 09:42:33 Collecting python-dateutil>=2.7 (from matplotlib->casatasks==6.7.7.7a14849.dev4)
01-Oct-2026 09:42:33   Using cached python_dateutil-2.9.0.post0-py2.py3-none-any.whl.metadata (8.4 kB)
01-Oct-2026 09:42:33 Collecting six>=1.5 (from python-dateutil>=2.7->matplotlib->casatasks==6.7.7.7a14849.dev4)
01-Oct-2026 09:42:33   Using cached six-1.17.0-py2.py3-none-any.whl.metadata (1.7 kB)
01-Oct-2026 09:42:33 Using cached matplotlib-3.11.2-cp312-cp312-macosx_11_0_arm64.whl (9.3 MB)
01-Oct-2026 09:42:33 Using cached contourpy-1.4.0-cp312-cp312-macosx_11_0_arm64.whl (284 kB)
01-Oct-2026 09:42:33 Using cached cycler-0.12.1-py3-none-any.whl (8.3 kB)
01-Oct-2026 09:42:33 Using cached fonttools-4.66.1-cp312-cp312-macosx_10_13_universal2.whl (3.1 MB)
01-Oct-2026 09:42:33 Using cached kiwisolver-1.5.1-cp312-cp312-macosx_11_0_arm64.whl (64 kB)
01-Oct-2026 09:42:33 Using cached pillow-12.3.0-cp312-cp312-macosx_11_0_arm64.whl (4.8 MB)
01-Oct-2026 09:42:33 Using cached pyparsing-3.3.3-py3-none-any.whl (126 kB)
01-Oct-2026 09:42:33 Using cached python_dateutil-2.9.0.post0-py2.py3-none-any.whl (229 kB)
01-Oct-2026 09:42:33 Using cached six-1.17.0-py2.py3-none-any.whl (11 kB)
01-Oct-2026 09:42:33 Using cached pyerfa-2.0.1.5-cp39-abi3-macosx_11_0_arm64.whl (329 kB)
01-Oct-2026 09:42:33 Installing collected packages: six, pyparsing, pyerfa, pillow, kiwisolver, fonttools, cycler, contourpy, python-dateutil, matplotlib, casatasks
01-Oct-2026 09:42:36
01-Oct-2026 09:42:36 Successfully installed casatasks-6.7.7.7a14849.dev4 contourpy-1.4.0 cycler-0.12.1 fonttools-4.66.1 kiwisolver-1.5.1 matplotlib-3.11.2 pillow-12.3.0 pyerfa-2.0.1.5 pyparsing-3.3.3 python-dateutil-2.9.0.post0 six-1.17.0
01-Oct-2026 09:42:36 Processing ./casatestutils-6.7.7.7a14849.dev4-py3-none-any.whl
01-Oct-2026 09:42:36 Collecting pytest>=6.0 (from casatestutils==6.7.7.7a14849.dev4)
01-Oct-2026 09:42:36   Using cached pytest-9.1.1-py3-none-any.whl.metadata (7.6 kB)
01-Oct-2026 09:42:36 Collecting astropy (from casatestutils==6.7.7.7a14849.dev4)
01-Oct-2026 09:42:36   Using cached astropy-8.0.1-cp311-abi3-macosx_11_0_arm64.whl.metadata (11 kB)
01-Oct-2026 09:42:36 Collecting iniconfig>=1.0.1 (from pytest>=6.0->casatestutils==6.7.7.7a14849.dev4)
01-Oct-2026 09:42:36   Using cached iniconfig-2.3.0-py3-none-any.whl.metadata (2.5 kB)
01-Oct-2026 09:42:36 Requirement already satisfied: packaging>=22 in /Users/casaci/bamboohome/xml-data/build-dir/CASASPECS-DEVTESTPY312147-TTARM15PY312/casa6testenv/lib/python3.12/site-packages (from pytest>=6.0->casatestutils==6.7.7.7a14849.dev4) (26.3)
01-Oct-2026 09:42:36 Collecting pluggy<2,>=1.5 (from pytest>=6.0->casatestutils==6.7.7.7a14849.dev4)
01-Oct-2026 09:42:36   Using cached pluggy-1.6.0-py3-none-any.whl.metadata (4.8 kB)
01-Oct-2026 09:42:36 Collecting pygments>=2.7.2 (from pytest>=6.0->casatestutils==6.7.7.7a14849.dev4)
01-Oct-2026 09:42:36   Using cached pygments-2.21.0-py3-none-any.whl.metadata (2.5 kB)
01-Oct-2026 09:42:36 Collecting astropy-iers-data>=0.2026.6.22.1.23.34 (from astropy->casatestutils==6.7.7.7a14849.dev4)
01-Oct-2026 09:42:36   Using cached astropy_iers_data-0.2026.9.28.0.59.37-py3-none-any.whl.metadata (3.4 kB)
01-Oct-2026 09:42:36 Requirement already satisfied: numpy>=2.0 in /Users/casaci/bamboohome/xml-data/build-dir/CASASPECS-DEVTESTPY312147-TTARM15PY312/casa6testenv/lib/python3.12/site-packages (from astropy->casatestutils==6.7.7.7a14849.dev4) (2.5.3)
01-Oct-2026 09:42:36 Requirement already satisfied: pyerfa>=2.0.1.3 in /Users/casaci/bamboohome/xml-data/build-dir/CASASPECS-DEVTESTPY312147-TTARM15PY312/casa6testenv/lib/python3.12/site-packages (from astropy->casatestutils==6.7.7.7a14849.dev4) (2.0.1.5)
01-Oct-2026 09:42:36 Collecting PyYAML>=6.0.0 (from astropy->casatestutils==6.7.7.7a14849.dev4)
01-Oct-2026 09:42:36   Using cached pyyaml-6.0.3-cp312-cp312-macosx_11_0_arm64.whl.metadata (2.4 kB)
01-Oct-2026 09:42:36 Using cached pytest-9.1.1-py3-none-any.whl (386 kB)
01-Oct-2026 09:42:36 Using cached pluggy-1.6.0-py3-none-any.whl (20 kB)
01-Oct-2026 09:42:36 Using cached iniconfig-2.3.0-py3-none-any.whl (7.5 kB)
01-Oct-2026 09:42:36 Using cached pygments-2.21.0-py3-none-any.whl (1.3 MB)
01-Oct-2026 09:42:36 Using cached astropy-8.0.1-cp311-abi3-macosx_11_0_arm64.whl (6.6 MB)
01-Oct-2026 09:42:36 Using cached astropy_iers_data-0.2026.9.28.0.59.37-py3-none-any.whl (2.0 MB)
01-Oct-2026 09:42:36 Using cached pyyaml-6.0.3-cp312-cp312-macosx_11_0_arm64.whl (173 kB)
01-Oct-2026 09:42:37 Installing collected packages: PyYAML, pygments, pluggy, iniconfig, astropy-iers-data, pytest, astropy, casatestutils
01-Oct-2026 09:42:39
01-Oct-2026 09:42:39 Successfully installed PyYAML-6.0.3 astropy-8.0.1 astropy-iers-data-0.2026.9.28.0.59.37 casatestutils-6.7.7.7a14849.dev4 iniconfig-2.3.0 pluggy-1.6.0 pygments-2.21.0 pytest-9.1.1
01-Oct-2026 09:42:39 Config:
01-Oct-2026 09:42:39 datapath=["/opt/casa/data/casa-data", "/opt/casa/data/casatestdata"]
01-Oct-2026 09:42:39 rundata="/opt/casa/data/casa-data"
01-Oct-2026 09:42:39 measurespath="/opt/casa/data/casa-data"
01-Oct-2026 09:42:39 data_auto_update=False
01-Oct-2026 09:42:39 measures_auto_update=False
01-Oct-2026 09:42:46 Switched to a new branch 'CAS-14849'
01-Oct-2026 09:42:46 branch 'CAS-14849' set up to track 'origin/CAS-14849'.
01-Oct-2026 09:42:46 python runtest.py --ignore_list 'test_casampi,test_task_msview,test_task_imview,test_task_plotms' -t ./casaconfig/tests
01-Oct-2026 09:42:47 ============================= test session starts ==============================
01-Oct-2026 09:42:47 platform darwin -- Python 3.12.8, pytest-9.1.1, pluggy-1.6.0 -- /Users/casaci/bamboohome/xml-data/build-dir/CASASPECS-DEVTESTPY312147-TTARM15PY312/casa6testenv/bin/python
01-Oct-2026 09:42:47 cachedir: .pytest_cache
01-Oct-2026 09:42:47 rootdir: /Users/casaci/bamboohome/xml-data/build-dir/CASASPECS-DEVTESTPY312147-TTARM15PY312/casa6/casatestutils/nosedir/test_casaconfig
01-Oct-2026 09:42:47 configfile: pytest.ini
01-Oct-2026 09:42:47 collecting ... collected 13 items
01-Oct-2026 09:42:47
01-Oct-2026 09:42:47
01-Oct-2026 09:43:31 test_casaconfig.py::casaconfig_test::test_auto_install_data
01-Oct-2026 09:43:31 Test auto install of all data to measurespath on casatools startup
01-Oct-2026 09:43:31 PASSED
01-Oct-2026 09:43:31
01-Oct-2026 09:43:31 test_casaconfig.py::casaconfig_test::test_auto_update_measures
01-Oct-2026 09:43:31 Test Automatic Measures Updates to measurespath
01-Oct-2026 09:43:31 pull_data using version casarundata-2026.02.19-1.tar.gz, acquiring the lock ...
01-Oct-2026 09:43:38 downloading casarundata contents to  /Users/casaci/bamboohome/xml-data/build-dir/CASASPECS-DEVTESTPY312147-TTARM15PY312/casa6/casatestutils/nosedir/test_casaconfig/testrundata (336M) ... done
01-Oct-2026 09:43:48 casarundata installed casarundata-2026.02.19-1.tar.gz at /Users/casaci/bamboohome/xml-data/build-dir/CASASPECS-DEVTESTPY312147-TTARM15PY312/casa6/casatestutils/nosedir/test_casaconfig/testrundata
01-Oct-2026 09:43:48 PASSED
01-Oct-2026 09:43:48
01-Oct-2026 09:43:49 test_casaconfig.py::casaconfig_test::test_casaconfig_measures_available
01-Oct-2026 09:43:49 Test That Today or Yesterday measures data is returned
01-Oct-2026 09:43:49 FAILED
01-Oct-2026 09:43:49
01-Oct-2026 09:43:57 test_casaconfig.py::casaconfig_test::test_casaconfig_measures_update
01-Oct-2026 09:43:57 Test downgrade to upgrade measures data to location
01-Oct-2026 09:43:57 measures_update ... acquiring the lock ...
01-Oct-2026 09:43:57 A measures update has been requested by the force argument
01-Oct-2026 09:43:57   ... finding available measures ...
01-Oct-2026 09:43:57   ... downloading ./WSRT_Measures_20260929-160001.ztar from https://iers.astron.nl/ to /Users/casaci/bamboohome/xml-data/build-dir/CASASPECS-DEVTESTPY312147-TTARM15PY312/casa6/casatestutils/nosedir/test_casaconfig/testmeasures ...
01-Oct-2026 09:43:57   ... measures data updated at /Users/casaci/bamboohome/xml-data/build-dir/CASASPECS-DEVTESTPY312147-TTARM15PY312/casa6/casatestutils/nosedir/test_casaconfig/testmeasures
01-Oct-2026 09:43:57 measures_update ... acquiring the lock ...
01-Oct-2026 09:43:57   ... finding available measures ...
01-Oct-2026 09:43:57   ... downloading ./WSRT_Measures_20260928-160001.ztar from https://iers.astron.nl/ to /Users/casaci/bamboohome/xml-data/build-dir/CASASPECS-DEVTESTPY312147-TTARM15PY312/casa6/casatestutils/nosedir/test_casaconfig/testmeasures ...
01-Oct-2026 09:43:57   ... measures data updated at /Users/casaci/bamboohome/xml-data/build-dir/CASASPECS-DEVTESTPY312147-TTARM15PY312/casa6/casatestutils/nosedir/test_casaconfig/testmeasures
01-Oct-2026 09:43:57 PASSED
01-Oct-2026 09:43:57
01-Oct-2026 09:43:58 test_casaconfig.py::casaconfig_test::test_config_import
01-Oct-2026 09:43:58 Tests of the config import
01-Oct-2026 09:43:58 PASSED
01-Oct-2026 09:43:58
01-Oct-2026 09:43:58 test_casaconfig.py::casaconfig_test::test_daily_update
01-Oct-2026 09:43:58 test that updates do not happen if the installed data is less than 1 day old and do happen when they are older
01-Oct-2026 09:43:58 pull_data using version casarundata-2025.12.12-1.tar.gz, acquiring the lock ...
01-Oct-2026 09:44:05 downloading casarundata contents to  /Users/casaci/bamboohome/xml-data/build-dir/CASASPECS-DEVTESTPY312147-TTARM15PY312/casa6/casatestutils/nosedir/test_casaconfig/testrundata (336M) ... done
01-Oct-2026 09:44:12 casarundata installed casarundata-2025.12.12-1.tar.gz at /Users/casaci/bamboohome/xml-data/build-dir/CASASPECS-DEVTESTPY312147-TTARM15PY312/casa6/casatestutils/nosedir/test_casaconfig/testrundata
01-Oct-2026 09:44:12 data_update: version installed or checked less than 1 day(s) ago, nothing updated or checked
01-Oct-2026 09:44:12 measures_update: version installed or checked less than 1 day(s) ago, nothing updated or checked
01-Oct-2026 09:44:12 data_update: version installed or checked less than 1 day(s) ago, nothing updated or checked
01-Oct-2026 09:44:12 measures_update ... acquiring the lock ...
01-Oct-2026 09:44:12   ... finding available measures ...
01-Oct-2026 09:44:12   ... downloading ./WSRT_Measures_20260929-160001.ztar from https://iers.astron.nl/ to /Users/casaci/bamboohome/xml-data/build-dir/CASASPECS-DEVTESTPY312147-TTARM15PY312/casa6/casatestutils/nosedir/test_casaconfig/testrundata ...
01-Oct-2026 09:44:12   ... measures data updated at /Users/casaci/bamboohome/xml-data/build-dir/CASASPECS-DEVTESTPY312147-TTARM15PY312/casa6/casatestutils/nosedir/test_casaconfig/testrundata
01-Oct-2026 09:44:12 data_update using version casarundata-2026.02.19-1.tar.gz, acquiring the lock ...
01-Oct-2026 09:44:12 Removing files using manifest from previous install of casarundata-2025.12.12-1.tar.gz on 2026-10-01
01-Oct-2026 09:44:19 downloading casarundata contents to  /Users/casaci/bamboohome/xml-data/build-dir/CASASPECS-DEVTESTPY312147-TTARM15PY312/casa6/casatestutils/nosedir/test_casaconfig/testrundata (336M) ... done
01-Oct-2026 09:44:26 casarundata installed casarundata-2026.02.19-1.tar.gz at /Users/casaci/bamboohome/xml-data/build-dir/CASASPECS-DEVTESTPY312147-TTARM15PY312/casa6/casatestutils/nosedir/test_casaconfig/testrundata
01-Oct-2026 09:44:26 measures_update ... acquiring the lock ...
01-Oct-2026 09:44:26   ... finding available measures ...
01-Oct-2026 09:44:26   ... downloading ./WSRT_Measures_20260929-160001.ztar from https://iers.astron.nl/ to /Users/casaci/bamboohome/xml-data/build-dir/CASASPECS-DEVTESTPY312147-TTARM15PY312/casa6/casatestutils/nosedir/test_casaconfig/testrundata ...
01-Oct-2026 09:44:26   ... measures data updated at /Users/casaci/bamboohome/xml-data/build-dir/CASASPECS-DEVTESTPY312147-TTARM15PY312/casa6/casatestutils/nosedir/test_casaconfig/testrundata
01-Oct-2026 09:44:26 PASSED
01-Oct-2026 09:44:26
01-Oct-2026 09:44:26 test_casaconfig.py::casaconfig_test::test_exceptions_no_data
01-Oct-2026 09:44:26 test that exceptions that do not require any data happen when expected
01-Oct-2026 09:44:26 PASSED
01-Oct-2026 09:44:26
01-Oct-2026 09:44:26 test_casaconfig.py::casaconfig_test::test_exceptions_with_data
01-Oct-2026 09:44:26 test that exceptions that require data happen when expected
01-Oct-2026 09:44:26 pull_data using version casarundata-2026.02.19-1.tar.gz, acquiring the lock ...
01-Oct-2026 09:44:34 downloading casarundata contents to  /Users/casaci/bamboohome/xml-data/build-dir/CASASPECS-DEVTESTPY312147-TTARM15PY312/casa6/casatestutils/nosedir/test_casaconfig/testrundata (336M) ... done
01-Oct-2026 09:44:36 lock file is not empty : /Users/casaci/bamboohome/xml-data/build-dir/CASASPECS-DEVTESTPY312147-TTARM15PY312/casa6/casatestutils/nosedir/test_casaconfig/testrundata/data_update.lock
01-Oct-2026 09:44:36 The lock file at /Users/casaci/bamboohome/xml-data/build-dir/CASASPECS-DEVTESTPY312147-TTARM15PY312/casa6/casatestutils/nosedir/test_casaconfig/testrundata is not empty.
01-Oct-2026 09:44:36 A previous attempt to update path may have failed or exited prematurely.
01-Oct-2026 09:44:36 Remove the lock file and set force to True with the desired version (default to most recent).
01-Oct-2026 09:44:36 It may be best to completely repopulate path using pull_data and measures_update.
01-Oct-2026 09:44:36 lock file is not empty : /Users/casaci/bamboohome/xml-data/build-dir/CASASPECS-DEVTESTPY312147-TTARM15PY312/casa6/casatestutils/nosedir/test_casaconfig/testrundata/data_update.lock
01-Oct-2026 09:44:36 data_update: the lock file at /Users/casaci/bamboohome/xml-data/build-dir/CASASPECS-DEVTESTPY312147-TTARM15PY312/casa6/casatestutils/nosedir/test_casaconfig/testrundata is not empty.
01-Oct-2026 09:44:36 A previous attempt to update path may have failed or exited prematurely.
01-Oct-2026 09:44:36 Remove the lock file and set force to True with the desired version (default to most recent).
01-Oct-2026 09:44:36 It may be best to completely re-populate path using pull_data and measures_update.
01-Oct-2026 09:44:36 casarundata installed casarundata-2026.02.19-1.tar.gz at /Users/casaci/bamboohome/xml-data/build-dir/CASASPECS-DEVTESTPY312147-TTARM15PY312/casa6/casatestutils/nosedir/test_casaconfig/testrundata
01-Oct-2026 09:44:36 measures_update ... acquiring the lock ...
01-Oct-2026 09:44:36 data_update using version casarundata-2024.02.09-1.tar.gz, acquiring the lock ...
01-Oct-2026 09:44:36 PASSED
01-Oct-2026 09:44:36
01-Oct-2026 09:44:36 test_casaconfig.py::casaconfig_test::test_file_exists
01-Oct-2026 09:44:36 Test Default config.py exists in casaconfig module
01-Oct-2026 09:44:36 PASSED
01-Oct-2026 09:44:36
01-Oct-2026 09:44:39 test_casaconfig.py::casaconfig_test::test_import_casatools_bad_measurespath
01-Oct-2026 09:44:39 Test that import casatools will return ImportError with measurespath set to an empty directory that cannot be written to
01-Oct-2026 09:44:39 PASSED
01-Oct-2026 09:44:39
01-Oct-2026 09:46:56 measures_update can't find specified version ./WSRT_Measures_20260927-160001.ztar at site https://go.nrao.edu/iers/
01-Oct-2026 09:49:22 measures_update can't find specified version NRAO_Measures_20260927-140501.ztar at site https://iers.astron.nl/
01-Oct-2026 09:49:23 Unable to retrieve list of available measures versions, measures_site value may be an empty list or no files were found at measures_site, check and try again.
01-Oct-2026 09:49:23 There was a remote error while attempting to update measures at /Users/casaci/bamboohome/xml-data/build-dir/CASASPECS-DEVTESTPY312147-TTARM15PY312/casa6/casatestutils/nosedir/test_casaconfig/testmeasures
01-Oct-2026 09:49:23 Check the value of measures_site and try again
01-Oct-2026 09:49:23 test_casaconfig.py::casaconfig_test::test_measures_site
01-Oct-2026 09:49:23 tests related to measures site
01-Oct-2026 09:49:23 Warning: the most recent measures tar file at each of the sites was older than config.measures_site_interval
01-Oct-2026 09:49:23 https://go.nrao.edu/iers/ had the most recent measures tar file, returning that list
01-Oct-2026 09:49:23 Warning: the most recent measures tar file at each of the sites was older than config.measures_site_interval
01-Oct-2026 09:49:23 https://go.nrao.edu/iers/ had the most recent measures tar file, returning that list
01-Oct-2026 09:49:23 measures_update ... acquiring the lock ...
01-Oct-2026 09:49:23 A measures update has been requested by the force argument
01-Oct-2026 09:49:23   ... finding available measures ...
01-Oct-2026 09:49:23   ... downloading ./WSRT_Measures_20260929-160001.ztar from https://iers.astron.nl/ to /Users/casaci/bamboohome/xml-data/build-dir/CASASPECS-DEVTESTPY312147-TTARM15PY312/casa6/casatestutils/nosedir/test_casaconfig/testmeasures ...
01-Oct-2026 09:49:23   ... measures data updated at /Users/casaci/bamboohome/xml-data/build-dir/CASASPECS-DEVTESTPY312147-TTARM15PY312/casa6/casatestutils/nosedir/test_casaconfig/testmeasures
01-Oct-2026 09:49:23 di : {'site': 'https://iers.astron.nl/', 'version': './WSRT_Measures_20260929-160001.ztar', 'date': '2026-10-01', 'age': 1.9316320066098813e-09}
01-Oct-2026 09:49:23 measures_update ... acquiring the lock ...
01-Oct-2026 09:49:23 A measures update has been requested by the force argument
01-Oct-2026 09:49:23   ... finding available measures ...
01-Oct-2026 09:49:23   ... downloading ./WSRT_Measures_20260927-160001.ztar from https://iers.astron.nl/ to /Users/casaci/bamboohome/xml-data/build-dir/CASASPECS-DEVTESTPY312147-TTARM15PY312/casa6/casatestutils/nosedir/test_casaconfig/testmeasures ...
01-Oct-2026 09:49:23   ... measures data updated at /Users/casaci/bamboohome/xml-data/build-dir/CASASPECS-DEVTESTPY312147-TTARM15PY312/casa6/casatestutils/nosedir/test_casaconfig/testmeasures
01-Oct-2026 09:49:23 measures_update ... acquiring the lock ...
01-Oct-2026 09:49:23 A measures update has been requested by the force argument
01-Oct-2026 09:49:23   ... finding available measures ...
01-Oct-2026 09:49:23   ... downloading ./WSRT_Measures_20260927-160001.ztar from https://iers.astron.nl/ to /Users/casaci/bamboohome/xml-data/build-dir/CASASPECS-DEVTESTPY312147-TTARM15PY312/casa6/casatestutils/nosedir/test_casaconfig/testmeasures ...
01-Oct-2026 09:49:23   ... measures data updated at /Users/casaci/bamboohome/xml-data/build-dir/CASASPECS-DEVTESTPY312147-TTARM15PY312/casa6/casatestutils/nosedir/test_casaconfig/testmeasures
01-Oct-2026 09:49:23 measures_update ... acquiring the lock ...
01-Oct-2026 09:49:23 A measures update has been requested by the force argument
01-Oct-2026 09:49:23   ... finding available measures ...
01-Oct-2026 09:49:23   ... downloading ./WSRT_Measures_20260929-160001.ztar from https://iers.astron.nl/ to /Users/casaci/bamboohome/xml-data/build-dir/CASASPECS-DEVTESTPY312147-TTARM15PY312/casa6/casatestutils/nosedir/test_casaconfig/testmeasures ...
01-Oct-2026 09:49:23   ... measures data updated at /Users/casaci/bamboohome/xml-data/build-dir/CASASPECS-DEVTESTPY312147-TTARM15PY312/casa6/casatestutils/nosedir/test_casaconfig/testmeasures
01-Oct-2026 09:49:23 measures_update ... acquiring the lock ...
01-Oct-2026 09:49:23 A measures update has been requested by the force argument
01-Oct-2026 09:49:23   ... finding available measures ...
01-Oct-2026 09:49:23 measures_update ... acquiring the lock ...
01-Oct-2026 09:49:23 A measures update has been requested by the force argument
01-Oct-2026 09:49:23   ... finding available measures ...
01-Oct-2026 09:49:23   ... downloading NRAO_Measures_20260927-140501.ztar from https://go.nrao.edu/iers/ to /Users/casaci/bamboohome/xml-data/build-dir/CASASPECS-DEVTESTPY312147-TTARM15PY312/casa6/casatestutils/nosedir/test_casaconfig/testmeasures ...
01-Oct-2026 09:49:23   ... measures data updated at /Users/casaci/bamboohome/xml-data/build-dir/CASASPECS-DEVTESTPY312147-TTARM15PY312/casa6/casatestutils/nosedir/test_casaconfig/testmeasures
01-Oct-2026 09:49:23 measures_update ... acquiring the lock ...
01-Oct-2026 09:49:23 A measures update has been requested by the force argument
01-Oct-2026 09:49:23   ... finding available measures ...
01-Oct-2026 09:49:23   ... downloading NRAO_Measures_20260927-140501.ztar from https://go.nrao.edu/iers/ to /Users/casaci/bamboohome/xml-data/build-dir/CASASPECS-DEVTESTPY312147-TTARM15PY312/casa6/casatestutils/nosedir/test_casaconfig/testmeasures ...
01-Oct-2026 09:49:23   ... measures data updated at /Users/casaci/bamboohome/xml-data/build-dir/CASASPECS-DEVTESTPY312147-TTARM15PY312/casa6/casatestutils/nosedir/test_casaconfig/testmeasures
01-Oct-2026 09:49:23 measures_update ... acquiring the lock ...
01-Oct-2026 09:49:23 A measures update has been requested by the force argument
01-Oct-2026 09:49:23   ... finding available measures ...
01-Oct-2026 09:49:23   ... downloading NRAO_Measures_20260930-140606.ztar from https://go.nrao.edu/iers/ to /Users/casaci/bamboohome/xml-data/build-dir/CASASPECS-DEVTESTPY312147-TTARM15PY312/casa6/casatestutils/nosedir/test_casaconfig/testmeasures ...
01-Oct-2026 09:49:23   ... measures data updated at /Users/casaci/bamboohome/xml-data/build-dir/CASASPECS-DEVTESTPY312147-TTARM15PY312/casa6/casatestutils/nosedir/test_casaconfig/testmeasures
01-Oct-2026 09:49:23 measures_update ... acquiring the lock ...
01-Oct-2026 09:49:23 A measures update has been requested by the force argument
01-Oct-2026 09:49:23   ... finding available measures ...
01-Oct-2026 09:49:23 measures_update ... acquiring the lock ...
01-Oct-2026 09:49:23 A measures update has been requested by the force argument
01-Oct-2026 09:49:23   ... finding available measures ...
01-Oct-2026 09:49:23 PASSED
01-Oct-2026 09:49:23
01-Oct-2026 09:49:23 test_casaconfig.py::casaconfig_test::test_read_measurespath_from_user_config
01-Oct-2026 09:49:23 Test casaconfig downloads specific measures data to location and casatools reads that data location
01-Oct-2026 09:49:23 pull_data using version casarundata-2026.02.19-1.tar.gz, acquiring the lock ...
01-Oct-2026 09:49:31 downloading casarundata contents to  /Users/casaci/bamboohome/xml-data/build-dir/CASASPECS-DEVTESTPY312147-TTARM15PY312/casa6/casatestutils/nosedir/test_casaconfig/testrundata (336M) ... done
01-Oct-2026 09:49:39 casarundata installed casarundata-2026.02.19-1.tar.gz at /Users/casaci/bamboohome/xml-data/build-dir/CASASPECS-DEVTESTPY312147-TTARM15PY312/casa6/casatestutils/nosedir/test_casaconfig/testrundata
01-Oct-2026 09:49:39 PASSED
01-Oct-2026 09:49:39
01-Oct-2026 09:49:40 test_casaconfig.py::casaconfig_test::test_update_interval
01-Oct-2026 09:49:40 tests use of config update_interval values
01-Oct-2026 09:49:40 pull_data using version casarundata-2026.02.19-1.tar.gz, acquiring the lock ...
01-Oct-2026 09:49:47 downloading casarundata contents to  /Users/casaci/bamboohome/xml-data/build-dir/CASASPECS-DEVTESTPY312147-TTARM15PY312/casa6/casatestutils/nosedir/test_casaconfig/testrundata (336M) ... done
01-Oct-2026 09:49:49 casarundata installed casarundata-2026.02.19-1.tar.gz at /Users/casaci/bamboohome/xml-data/build-dir/CASASPECS-DEVTESTPY312147-TTARM15PY312/casa6/casatestutils/nosedir/test_casaconfig/testrundata
01-Oct-2026 09:49:49 data_update using version casarundata-2025.12.12-1.tar.gz, acquiring the lock ...
01-Oct-2026 09:49:49 Removing files using manifest from previous install of casarundata-2026.02.19-1.tar.gz on 2026-10-01
01-Oct-2026 09:49:56 downloading casarundata contents to  /Users/casaci/bamboohome/xml-data/build-dir/CASASPECS-DEVTESTPY312147-TTARM15PY312/casa6/casatestutils/nosedir/test_casaconfig/testrundata (336M) ... done
01-Oct-2026 09:49:58 casarundata installed casarundata-2025.12.12-1.tar.gz at /Users/casaci/bamboohome/xml-data/build-dir/CASASPECS-DEVTESTPY312147-TTARM15PY312/casa6/casatestutils/nosedir/test_casaconfig/testrundata
01-Oct-2026 09:49:58 data_update: version installed or checked less than 1 day(s) ago, nothing updated or checked
01-Oct-2026 09:49:58 data_update using version casarundata-2026.02.19-1.tar.gz, acquiring the lock ...
01-Oct-2026 09:49:58 Removing files using manifest from previous install of casarundata-2025.12.12-1.tar.gz on 2026-10-01
01-Oct-2026 09:50:05 downloading casarundata contents to  /Users/casaci/bamboohome/xml-data/build-dir/CASASPECS-DEVTESTPY312147-TTARM15PY312/casa6/casatestutils/nosedir/test_casaconfig/testrundata (336M) ... done
01-Oct-2026 09:50:16 casarundata installed casarundata-2026.02.19-1.tar.gz at /Users/casaci/bamboohome/xml-data/build-dir/CASASPECS-DEVTESTPY312147-TTARM15PY312/casa6/casatestutils/nosedir/test_casaconfig/testrundata
01-Oct-2026 09:50:16 measures_update ... acquiring the lock ...
01-Oct-2026 09:50:16 A measures update has been requested by the force argument
01-Oct-2026 09:50:16   ... finding available measures ...
01-Oct-2026 09:50:16   ... downloading ./WSRT_Measures_20260928-160001.ztar from https://iers.astron.nl/ to /Users/casaci/bamboohome/xml-data/build-dir/CASASPECS-DEVTESTPY312147-TTARM15PY312/casa6/casatestutils/nosedir/test_casaconfig/testrundata ...
01-Oct-2026 09:50:16   ... measures data updated at /Users/casaci/bamboohome/xml-data/build-dir/CASASPECS-DEVTESTPY312147-TTARM15PY312/casa6/casatestutils/nosedir/test_casaconfig/testrundata
01-Oct-2026 09:50:16 measures_update: version installed or checked less than 1 day(s) ago, nothing updated or checked
01-Oct-2026 09:50:16 measures_update ... acquiring the lock ...
01-Oct-2026 09:50:16   ... finding available measures ...
01-Oct-2026 09:50:16   ... downloading ./WSRT_Measures_20260929-160001.ztar from https://iers.astron.nl/ to /Users/casaci/bamboohome/xml-data/build-dir/CASASPECS-DEVTESTPY312147-TTARM15PY312/casa6/casatestutils/nosedir/test_casaconfig/testrundata ...
01-Oct-2026 09:50:16   ... measures data updated at /Users/casaci/bamboohome/xml-data/build-dir/CASASPECS-DEVTESTPY312147-TTARM15PY312/casa6/casatestutils/nosedir/test_casaconfig/testrundata
01-Oct-2026 09:50:16 PASSED
01-Oct-2026 09:50:16
01-Oct-2026 09:50:16 =================================== FAILURES ===================================
01-Oct-2026 09:50:16 ______________ casaconfig_test.test_casaconfig_measures_available ______________
01-Oct-2026 09:50:16 test_casaconfig.py:176: in test_casaconfig_measures_available
01-Oct-2026 09:50:16     self.assertTrue(any(elem in self.get_meas_avail() for elem in [measuresdata_today, measuresdata_yesterday]))
01-Oct-2026 09:50:16 E   AssertionError: False is not true
01-Oct-2026 09:50:16 - generated xml file: /Users/casaci/bamboohome/xml-data/build-dir/CASASPECS-DEVTESTPY312147-TTARM15PY312/casa6/casatestutils/nosedir/xml/test_casaconfig/nose.xml -
01-Oct-2026 09:50:16 =========================== short test summary info ============================
01-Oct-2026 09:50:16 FAILED test_casaconfig.py::casaconfig_test::test_casaconfig_measures_available
01-Oct-2026 09:50:16 ============= 1 failed, 12 passed, 1 warning in 449.22s (0:07:29) ==============
01-Oct-2026 09:50:16 Namespace(list=False, verbose=False, dry_run=False, classes=None, file=None, mapfile=None, branch=None, merge_target=None, pkg=None, work_dir=None, ncores=2, test_paths='./casaconfig/tests', test_list=None, test_config=None, test_group=None, pmode=None, bamboo=False, cachedir=None, ignore_list='test_casampi,test_task_msview,test_task_imview,test_task_plotms', run_skipped=False, only_skipped=False)
01-Oct-2026 09:50:16
01-Oct-2026 09:50:16 Operating system: Darwin
01-Oct-2026 09:50:16
01-Oct-2026 09:50:16 Arguments Sent Direct To Pytest :  []
01-Oct-2026 09:50:16
01-Oct-2026 09:50:16 Tests to Ignore:  ['test_casampi', 'test_task_msview', 'test_task_imview', 'test_task_plotms']
01-Oct-2026 09:50:16 Running 1 Test(s)
01-Oct-2026 09:50:16 Cleaning: /Users/casaci/bamboohome/xml-data/build-dir/CASASPECS-DEVTESTPY312147-TTARM15PY312/casa6/casatestutils/nosedir/
01-Oct-2026 09:50:16 Tests: ['/Users/casaci/bamboohome/xml-data/build-dir/CASASPECS-DEVTESTPY312147-TTARM15PY312/casa6/casatestutils/casaconfig/tests/test_casaconfig.py']
01-Oct-2026 09:50:16
01-Oct-2026 09:50:16 Setting Working Directory: /Users/casaci/bamboohome/xml-data/build-dir/CASASPECS-DEVTESTPY312147-TTARM15PY312/casa6/casatestutils/nosedir/test_casaconfig/
01-Oct-2026 09:50:16 Test Directory: /Users/casaci/bamboohome/xml-data/build-dir/CASASPECS-DEVTESTPY312147-TTARM15PY312/casa6/casatestutils/nosedir/test_casaconfig
01-Oct-2026 09:50:16
01-Oct-2026 09:50:16 Running Command: pytest --junitxml=/Users/casaci/bamboohome/xml-data/build-dir/CASASPECS-DEVTESTPY312147-TTARM15PY312/casa6/casatestutils/nosedir/xml/test_casaconfig/nose.xml -s --disable-pytest-warnings --verbose -ra --tb=short /Users/casaci/bamboohome/xml-data/build-dir/CASASPECS-DEVTESTPY312147-TTARM15PY312/casa6/casatestutils/nosedir/test_casaconfig/
01-Oct-2026 09:50:16 a nosedir
01-Oct-2026 09:50:16 a nosedir/summary_of_failed.log
01-Oct-2026 09:50:16 a nosedir/xml
01-Oct-2026 09:50:16 a nosedir/test_casaconfig
01-Oct-2026 09:50:16 a nosedir/test_casaconfig/test_casaconfig.py
01-Oct-2026 09:50:16 a nosedir/test_casaconfig/conftest.py
01-Oct-2026 09:50:16 a nosedir/test_casaconfig/casa-20261001-134343.log
01-Oct-2026 09:50:16 a nosedir/test_casaconfig/casa-20261001-134932.log
01-Oct-2026 09:50:16 a nosedir/test_casaconfig/casa-20261001-134314.log
01-Oct-2026 09:50:16 a nosedir/test_casaconfig/casa-20261001-134316.log
01-Oct-2026 09:50:16 a nosedir/test_casaconfig/short_summary.log
01-Oct-2026 09:50:16 a nosedir/test_casaconfig/casa-20261001-134439.log
01-Oct-2026 09:50:16 a nosedir/xml/test_casaconfig
01-Oct-2026 09:50:16 a nosedir/xml/test_casaconfig/nose.xml
01-Oct-2026 09:50:16 Finished task 'Test wheel' with result: Success
01-Oct-2026 09:50:16 Starting task 'Parse tests' of type 'com.atlassian.bamboo.plugins.testresultparser:task.testresultparser.junit'
01-Oct-2026 09:50:16 Parsing test results under /Users/casaci/bamboohome/xml-data/build-dir/CASASPECS-DEVTESTPY312147-TTARM15PY312...
01-Oct-2026 09:50:16 Failing task since 1 failing test cases were found.
01-Oct-2026 09:50:16 Finished task 'Parse tests' with result: Failed
01-Oct-2026 09:50:16 Running post build plugin 'Docker Container Cleanup'
01-Oct-2026 09:50:16 Running post build plugin 'NCover Results Collector'
01-Oct-2026 09:50:16 Running post build plugin 'Build Results Label Collector'
01-Oct-2026 09:50:16 Running post build plugin 'Clover Results Collector'
01-Oct-2026 09:50:16 Running post build plugin 'npm Cache Cleanup'
01-Oct-2026 09:50:16 Running post build plugin 'Artifact Copier'
01-Oct-2026 09:50:16 Publishing an artifact: requirements.txt
01-Oct-2026 09:50:16 Finished publishing of artifact Non required job artifact Http Compression On : [requirements.txt], patterns: [requirements.txt] anchored at: [wheeldirectory/] in 39.30 ms
01-Oct-2026 09:50:16 Publishing an artifact: Workdir
01-Oct-2026 09:50:16 Finished publishing of artifact Non required job artifact Http Compression On : [Workdir], patterns: [work*.tar.gz] anchored at: [wheeldirectory/] in 12.06 ms
01-Oct-2026 09:50:16 Finalising the build...
01-Oct-2026 09:50:16 Stopping timer.
01-Oct-2026 09:50:16 Build CASASPECS-DEVTESTPY312147-TTARM15PY312-6 completed.
01-Oct-2026 09:50:16 Running on server: post build plugin 'Build Hanging Detection Configuration'
01-Oct-2026 09:50:16 Running on server: post build plugin 'NCover Results Collector'
01-Oct-2026 09:50:16 Running on server: post build plugin 'Build Labeller'
01-Oct-2026 09:50:16 Running on server: post build plugin 'Clover Delta Calculator'
01-Oct-2026 09:50:16 Running on server: post build plugin 'Maven Dependencies Postprocessor'
01-Oct-2026 09:50:16 All post build plugins have finished
01-Oct-2026 09:50:16 Generating build results summary...
01-Oct-2026 09:50:16 Saving build results to disk...
01-Oct-2026 09:50:16 Store variable context...
01-Oct-2026 09:50:16 Finished building CASASPECS-DEVTESTPY312147-TTARM15PY312-6.