Build: #6 failed

Job: Test Tasks Many Linux 2.28 Py3.12 failed

Build log

The build generated 560 lines of output. Download or view full build log.

01-Oct-2026 09:38:16 Build CASASPECS - Dev Test 3.12 - CAS-14849 - Test Tasks Many Linux 2.28 Py3.12 #6 (CASASPECS-DEVTESTPY312147-TTM228PY312-6) is being prepared for building on agent casaci-4.cv.nrao.edu, bamboo version: 9.6.26
01-Oct-2026 09:38:16 Remote agent on host casaci-4.cv.nrao.edu
01-Oct-2026 09:38:16 Build working directory is /opt/ci_workspace/casa/bamboo/agent1/xml-data/build-dir/CASASPECS-DEVTESTPY312147-TTM228PY312
01-Oct-2026 09:38:16 Executing build CASASPECS - Dev Test 3.12 - CAS-14849 - Test Tasks Many Linux 2.28 Py3.12 #6 (CASASPECS-DEVTESTPY312147-TTM228PY312-6)
01-Oct-2026 09:38:16 Starting task 'Source Code Checkout' of type 'com.atlassian.bamboo.plugins.vcs:task.vcs.checkout'
01-Oct-2026 09:38:16 Build always requires a clean checkout
01-Oct-2026 09:38:16 Cleaning build directory '/opt/ci_workspace/casa/bamboo/agent1/xml-data/build-dir/CASASPECS-DEVTESTPY312147-TTM228PY312'
01-Oct-2026 09:38:17 Checking out into /opt/ci_workspace/casa/bamboo/agent1/xml-data/build-dir/CASASPECS-DEVTESTPY312147-TTM228PY312
01-Oct-2026 09:38:17 Updating source code to revision: b7c9977a194ec0f6d5ce3a54c3a47be204959703
01-Oct-2026 09:38:20 Fetching 'refs/heads/CAS-14849' from 'ssh://git@open-bitbucket.nrao.edu:7999/casa/casa6.git'.
01-Oct-2026 09:38:20 Warning: Permanently added '[127.0.0.1]:37535' (RSA) to the list of known hosts.
01-Oct-2026 09:38:20 X11 forwarding request failed on channel 0
01-Oct-2026 09:38:20 Checking out revision b7c9977a194ec0f6d5ce3a54c3a47be204959703.
01-Oct-2026 09:38:20 Creating local git repository in '/opt/ci_workspace/casa/bamboo/agent1/xml-data/build-dir/CASASPECS-DEVTESTPY312147-TTM228PY312/.git'.
01-Oct-2026 09:38:20 Cloning into '/opt/ci_workspace/casa/bamboo/agent1/xml-data/build-dir/CASASPECS-DEVTESTPY312147-TTM228PY312'...
01-Oct-2026 09:38:20 done.
01-Oct-2026 09:38:22 Switched to a new branch 'CAS-14849'
01-Oct-2026 09:38:22 branch 'CAS-14849' set up to track 'origin/CAS-14849'.
01-Oct-2026 09:38:22 Submodule 'casatools/casacore' (https://github.com/casacore/casacore.git) registered for path 'casatools/casacore'
01-Oct-2026 09:38:22 Submodule 'casatools/grpc-source' (https://github.com/grpc/grpc) registered for path 'casatools/grpc-source'
01-Oct-2026 09:38:22 Cloning into '/opt/ci_workspace/casa/bamboo/agent1/xml-data/build-dir/CASASPECS-DEVTESTPY312147-TTM228PY312/casatools/casacore'...
01-Oct-2026 09:38:29 Cloning into '/opt/ci_workspace/casa/bamboo/agent1/xml-data/build-dir/CASASPECS-DEVTESTPY312147-TTM228PY312/casatools/grpc-source'...
01-Oct-2026 09:38:49 Submodule path 'casatools/casacore': checked out 'aaf72eb7edd5a5fecefa78ca04713233b7b6ffd6'
01-Oct-2026 09:38:49 Submodule path 'casatools/grpc-source': checked out 'cca868ac8f3641df4003a82b7fc54c921e14f765'
01-Oct-2026 09:38:49 Submodule 'third_party/abseil-cpp' (https://github.com/abseil/abseil-cpp) registered for path 'casatools/grpc-source/third_party/abseil-cpp'
01-Oct-2026 09:38:49 Submodule 'third_party/benchmark' (https://github.com/google/benchmark) registered for path 'casatools/grpc-source/third_party/benchmark'
01-Oct-2026 09:38:49 Submodule 'third_party/bloaty' (https://github.com/google/bloaty.git) registered for path 'casatools/grpc-source/third_party/bloaty'
01-Oct-2026 09:38:49 Submodule 'third_party/boringssl' (https://github.com/google/boringssl.git) registered for path 'casatools/grpc-source/third_party/boringssl'
01-Oct-2026 09:38:49 Submodule 'third_party/boringssl-with-bazel' (https://github.com/google/boringssl.git) registered for path 'casatools/grpc-source/third_party/boringssl-with-bazel'
01-Oct-2026 09:38:49 Submodule 'third_party/cares/cares' (https://github.com/c-ares/c-ares.git) registered for path 'casatools/grpc-source/third_party/cares/cares'
01-Oct-2026 09:38:49 Submodule 'third_party/gflags' (https://github.com/gflags/gflags.git) registered for path 'casatools/grpc-source/third_party/gflags'
01-Oct-2026 09:38:49 Submodule 'third_party/googletest' (https://github.com/google/googletest.git) registered for path 'casatools/grpc-source/third_party/googletest'
01-Oct-2026 09:38:49 Submodule 'third_party/protobuf' (https://github.com/google/protobuf.git) registered for path 'casatools/grpc-source/third_party/protobuf'
01-Oct-2026 09:38:49 Submodule 'third_party/zlib' (https://github.com/madler/zlib) registered for path 'casatools/grpc-source/third_party/zlib'
01-Oct-2026 09:38:49 Cloning into '/opt/ci_workspace/casa/bamboo/agent1/xml-data/build-dir/CASASPECS-DEVTESTPY312147-TTM228PY312/casatools/grpc-source/third_party/abseil-cpp'...
01-Oct-2026 09:38:50 Cloning into '/opt/ci_workspace/casa/bamboo/agent1/xml-data/build-dir/CASASPECS-DEVTESTPY312147-TTM228PY312/casatools/grpc-source/third_party/benchmark'...
01-Oct-2026 09:38:51 Cloning into '/opt/ci_workspace/casa/bamboo/agent1/xml-data/build-dir/CASASPECS-DEVTESTPY312147-TTM228PY312/casatools/grpc-source/third_party/bloaty'...
01-Oct-2026 09:38:51 Cloning into '/opt/ci_workspace/casa/bamboo/agent1/xml-data/build-dir/CASASPECS-DEVTESTPY312147-TTM228PY312/casatools/grpc-source/third_party/boringssl'...
01-Oct-2026 09:39:00 Cloning into '/opt/ci_workspace/casa/bamboo/agent1/xml-data/build-dir/CASASPECS-DEVTESTPY312147-TTM228PY312/casatools/grpc-source/third_party/boringssl-with-bazel'...
01-Oct-2026 09:39:09 Cloning into '/opt/ci_workspace/casa/bamboo/agent1/xml-data/build-dir/CASASPECS-DEVTESTPY312147-TTM228PY312/casatools/grpc-source/third_party/cares/cares'...
01-Oct-2026 09:39:10 Cloning into '/opt/ci_workspace/casa/bamboo/agent1/xml-data/build-dir/CASASPECS-DEVTESTPY312147-TTM228PY312/casatools/grpc-source/third_party/gflags'...
01-Oct-2026 09:39:11 Cloning into '/opt/ci_workspace/casa/bamboo/agent1/xml-data/build-dir/CASASPECS-DEVTESTPY312147-TTM228PY312/casatools/grpc-source/third_party/googletest'...
01-Oct-2026 09:39:12 Cloning into '/opt/ci_workspace/casa/bamboo/agent1/xml-data/build-dir/CASASPECS-DEVTESTPY312147-TTM228PY312/casatools/grpc-source/third_party/protobuf'...
01-Oct-2026 09:39:20 Cloning into '/opt/ci_workspace/casa/bamboo/agent1/xml-data/build-dir/CASASPECS-DEVTESTPY312147-TTM228PY312/casatools/grpc-source/third_party/zlib'...
01-Oct-2026 09:39:20 Submodule path 'casatools/grpc-source/third_party/abseil-cpp': checked out 'cc4bed2d74f7c8717e31f9579214ab52a9c9c610'
01-Oct-2026 09:39:20 Submodule path 'casatools/grpc-source/third_party/benchmark': checked out '5b7683f49e1e9223cf9927b24f6fd3d6bd82e3f8'
01-Oct-2026 09:39:20 Submodule path 'casatools/grpc-source/third_party/bloaty': checked out '73594cde8c9a52a102c4341c244c833aa61b9c06'
01-Oct-2026 09:39:20 Submodule 'third_party/googletest' (https://github.com/google/googletest.git) registered for path 'casatools/grpc-source/third_party/bloaty/third_party/googletest'
01-Oct-2026 09:39:20 Submodule 'third_party/libFuzzer' (https://chromium.googlesource.com/chromium/llvm-project/llvm/lib/Fuzzer) registered for path 'casatools/grpc-source/third_party/bloaty/third_party/libFuzzer'
01-Oct-2026 09:39:20 Submodule 'third_party/re2' (https://github.com/google/re2) registered for path 'casatools/grpc-source/third_party/bloaty/third_party/re2'
01-Oct-2026 09:39:20 Cloning into '/opt/ci_workspace/casa/bamboo/agent1/xml-data/build-dir/CASASPECS-DEVTESTPY312147-TTM228PY312/casatools/grpc-source/third_party/bloaty/third_party/googletest'...
01-Oct-2026 09:39:21 Cloning into '/opt/ci_workspace/casa/bamboo/agent1/xml-data/build-dir/CASASPECS-DEVTESTPY312147-TTM228PY312/casatools/grpc-source/third_party/bloaty/third_party/libFuzzer'...
01-Oct-2026 09:39:22 Cloning into '/opt/ci_workspace/casa/bamboo/agent1/xml-data/build-dir/CASASPECS-DEVTESTPY312147-TTM228PY312/casatools/grpc-source/third_party/bloaty/third_party/re2'...
01-Oct-2026 09:39:23 Submodule path 'casatools/grpc-source/third_party/bloaty/third_party/googletest': checked out 'a2b8a8e07628e5fd60644b6dd99c1b5e7d7f1f47'
01-Oct-2026 09:39:23 Submodule path 'casatools/grpc-source/third_party/bloaty/third_party/libFuzzer': checked out '1b543d6e5073b56be214394890c9193979a3d7e1'
01-Oct-2026 09:39:23 Submodule path 'casatools/grpc-source/third_party/bloaty/third_party/re2': checked out 'c964d9b07816f9b52ca692e23b8b3dba33beec54'
01-Oct-2026 09:39:23 Submodule path 'casatools/grpc-source/third_party/boringssl': checked out 'be2ee342d3781ddb954f91f8a7e660c6f59e87e5'
01-Oct-2026 09:39:24 Submodule path 'casatools/grpc-source/third_party/boringssl-with-bazel': checked out '886e7d75368e3f4fab3f4d0d3584e4abfc557755'
01-Oct-2026 09:39:24 Submodule path 'casatools/grpc-source/third_party/cares/cares': checked out '3be1924221e1326df520f8498d704a5c4c8d0cce'
01-Oct-2026 09:39:24 Submodule path 'casatools/grpc-source/third_party/gflags': checked out '30dbc81fb5ffdc98ea9b14b1918bfe4e8779b26e'
01-Oct-2026 09:39:24 Submodule 'doc' (https://github.com/gflags/gflags.git) registered for path 'casatools/grpc-source/third_party/gflags/doc'
01-Oct-2026 09:39:24 Cloning into '/opt/ci_workspace/casa/bamboo/agent1/xml-data/build-dir/CASASPECS-DEVTESTPY312147-TTM228PY312/casatools/grpc-source/third_party/gflags/doc'...
01-Oct-2026 09:39:24 Submodule path 'casatools/grpc-source/third_party/gflags/doc': checked out '971dd2a4fadac9cdab174c523c22df79efd63aa5'
01-Oct-2026 09:39:24 Submodule path 'casatools/grpc-source/third_party/googletest': checked out 'ec44c6c1675c25b9827aacd08c02433cccde7780'
01-Oct-2026 09:39:24 Submodule path 'casatools/grpc-source/third_party/protobuf': checked out '2761122b810fe8861004ae785cc3ab39f384d342'
01-Oct-2026 09:39:24 Submodule 'third_party/benchmark' (https://github.com/google/benchmark.git) registered for path 'casatools/grpc-source/third_party/protobuf/third_party/benchmark'
01-Oct-2026 09:39:24 Cloning into '/opt/ci_workspace/casa/bamboo/agent1/xml-data/build-dir/CASASPECS-DEVTESTPY312147-TTM228PY312/casatools/grpc-source/third_party/protobuf/third_party/benchmark'...
01-Oct-2026 09:39:25 Submodule path 'casatools/grpc-source/third_party/protobuf/third_party/benchmark': checked out '360e66c1c4777c99402cf8cd535aa510fee16573'
01-Oct-2026 09:39:25 Submodule path 'casatools/grpc-source/third_party/zlib': checked out 'cacf7f1d4e3d44d871b605da3b647f07d718623f'
01-Oct-2026 09:39:25 Updated source code to revision: b7c9977a194ec0f6d5ce3a54c3a47be204959703
01-Oct-2026 09:39:25 Finished task 'Source Code Checkout' with result: Success
01-Oct-2026 09:39:25 Running pre-build action: Build Log Labeller Pre Build Action
01-Oct-2026 09:39:25 Running pre-build action: VCS Version Collector
01-Oct-2026 09:39:25 Build CASASPECS - Dev Test 3.12 - CAS-14849 - Test Tasks Many Linux 2.28 Py3.12 #6 (CASASPECS-DEVTESTPY312147-TTM228PY312-6) started building on agent 'casaci-4.cv.nrao.edu' (Remote agent on host casaci-4.cv.nrao.edu)
01-Oct-2026 09:39:25 Starting task 'Update data' of type 'com.atlassian.bamboo.plugins.scripttask:task.builder.script'
01-Oct-2026 09:39:25
Beginning to execute external process for build 'CASASPECS - Dev Test 3.12 - CAS-14849 - Test Tasks Many Linux 2.28 Py3.12 #6 (CASASPECS-DEVTESTPY312147-TTM228PY312-6)'
... running command line:
/opt/ci_workspace/casa/bamboo/agent1/temp/CASASPECS-DEVTESTPY312147-TTM228PY312-6-ScriptBuildTask-10753872447615168186.sh
... in: /opt/ci_workspace/casa/bamboo/agent1/xml-data/build-dir/CASASPECS-DEVTESTPY312147-TTM228PY312
01-Oct-2026 09:39:25 Already up to date.
01-Oct-2026 09:39:25 /opt/ci_workspace/casa/bamboo/agent1/temp/CASASPECS-DEVTESTPY312147-TTM228PY312-6-ScriptBuildTask-10753872447615168186.sh: line 2: cd: /opt/casa/data/casa-data-req: No such file or directory
01-Oct-2026 09:39:25 Already up to date.
01-Oct-2026 09:39:25 Data update complete
01-Oct-2026 09:39:25 Finished task 'Update data' with result: Success
01-Oct-2026 09:39:25
Substituting variable: ${bamboo.repository.branch.name} with CAS-14849
01-Oct-2026 09:39:25 Starting task 'Create wheeldirectory' of type 'com.atlassian.bamboo.plugins.scripttask:task.builder.script'
01-Oct-2026 09:39:25
Beginning to execute external process for build 'CASASPECS - Dev Test 3.12 - CAS-14849 - Test Tasks Many Linux 2.28 Py3.12 #6 (CASASPECS-DEVTESTPY312147-TTM228PY312-6)'
... running command line:
/opt/ci_workspace/casa/bamboo/agent1/temp/CASASPECS-DEVTESTPY312147-TTM228PY312-6-ScriptBuildTask-7872438837554890717.sh
... in: /opt/ci_workspace/casa/bamboo/agent1/xml-data/build-dir/CASASPECS-DEVTESTPY312147-TTM228PY312
01-Oct-2026 09:39:25 Finished task 'Create wheeldirectory' with result: Success
01-Oct-2026 09:39:25 Starting task 'Get latest wheel' of type 'com.atlassian.bamboo.plugins.bamboo-artifact-downloader-plugin:artifactdownloadertask'
01-Oct-2026 09:39:25 Preparing to download plan result CASASPECS-DBC257-6 artifact: Non required shared artifact Http Compression On : [ManyLinux228 Python 3.12 Casatestutils], patterns: [casatestutils*.whl] anchored at: [source/wheels]
01-Oct-2026 09:39:25 Retrieving artifact ManyLinux228 Python 3.12 Casatestutils for CASASPECS-DBC257-6 using Bamboo server artifact handler
01-Oct-2026 09:39:25 Artifact [ManyLinux228 Python 3.12 Casatestutils] downloaded successfully in 23.65 ms to wheeldirectory/
01-Oct-2026 09:39:25 Preparing to download plan result CASASPECS-DBC257-6 artifact: Non required shared artifact Http Compression On : [ManyLinux228 Python 3.12 Tool wheel], patterns: [casatools*.whl] anchored at: [source/wheels]
01-Oct-2026 09:39:25 Retrieving artifact ManyLinux228 Python 3.12 Tool wheel for CASASPECS-DBC257-6 using Bamboo server artifact handler
01-Oct-2026 09:39:31 Artifact [ManyLinux228 Python 3.12 Tool wheel] downloaded successfully in 5.769 s to wheeldirectory/
01-Oct-2026 09:39:31 Preparing to download plan result CASASPECS-DBC257-6 artifact: Non required shared artifact Http Compression On : [ManyLinux228 Python 3.12 Task wheel], patterns: [casatasks*.whl] anchored at: [source/wheels]
01-Oct-2026 09:39:31 Retrieving artifact ManyLinux228 Python 3.12 Task wheel for CASASPECS-DBC257-6 using Bamboo server artifact handler
01-Oct-2026 09:39:31 Artifact [ManyLinux228 Python 3.12 Task wheel] downloaded successfully in 118.9 ms to wheeldirectory/
01-Oct-2026 09:39:31 Finished task 'Get latest wheel' with result: Success
01-Oct-2026 09:39:31
Substituting variable: ${bamboo.agentId} with 153550849
01-Oct-2026 09:39:31
Substituting variable: ${bamboo.agentId} with 153550849
01-Oct-2026 09:39:31
Substituting variable: ${bamboo.agentId} with 153550849
01-Oct-2026 09:39:31 Starting task 'Stop and remove running wheel-container-test' of type 'com.atlassian.bamboo.plugins.scripttask:task.builder.script'
01-Oct-2026 09:39:31
Beginning to execute external process for build 'CASASPECS - Dev Test 3.12 - CAS-14849 - Test Tasks Many Linux 2.28 Py3.12 #6 (CASASPECS-DEVTESTPY312147-TTM228PY312-6)'
... running command line:
/opt/ci_workspace/casa/bamboo/agent1/temp/CASASPECS-DEVTESTPY312147-TTM228PY312-6-ScriptBuildTask-10517354202487487762.sh
... in: /opt/ci_workspace/casa/bamboo/agent1/xml-data/build-dir/CASASPECS-DEVTESTPY312147-TTM228PY312
01-Oct-2026 09:39:31 Error response from daemon: No such container: wheel-container-test_153550849
01-Oct-2026 09:39:31 Error response from daemon: No such container: wheel-container-test_153550849
01-Oct-2026 09:39:31 Removed wheel-container-test_153550849
01-Oct-2026 09:39:31 Finished task 'Stop and remove running wheel-container-test' with result: Success
01-Oct-2026 09:39:31
Substituting variable: ${bamboo.working.directory} with /opt/ci_workspace/casa/bamboo/agent1/xml-data/build-dir/CASASPECS-DEVTESTPY312147-TTM228PY312
01-Oct-2026 09:39:31
Substituting variable: ${bamboo.agentId} with 153550849
01-Oct-2026 09:39:31 Starting task 'Start container' of type 'com.atlassian.bamboo.plugins.bamboo-docker-plugin:task.docker.cli'
01-Oct-2026 09:39:31 Running image name (casa-docker.nrao.edu:5000/casa-test-rocky-8.10:4)
01-Oct-2026 09:39:31
Beginning to execute external process for build 'CASASPECS - Dev Test 3.12 - CAS-14849 - Test Tasks Many Linux 2.28 Py3.12 #6 (CASASPECS-DEVTESTPY312147-TTM228PY312-6)'
... running command line:
/usr/bin/docker run --volume /opt/ci_workspace/casa/bamboo/agent1/xml-data/build-dir/CASASPECS-DEVTESTPY312147-TTM228PY312/wheeldirectory:/wheeldirectory --volume /opt/casa/data:/opt/casa/data --detach --cpus=8 --memory=64g --name wheel-container-test_153550849 casa-docker.nrao.edu:5000/casa-test-rocky-8.10:4 tail -f /dev/null
... in: /opt/ci_workspace/casa/bamboo/agent1/xml-data/build-dir/CASASPECS-DEVTESTPY312147-TTM228PY312
01-Oct-2026 09:39:33 ce17c936711dae04eb1341bfbb0fdd16b448af6a6bcc3651b91686b419c360c1
01-Oct-2026 09:39:33 Finished task 'Start container' with result: Success
01-Oct-2026 09:39:33
Substituting variable: ${bamboo.agentId} with 153550849
01-Oct-2026 09:39:33
Substituting variable: ${bamboo.planRepository.branchName} with CAS-14849
01-Oct-2026 09:39:33 Starting task 'Test wheel' of type 'com.atlassian.bamboo.plugins.scripttask:task.builder.script'
01-Oct-2026 09:39:33
Beginning to execute external process for build 'CASASPECS - Dev Test 3.12 - CAS-14849 - Test Tasks Many Linux 2.28 Py3.12 #6 (CASASPECS-DEVTESTPY312147-TTM228PY312-6)'
... running command line:
/opt/ci_workspace/casa/bamboo/agent1/temp/CASASPECS-DEVTESTPY312147-TTM228PY312-6-ScriptBuildTask-11996711471982818112.sh
... in: /opt/ci_workspace/casa/bamboo/agent1/xml-data/build-dir/CASASPECS-DEVTESTPY312147-TTM228PY312
01-Oct-2026 09:39:33 branch: CAS-14849
01-Oct-2026 09:39:33 Python version: 3.12
01-Oct-2026 09:39:33   % Total    % Received % Xferd  Average Speed   Time    Time     Time  Current
01-Oct-2026 09:39:33                                  Dload  Upload   Total   Spent    Left  Speed
01-Oct-2026 09:39:33
01-Oct-2026 09:39:33   0     0    0     0    0     0      0      0 --:--:-- --:--:-- --:--:--     0
01-Oct-2026 09:39:33 100 6002k  100 6002k    0     0  67.3M      0 --:--:-- --:--:-- --:--:-- 68.1M
01-Oct-2026 09:39:33 bamboo_jira_components:''
01-Oct-2026 09:39:33 bamboo_testlist:''
01-Oct-2026 09:39:34 Ticket components:  -j "casaconfig"
01-Oct-2026 09:39:34 datapath=[ "/opt/casa/data/master", "/opt/casa/data/casatestdata" ]
01-Oct-2026 09:39:34 measurespath="/opt/casa/data/master"
01-Oct-2026 09:39:34 measures_auto_update=False
01-Oct-2026 09:39:34 data_auto_update=False
01-Oct-2026 09:39:34 Ticket fix version: CASA 6.ACTIVE
01-Oct-2026 09:39:34 No matching version found
01-Oct-2026 09:39:34 datapath=[ "/opt/casa/data/master", "/opt/casa/data/casatestdata" ]
01-Oct-2026 09:39:34 measurespath="/opt/casa/data/master"
01-Oct-2026 09:39:34 measures_auto_update=False
01-Oct-2026 09:39:34 data_auto_update=False
01-Oct-2026 09:40:51 branch 'CAS-14849' set up to track 'origin/CAS-14849'.
01-Oct-2026 09:40:51 Switched to a new branch 'CAS-14849'
01-Oct-2026 09:40:51 Updated 0 paths from fb45b40137
01-Oct-2026 09:40:51 Updated 0 paths from fb45b40137
01-Oct-2026 09:40:51 Updated 0 paths from 8bbfc69a0b
01-Oct-2026 09:40:51 Requirement already satisfied: pip in /home/casatest/venv/lib/python3.12/site-packages (24.3.1)
01-Oct-2026 09:40:52 Collecting pip
01-Oct-2026 09:40:52   Downloading pip-26.2.1-py3-none-any.whl.metadata (4.6 kB)
01-Oct-2026 09:40:52 Collecting setuptools
01-Oct-2026 09:40:52   Downloading setuptools-84.0.0-py3-none-any.whl.metadata (6.6 kB)
01-Oct-2026 09:40:52 Collecting wheel
01-Oct-2026 09:40:52   Downloading wheel-0.48.0-py3-none-any.whl.metadata (2.3 kB)
01-Oct-2026 09:40:52 Collecting numpy
01-Oct-2026 09:40:52   Downloading numpy-2.5.3-cp312-cp312-manylinux_2_27_x86_64.manylinux_2_28_x86_64.whl.metadata (6.6 kB)
01-Oct-2026 09:40:52 Collecting packaging>=24.0 (from wheel)
01-Oct-2026 09:40:52   Downloading packaging-26.3-py3-none-any.whl.metadata (3.5 kB)
01-Oct-2026 09:40:52 Downloading pip-26.2.1-py3-none-any.whl (1.8 MB)
01-Oct-2026 09:40:52    ━━━━━━━━━━━━━━━━━━━━━━━━━━━━━━━━━━━━━━━━ 1.8/1.8 MB 93.7 MB/s eta 0:00:00
01-Oct-2026 09:40:52 Downloading setuptools-84.0.0-py3-none-any.whl (818 kB)
01-Oct-2026 09:40:52    ━━━━━━━━━━━━━━━━━━━━━━━━━━━━━━━━━━━━━━━ 818.2/818.2 kB 121.2 MB/s eta 0:00:00
01-Oct-2026 09:40:52 Downloading wheel-0.48.0-py3-none-any.whl (33 kB)
01-Oct-2026 09:40:52 Downloading numpy-2.5.3-cp312-cp312-manylinux_2_27_x86_64.manylinux_2_28_x86_64.whl (16.7 MB)
01-Oct-2026 09:40:52    ━━━━━━━━━━━━━━━━━━━━━━━━━━━━━━━━━━━━━━━━ 16.7/16.7 MB 285.3 MB/s eta 0:00:00
01-Oct-2026 09:40:52 Downloading packaging-26.3-py3-none-any.whl (129 kB)
01-Oct-2026 09:40:52 Installing collected packages: setuptools, pip, packaging, numpy, wheel
01-Oct-2026 09:40:52   Attempting uninstall: pip
01-Oct-2026 09:40:52     Found existing installation: pip 24.3.1
01-Oct-2026 09:40:52     Uninstalling pip-24.3.1:
01-Oct-2026 09:40:52       Successfully uninstalled pip-24.3.1
01-Oct-2026 09:40:55 Successfully installed numpy-2.5.3 packaging-26.3 pip-26.2.1 setuptools-84.0.0 wheel-0.48.0
01-Oct-2026 09:40:55 Looking in indexes: https://pypi.org/simple, https://test.pypi.org/simple
01-Oct-2026 09:40:55 Collecting casaconfig==1.5.2
01-Oct-2026 09:40:55   Downloading casaconfig-1.5.2-py3-none-any.whl.metadata (4.0 kB)
01-Oct-2026 09:40:55 Collecting certifi>=2023.5.7 (from casaconfig==1.5.2)
01-Oct-2026 09:40:55   Downloading certifi-2026.7.22-py3-none-any.whl.metadata (2.5 kB)
01-Oct-2026 09:40:55 Downloading casaconfig-1.5.2-py3-none-any.whl (77 kB)
01-Oct-2026 09:40:55 Downloading certifi-2026.7.22-py3-none-any.whl (136 kB)
01-Oct-2026 09:40:55 Installing collected packages: certifi, casaconfig
01-Oct-2026 09:40:55
01-Oct-2026 09:40:55 Successfully installed casaconfig-1.5.2 certifi-2026.7.22
01-Oct-2026 09:40:56 Processing ./casatestutils-6.7.7.7a14849.dev4-py3-none-any.whl
01-Oct-2026 09:40:56 Collecting pytest>=6.0 (from casatestutils==6.7.7.7a14849.dev4)
01-Oct-2026 09:40:56   Downloading pytest-9.1.1-py3-none-any.whl.metadata (7.6 kB)
01-Oct-2026 09:40:56 Collecting astropy (from casatestutils==6.7.7.7a14849.dev4)
01-Oct-2026 09:40:56   Downloading astropy-8.0.1-cp311-abi3-manylinux2014_x86_64.manylinux_2_17_x86_64.manylinux_2_28_x86_64.whl.metadata (11 kB)
01-Oct-2026 09:40:56 Collecting iniconfig>=1.0.1 (from pytest>=6.0->casatestutils==6.7.7.7a14849.dev4)
01-Oct-2026 09:40:56   Downloading iniconfig-2.3.0-py3-none-any.whl.metadata (2.5 kB)
01-Oct-2026 09:40:56 Requirement already satisfied: packaging>=22 in /home/casatest/venv/lib/python3.12/site-packages (from pytest>=6.0->casatestutils==6.7.7.7a14849.dev4) (26.3)
01-Oct-2026 09:40:56 Collecting pluggy<2,>=1.5 (from pytest>=6.0->casatestutils==6.7.7.7a14849.dev4)
01-Oct-2026 09:40:56   Downloading pluggy-1.6.0-py3-none-any.whl.metadata (4.8 kB)
01-Oct-2026 09:40:56 Collecting pygments>=2.7.2 (from pytest>=6.0->casatestutils==6.7.7.7a14849.dev4)
01-Oct-2026 09:40:56   Downloading pygments-2.21.0-py3-none-any.whl.metadata (2.5 kB)
01-Oct-2026 09:40:56 Collecting astropy-iers-data>=0.2026.6.22.1.23.34 (from astropy->casatestutils==6.7.7.7a14849.dev4)
01-Oct-2026 09:40:56   Downloading astropy_iers_data-0.2026.9.28.0.59.37-py3-none-any.whl.metadata (3.4 kB)
01-Oct-2026 09:40:56 Requirement already satisfied: numpy>=2.0 in /home/casatest/venv/lib/python3.12/site-packages (from astropy->casatestutils==6.7.7.7a14849.dev4) (2.5.3)
01-Oct-2026 09:40:56 Collecting pyerfa>=2.0.1.3 (from astropy->casatestutils==6.7.7.7a14849.dev4)
01-Oct-2026 09:40:56   Downloading pyerfa-2.0.1.5-cp39-abi3-manylinux_2_17_x86_64.manylinux2014_x86_64.whl.metadata (5.7 kB)
01-Oct-2026 09:40:56 Collecting PyYAML>=6.0.0 (from astropy->casatestutils==6.7.7.7a14849.dev4)
01-Oct-2026 09:40:56   Downloading pyyaml-6.0.3-cp312-cp312-manylinux2014_x86_64.manylinux_2_17_x86_64.manylinux_2_28_x86_64.whl.metadata (2.4 kB)
01-Oct-2026 09:40:56 Downloading pytest-9.1.1-py3-none-any.whl (386 kB)
01-Oct-2026 09:40:56 Downloading pluggy-1.6.0-py3-none-any.whl (20 kB)
01-Oct-2026 09:40:56 Downloading iniconfig-2.3.0-py3-none-any.whl (7.5 kB)
01-Oct-2026 09:40:56 Downloading pygments-2.21.0-py3-none-any.whl (1.3 MB)
01-Oct-2026 09:40:56    ━━━━━━━━━━━━━━━━━━━━━━━━━━━━━━━━━━━━━━━━ 1.3/1.3 MB 106.6 MB/s  0:00:00
01-Oct-2026 09:40:56 Downloading astropy-8.0.1-cp311-abi3-manylinux2014_x86_64.manylinux_2_17_x86_64.manylinux_2_28_x86_64.whl (10.5 MB)
01-Oct-2026 09:40:56    ━━━━━━━━━━━━━━━━━━━━━━━━━━━━━━━━━━━━━━━━ 10.5/10.5 MB 121.8 MB/s  0:00:00
01-Oct-2026 09:40:56 Downloading astropy_iers_data-0.2026.9.28.0.59.37-py3-none-any.whl (2.0 MB)
01-Oct-2026 09:40:56    ━━━━━━━━━━━━━━━━━━━━━━━━━━━━━━━━━━━━━━━━ 2.0/2.0 MB 73.6 MB/s  0:00:00
01-Oct-2026 09:40:56 Downloading pyerfa-2.0.1.5-cp39-abi3-manylinux_2_17_x86_64.manylinux2014_x86_64.whl (738 kB)
01-Oct-2026 09:40:56    ━━━━━━━━━━━━━━━━━━━━━━━━━━━━━━━━━━━━━━━━ 738.7/738.7 kB 63.6 MB/s  0:00:00
01-Oct-2026 09:40:56 Downloading pyyaml-6.0.3-cp312-cp312-manylinux2014_x86_64.manylinux_2_17_x86_64.manylinux_2_28_x86_64.whl (807 kB)
01-Oct-2026 09:40:56    ━━━━━━━━━━━━━━━━━━━━━━━━━━━━━━━━━━━━━━━━ 807.9/807.9 kB 113.3 MB/s  0:00:00
01-Oct-2026 09:40:56 Installing collected packages: PyYAML, pygments, pyerfa, pluggy, iniconfig, astropy-iers-data, pytest, astropy, casatestutils
01-Oct-2026 09:40:59
01-Oct-2026 09:40:59 Successfully installed PyYAML-6.0.3 astropy-8.0.1 astropy-iers-data-0.2026.9.28.0.59.37 casatestutils-6.7.7.7a14849.dev4 iniconfig-2.3.0 pluggy-1.6.0 pyerfa-2.0.1.5 pygments-2.21.0 pytest-9.1.1
01-Oct-2026 09:41:00 Processing ./casatools-6.7.7.7a14849.dev4-cp312-cp312-manylinux_2_28_x86_64.whl
01-Oct-2026 09:41:00 Requirement already satisfied: numpy in /home/casatest/venv/lib/python3.12/site-packages (from casatools==6.7.7.7a14849.dev4) (2.5.3)
01-Oct-2026 09:41:00 Requirement already satisfied: casaconfig in /home/casatest/venv/lib/python3.12/site-packages (from casatools==6.7.7.7a14849.dev4) (1.5.2)
01-Oct-2026 09:41:00 Requirement already satisfied: certifi>=2023.5.7 in /home/casatest/venv/lib/python3.12/site-packages (from casaconfig->casatools==6.7.7.7a14849.dev4) (2026.7.22)
01-Oct-2026 09:41:00 Installing collected packages: casatools
01-Oct-2026 09:41:01 Successfully installed casatools-6.7.7.7a14849.dev4
01-Oct-2026 09:41:01 Processing ./casatasks-6.7.7.7a14849.dev4-py3-none-any.whl
01-Oct-2026 09:41:01 Requirement already satisfied: casatools==6.7.7.7a14849.dev4 in /home/casatest/venv/lib/python3.12/site-packages (from casatasks==6.7.7.7a14849.dev4) (6.7.7.7a14849.dev4)
01-Oct-2026 09:41:01 Collecting matplotlib (from casatasks==6.7.7.7a14849.dev4)
01-Oct-2026 09:41:01   Downloading matplotlib-3.11.2-cp312-cp312-manylinux2014_x86_64.manylinux_2_17_x86_64.whl.metadata (80 kB)
01-Oct-2026 09:41:01 Collecting scipy (from casatasks==6.7.7.7a14849.dev4)
01-Oct-2026 09:41:01   Downloading scipy-1.18.1-cp312-cp312-manylinux_2_27_x86_64.manylinux_2_28_x86_64.whl.metadata (62 kB)
01-Oct-2026 09:41:01 Requirement already satisfied: certifi in /home/casatest/venv/lib/python3.12/site-packages (from casatasks==6.7.7.7a14849.dev4) (2026.7.22)
01-Oct-2026 09:41:01 Requirement already satisfied: pyerfa in /home/casatest/venv/lib/python3.12/site-packages (from casatasks==6.7.7.7a14849.dev4) (2.0.1.5)
01-Oct-2026 09:41:01 Requirement already satisfied: numpy in /home/casatest/venv/lib/python3.12/site-packages (from casatools==6.7.7.7a14849.dev4->casatasks==6.7.7.7a14849.dev4) (2.5.3)
01-Oct-2026 09:41:01 Requirement already satisfied: casaconfig in /home/casatest/venv/lib/python3.12/site-packages (from casatools==6.7.7.7a14849.dev4->casatasks==6.7.7.7a14849.dev4) (1.5.2)
01-Oct-2026 09:41:01 Collecting contourpy>=1.0.1 (from matplotlib->casatasks==6.7.7.7a14849.dev4)
01-Oct-2026 09:41:01   Downloading contourpy-1.4.0-cp312-cp312-manylinux_2_27_x86_64.manylinux_2_28_x86_64.whl.metadata (3.8 kB)
01-Oct-2026 09:41:01 Collecting cycler>=0.10 (from matplotlib->casatasks==6.7.7.7a14849.dev4)
01-Oct-2026 09:41:01   Downloading cycler-0.12.1-py3-none-any.whl.metadata (3.8 kB)
01-Oct-2026 09:41:01 Collecting fonttools>=4.28.2 (from matplotlib->casatasks==6.7.7.7a14849.dev4)
01-Oct-2026 09:41:01   Downloading fonttools-4.66.1-cp312-cp312-manylinux2014_x86_64.manylinux_2_17_x86_64.whl.metadata (130 kB)
01-Oct-2026 09:41:01 Collecting kiwisolver>=1.3.1 (from matplotlib->casatasks==6.7.7.7a14849.dev4)
01-Oct-2026 09:41:02   Downloading kiwisolver-1.5.1-cp312-cp312-manylinux2014_x86_64.manylinux_2_17_x86_64.whl.metadata (5.2 kB)
01-Oct-2026 09:41:02 Requirement already satisfied: packaging>=20.0 in /home/casatest/venv/lib/python3.12/site-packages (from matplotlib->casatasks==6.7.7.7a14849.dev4) (26.3)
01-Oct-2026 09:41:02 Collecting pillow>=9 (from matplotlib->casatasks==6.7.7.7a14849.dev4)
01-Oct-2026 09:41:02   Downloading pillow-12.3.0-cp312-cp312-manylinux_2_27_x86_64.manylinux_2_28_x86_64.whl.metadata (9.1 kB)
01-Oct-2026 09:41:02 Collecting pyparsing>=3 (from matplotlib->casatasks==6.7.7.7a14849.dev4)
01-Oct-2026 09:41:02   Downloading pyparsing-3.3.3-py3-none-any.whl.metadata (5.9 kB)
01-Oct-2026 09:41:02 Collecting python-dateutil>=2.7 (from matplotlib->casatasks==6.7.7.7a14849.dev4)
01-Oct-2026 09:41:02   Downloading python_dateutil-2.9.0.post0-py2.py3-none-any.whl.metadata (8.4 kB)
01-Oct-2026 09:41:02 Collecting six>=1.5 (from python-dateutil>=2.7->matplotlib->casatasks==6.7.7.7a14849.dev4)
01-Oct-2026 09:41:02   Downloading six-1.17.0-py2.py3-none-any.whl.metadata (1.7 kB)
01-Oct-2026 09:41:02 Downloading matplotlib-3.11.2-cp312-cp312-manylinux2014_x86_64.manylinux_2_17_x86_64.whl (9.9 MB)
01-Oct-2026 09:41:02    ━━━━━━━━━━━━━━━━━━━━━━━━━━━━━━━━━━━━━━━━ 9.9/9.9 MB 261.0 MB/s  0:00:00
01-Oct-2026 09:41:02 Downloading contourpy-1.4.0-cp312-cp312-manylinux_2_27_x86_64.manylinux_2_28_x86_64.whl (383 kB)
01-Oct-2026 09:41:02 Downloading cycler-0.12.1-py3-none-any.whl (8.3 kB)
01-Oct-2026 09:41:02 Downloading fonttools-4.66.1-cp312-cp312-manylinux2014_x86_64.manylinux_2_17_x86_64.whl (5.4 MB)
01-Oct-2026 09:41:02    ━━━━━━━━━━━━━━━━━━━━━━━━━━━━━━━━━━━━━━━━ 5.4/5.4 MB 293.2 MB/s  0:00:00
01-Oct-2026 09:41:02 Downloading kiwisolver-1.5.1-cp312-cp312-manylinux2014_x86_64.manylinux_2_17_x86_64.whl (1.5 MB)
01-Oct-2026 09:41:02    ━━━━━━━━━━━━━━━━━━━━━━━━━━━━━━━━━━━━━━━━ 1.5/1.5 MB 173.2 MB/s  0:00:00
01-Oct-2026 09:41:02 Downloading pillow-12.3.0-cp312-cp312-manylinux_2_27_x86_64.manylinux_2_28_x86_64.whl (6.9 MB)
01-Oct-2026 09:41:02    ━━━━━━━━━━━━━━━━━━━━━━━━━━━━━━━━━━━━━━━━ 6.9/6.9 MB 211.3 MB/s  0:00:00
01-Oct-2026 09:41:02 Downloading pyparsing-3.3.3-py3-none-any.whl (126 kB)
01-Oct-2026 09:41:02 Downloading python_dateutil-2.9.0.post0-py2.py3-none-any.whl (229 kB)
01-Oct-2026 09:41:02 Downloading six-1.17.0-py2.py3-none-any.whl (11 kB)
01-Oct-2026 09:41:02 Downloading scipy-1.18.1-cp312-cp312-manylinux_2_27_x86_64.manylinux_2_28_x86_64.whl (35.3 MB)
01-Oct-2026 09:41:02    ━━━━━━━━━━━━━━━━━━━━━━━━━━━━━━━━━━━━━━━━ 35.3/35.3 MB 275.5 MB/s  0:00:00
01-Oct-2026 09:41:02 Installing collected packages: six, scipy, pyparsing, pillow, kiwisolver, fonttools, cycler, contourpy, python-dateutil, matplotlib, casatasks
01-Oct-2026 09:41:09
01-Oct-2026 09:41:09 Successfully installed casatasks-6.7.7.7a14849.dev4 contourpy-1.4.0 cycler-0.12.1 fonttools-4.66.1 kiwisolver-1.5.1 matplotlib-3.11.2 pillow-12.3.0 pyparsing-3.3.3 python-dateutil-2.9.0.post0 scipy-1.18.1 six-1.17.0
01-Oct-2026 09:41:13 branch 'CAS-14849' set up to track 'origin/CAS-14849'.
01-Oct-2026 09:41:13 Switched to a new branch 'CAS-14849'
01-Oct-2026 09:41:13 Runtest command: python3.12 runtest.py --ignore_list 'test_casampi,test_task_msview,test_task_imview,test_task_plotms' -t /home/casatest/casaconfig/tests 2>&1 | tee casatasks_test.log
01-Oct-2026 09:41:13 LICENSE
01-Oct-2026 09:41:13 README.md
01-Oct-2026 09:41:13 __init__.py
01-Oct-2026 09:41:13 casatestutils
01-Oct-2026 09:41:13 pyproject.toml
01-Oct-2026 09:41:13 runtest.py
01-Oct-2026 09:41:13 setup.py
01-Oct-2026 09:41:13 testrunner
01-Oct-2026 09:41:13 tests
01-Oct-2026 09:41:13 version
01-Oct-2026 09:41:13 xmlrunner_to_junit.py
01-Oct-2026 09:41:13 ============================= test session starts ==============================
01-Oct-2026 09:41:13 platform linux -- Python 3.12.9, pytest-9.1.1, pluggy-1.6.0 -- /home/casatest/venv/bin/python3.12
01-Oct-2026 09:41:13 cachedir: .pytest_cache
01-Oct-2026 09:41:13 rootdir: /home/casatest/casa6/casatestutils/nosedir/test_casaconfig
01-Oct-2026 09:41:13 configfile: pytest.ini
01-Oct-2026 09:41:13 collecting ... collected 13 items
01-Oct-2026 09:41:13
01-Oct-2026 09:41:13
01-Oct-2026 09:41:22 test_casaconfig.py::casaconfig_test::test_auto_install_data
01-Oct-2026 09:41:22 Test auto install of all data to measurespath on casatools startup
01-Oct-2026 09:41:22 PASSED
01-Oct-2026 09:41:22
01-Oct-2026 09:41:22 test_casaconfig.py::casaconfig_test::test_auto_update_measures
01-Oct-2026 09:41:22 Test Automatic Measures Updates to measurespath
01-Oct-2026 09:41:22 pull_data using version casarundata-2026.02.19-1.tar.gz, acquiring the lock ...
01-Oct-2026 09:41:26 downloading casarundata contents to  /home/casatest/casa6/casatestutils/nosedir/test_casaconfig/testrundata (336M) ... done
01-Oct-2026 09:41:30 casarundata installed casarundata-2026.02.19-1.tar.gz at /home/casatest/casa6/casatestutils/nosedir/test_casaconfig/testrundata
01-Oct-2026 09:41:30 PASSED
01-Oct-2026 09:41:30
01-Oct-2026 09:41:31 test_casaconfig.py::casaconfig_test::test_casaconfig_measures_available
01-Oct-2026 09:41:31 Test That Today or Yesterday measures data is returned
01-Oct-2026 09:41:31 FAILED
01-Oct-2026 09:41:31
01-Oct-2026 09:41:36 test_casaconfig.py::casaconfig_test::test_casaconfig_measures_update
01-Oct-2026 09:41:36 Test downgrade to upgrade measures data to location
01-Oct-2026 09:41:36 measures_update ... acquiring the lock ...
01-Oct-2026 09:41:36 A measures update has been requested by the force argument
01-Oct-2026 09:41:36   ... finding available measures ...
01-Oct-2026 09:41:36   ... downloading ./WSRT_Measures_20260929-160001.ztar from https://iers.astron.nl/ to /home/casatest/casa6/casatestutils/nosedir/test_casaconfig/testmeasures ...
01-Oct-2026 09:41:36   ... measures data updated at /home/casatest/casa6/casatestutils/nosedir/test_casaconfig/testmeasures
01-Oct-2026 09:41:36 measures_update ... acquiring the lock ...
01-Oct-2026 09:41:36   ... finding available measures ...
01-Oct-2026 09:41:36   ... downloading ./WSRT_Measures_20260928-160001.ztar from https://iers.astron.nl/ to /home/casatest/casa6/casatestutils/nosedir/test_casaconfig/testmeasures ...
01-Oct-2026 09:41:36   ... measures data updated at /home/casatest/casa6/casatestutils/nosedir/test_casaconfig/testmeasures
01-Oct-2026 09:41:36 PASSED
01-Oct-2026 09:41:36
01-Oct-2026 09:41:36 test_casaconfig.py::casaconfig_test::test_config_import
01-Oct-2026 09:41:36 Tests of the config import
01-Oct-2026 09:41:36 PASSED
01-Oct-2026 09:41:36
01-Oct-2026 09:41:37 test_casaconfig.py::casaconfig_test::test_daily_update
01-Oct-2026 09:41:37 test that updates do not happen if the installed data is less than 1 day old and do happen when they are older
01-Oct-2026 09:41:37 pull_data using version casarundata-2025.12.12-1.tar.gz, acquiring the lock ...
01-Oct-2026 09:41:40 downloading casarundata contents to  /home/casatest/casa6/casatestutils/nosedir/test_casaconfig/testrundata (336M) ... done
01-Oct-2026 09:41:44 casarundata installed casarundata-2025.12.12-1.tar.gz at /home/casatest/casa6/casatestutils/nosedir/test_casaconfig/testrundata
01-Oct-2026 09:41:44 data_update: version installed or checked less than 1 day(s) ago, nothing updated or checked
01-Oct-2026 09:41:44 measures_update: version installed or checked less than 1 day(s) ago, nothing updated or checked
01-Oct-2026 09:41:44 data_update: version installed or checked less than 1 day(s) ago, nothing updated or checked
01-Oct-2026 09:41:44 measures_update ... acquiring the lock ...
01-Oct-2026 09:41:44   ... finding available measures ...
01-Oct-2026 09:41:44   ... downloading ./WSRT_Measures_20260929-160001.ztar from https://iers.astron.nl/ to /home/casatest/casa6/casatestutils/nosedir/test_casaconfig/testrundata ...
01-Oct-2026 09:41:44   ... measures data updated at /home/casatest/casa6/casatestutils/nosedir/test_casaconfig/testrundata
01-Oct-2026 09:41:44 data_update using version casarundata-2026.02.19-1.tar.gz, acquiring the lock ...
01-Oct-2026 09:41:44 Removing files using manifest from previous install of casarundata-2025.12.12-1.tar.gz on 2026-10-01
01-Oct-2026 09:41:48 downloading casarundata contents to  /home/casatest/casa6/casatestutils/nosedir/test_casaconfig/testrundata (336M) ... done
01-Oct-2026 09:41:53 casarundata installed casarundata-2026.02.19-1.tar.gz at /home/casatest/casa6/casatestutils/nosedir/test_casaconfig/testrundata
01-Oct-2026 09:41:53 measures_update ... acquiring the lock ...
01-Oct-2026 09:41:53   ... finding available measures ...
01-Oct-2026 09:41:53   ... downloading ./WSRT_Measures_20260929-160001.ztar from https://iers.astron.nl/ to /home/casatest/casa6/casatestutils/nosedir/test_casaconfig/testrundata ...
01-Oct-2026 09:41:53   ... measures data updated at /home/casatest/casa6/casatestutils/nosedir/test_casaconfig/testrundata
01-Oct-2026 09:41:53 PASSED
01-Oct-2026 09:41:53
01-Oct-2026 09:41:53 test_casaconfig.py::casaconfig_test::test_exceptions_no_data
01-Oct-2026 09:41:53 test that exceptions that do not require any data happen when expected
01-Oct-2026 09:41:53 PASSED
01-Oct-2026 09:41:53
01-Oct-2026 09:41:53 test_casaconfig.py::casaconfig_test::test_exceptions_with_data
01-Oct-2026 09:41:53 test that exceptions that require data happen when expected
01-Oct-2026 09:41:53 pull_data using version casarundata-2026.02.19-1.tar.gz, acquiring the lock ...
01-Oct-2026 09:41:57 downloading casarundata contents to  /home/casatest/casa6/casatestutils/nosedir/test_casaconfig/testrundata (336M) ... done
01-Oct-2026 09:41:58 lock file is not empty : /home/casatest/casa6/casatestutils/nosedir/test_casaconfig/testrundata/data_update.lock
01-Oct-2026 09:41:58 The lock file at /home/casatest/casa6/casatestutils/nosedir/test_casaconfig/testrundata is not empty.
01-Oct-2026 09:41:58 A previous attempt to update path may have failed or exited prematurely.
01-Oct-2026 09:41:58 Remove the lock file and set force to True with the desired version (default to most recent).
01-Oct-2026 09:41:58 It may be best to completely repopulate path using pull_data and measures_update.
01-Oct-2026 09:41:58 lock file is not empty : /home/casatest/casa6/casatestutils/nosedir/test_casaconfig/testrundata/data_update.lock
01-Oct-2026 09:41:58 data_update: the lock file at /home/casatest/casa6/casatestutils/nosedir/test_casaconfig/testrundata is not empty.
01-Oct-2026 09:41:58 A previous attempt to update path may have failed or exited prematurely.
01-Oct-2026 09:41:58 Remove the lock file and set force to True with the desired version (default to most recent).
01-Oct-2026 09:41:58 It may be best to completely re-populate path using pull_data and measures_update.
01-Oct-2026 09:41:58 casarundata installed casarundata-2026.02.19-1.tar.gz at /home/casatest/casa6/casatestutils/nosedir/test_casaconfig/testrundata
01-Oct-2026 09:41:58 measures_update ... acquiring the lock ...
01-Oct-2026 09:41:58 data_update using version casarundata-2024.02.09-1.tar.gz, acquiring the lock ...
01-Oct-2026 09:41:58 PASSED
01-Oct-2026 09:41:58
01-Oct-2026 09:41:58 test_casaconfig.py::casaconfig_test::test_file_exists
01-Oct-2026 09:41:58 Test Default config.py exists in casaconfig module
01-Oct-2026 09:41:58 PASSED
01-Oct-2026 09:41:58
01-Oct-2026 09:41:59 test_casaconfig.py::casaconfig_test::test_import_casatools_bad_measurespath
01-Oct-2026 09:41:59 Test that import casatools will return ImportError with measurespath set to an empty directory that cannot be written to
01-Oct-2026 09:41:59 PASSED
01-Oct-2026 09:41:59
01-Oct-2026 09:44:09 test_casaconfig.py::casaconfig_test::test_measures_site measures_update can't find specified version ./WSRT_Measures_20260927-160001.ztar at site https://go.nrao.edu/iers/
01-Oct-2026 09:46:35 measures_update can't find specified version NRAO_Measures_20260927-140501.ztar at site https://iers.astron.nl/
01-Oct-2026 09:46:35 Unable to retrieve list of available measures versions, measures_site value may be an empty list or no files were found at measures_site, check and try again.
01-Oct-2026 09:46:35 There was a remote error while attempting to update measures at /home/casatest/casa6/casatestutils/nosedir/test_casaconfig/testmeasures
01-Oct-2026 09:46:35 Check the value of measures_site and try again
01-Oct-2026 09:46:36
01-Oct-2026 09:46:36 tests related to measures site
01-Oct-2026 09:46:36 Warning: the most recent measures tar file at each of the sites was older than config.measures_site_interval
01-Oct-2026 09:46:36 https://go.nrao.edu/iers/ had the most recent measures tar file, returning that list
01-Oct-2026 09:46:36 Warning: the most recent measures tar file at each of the sites was older than config.measures_site_interval
01-Oct-2026 09:46:36 https://go.nrao.edu/iers/ had the most recent measures tar file, returning that list
01-Oct-2026 09:46:36 measures_update ... acquiring the lock ...
01-Oct-2026 09:46:36 A measures update has been requested by the force argument
01-Oct-2026 09:46:36   ... finding available measures ...
01-Oct-2026 09:46:36   ... downloading ./WSRT_Measures_20260929-160001.ztar from https://iers.astron.nl/ to /home/casatest/casa6/casatestutils/nosedir/test_casaconfig/testmeasures ...
01-Oct-2026 09:46:36   ... measures data updated at /home/casatest/casa6/casatestutils/nosedir/test_casaconfig/testmeasures
01-Oct-2026 09:46:36 di : {'site': 'https://iers.astron.nl/', 'version': './WSRT_Measures_20260929-160001.ztar', 'date': '2026-10-01', 'age': 1.0819898711310493e-08}
01-Oct-2026 09:46:36 measures_update ... acquiring the lock ...
01-Oct-2026 09:46:36 A measures update has been requested by the force argument
01-Oct-2026 09:46:36   ... finding available measures ...
01-Oct-2026 09:46:36   ... downloading ./WSRT_Measures_20260927-160001.ztar from https://iers.astron.nl/ to /home/casatest/casa6/casatestutils/nosedir/test_casaconfig/testmeasures ...
01-Oct-2026 09:46:36   ... measures data updated at /home/casatest/casa6/casatestutils/nosedir/test_casaconfig/testmeasures
01-Oct-2026 09:46:36 measures_update ... acquiring the lock ...
01-Oct-2026 09:46:36 A measures update has been requested by the force argument
01-Oct-2026 09:46:36   ... finding available measures ...
01-Oct-2026 09:46:36   ... downloading ./WSRT_Measures_20260927-160001.ztar from https://iers.astron.nl/ to /home/casatest/casa6/casatestutils/nosedir/test_casaconfig/testmeasures ...
01-Oct-2026 09:46:36   ... measures data updated at /home/casatest/casa6/casatestutils/nosedir/test_casaconfig/testmeasures
01-Oct-2026 09:46:36 measures_update ... acquiring the lock ...
01-Oct-2026 09:46:36 A measures update has been requested by the force argument
01-Oct-2026 09:46:36   ... finding available measures ...
01-Oct-2026 09:46:36   ... downloading ./WSRT_Measures_20260929-160001.ztar from https://iers.astron.nl/ to /home/casatest/casa6/casatestutils/nosedir/test_casaconfig/testmeasures ...
01-Oct-2026 09:46:36   ... measures data updated at /home/casatest/casa6/casatestutils/nosedir/test_casaconfig/testmeasures
01-Oct-2026 09:46:36 measures_update ... acquiring the lock ...
01-Oct-2026 09:46:36 A measures update has been requested by the force argument
01-Oct-2026 09:46:36   ... finding available measures ...
01-Oct-2026 09:46:36 measures_update ... acquiring the lock ...
01-Oct-2026 09:46:36 A measures update has been requested by the force argument
01-Oct-2026 09:46:36   ... finding available measures ...
01-Oct-2026 09:46:36   ... downloading NRAO_Measures_20260927-140501.ztar from https://go.nrao.edu/iers/ to /home/casatest/casa6/casatestutils/nosedir/test_casaconfig/testmeasures ...
01-Oct-2026 09:46:36   ... measures data updated at /home/casatest/casa6/casatestutils/nosedir/test_casaconfig/testmeasures
01-Oct-2026 09:46:36 measures_update ... acquiring the lock ...
01-Oct-2026 09:46:36 A measures update has been requested by the force argument
01-Oct-2026 09:46:36   ... finding available measures ...
01-Oct-2026 09:46:36   ... downloading NRAO_Measures_20260927-140501.ztar from https://go.nrao.edu/iers/ to /home/casatest/casa6/casatestutils/nosedir/test_casaconfig/testmeasures ...
01-Oct-2026 09:46:36   ... measures data updated at /home/casatest/casa6/casatestutils/nosedir/test_casaconfig/testmeasures
01-Oct-2026 09:46:36 measures_update ... acquiring the lock ...
01-Oct-2026 09:46:36 A measures update has been requested by the force argument
01-Oct-2026 09:46:36   ... finding available measures ...
01-Oct-2026 09:46:36   ... downloading NRAO_Measures_20260930-140606.ztar from https://go.nrao.edu/iers/ to /home/casatest/casa6/casatestutils/nosedir/test_casaconfig/testmeasures ...
01-Oct-2026 09:46:36   ... measures data updated at /home/casatest/casa6/casatestutils/nosedir/test_casaconfig/testmeasures
01-Oct-2026 09:46:36 measures_update ... acquiring the lock ...
01-Oct-2026 09:46:36 A measures update has been requested by the force argument
01-Oct-2026 09:46:36   ... finding available measures ...
01-Oct-2026 09:46:36 measures_update ... acquiring the lock ...
01-Oct-2026 09:46:36 A measures update has been requested by the force argument
01-Oct-2026 09:46:36   ... finding available measures ...
01-Oct-2026 09:46:36 PASSED
01-Oct-2026 09:46:36
01-Oct-2026 09:46:36 test_casaconfig.py::casaconfig_test::test_read_measurespath_from_user_config
01-Oct-2026 09:46:36 Test casaconfig downloads specific measures data to location and casatools reads that data location
01-Oct-2026 09:46:36 pull_data using version casarundata-2026.02.19-1.tar.gz, acquiring the lock ...
01-Oct-2026 09:46:40 downloading casarundata contents to  /home/casatest/casa6/casatestutils/nosedir/test_casaconfig/testrundata (336M) ... done
01-Oct-2026 09:46:44 casarundata installed casarundata-2026.02.19-1.tar.gz at /home/casatest/casa6/casatestutils/nosedir/test_casaconfig/testrundata
01-Oct-2026 09:46:44 PASSED
01-Oct-2026 09:46:44
01-Oct-2026 09:46:44 test_casaconfig.py::casaconfig_test::test_update_interval
01-Oct-2026 09:46:44 tests use of config update_interval values
01-Oct-2026 09:46:44 pull_data using version casarundata-2026.02.19-1.tar.gz, acquiring the lock ...
01-Oct-2026 09:46:48 downloading casarundata contents to  /home/casatest/casa6/casatestutils/nosedir/test_casaconfig/testrundata (336M) ... done
01-Oct-2026 09:46:49 casarundata installed casarundata-2026.02.19-1.tar.gz at /home/casatest/casa6/casatestutils/nosedir/test_casaconfig/testrundata
01-Oct-2026 09:46:49 data_update using version casarundata-2025.12.12-1.tar.gz, acquiring the lock ...
01-Oct-2026 09:46:49 Removing files using manifest from previous install of casarundata-2026.02.19-1.tar.gz on 2026-10-01
01-Oct-2026 09:46:53 downloading casarundata contents to  /home/casatest/casa6/casatestutils/nosedir/test_casaconfig/testrundata (336M) ... done
01-Oct-2026 09:46:54 casarundata installed casarundata-2025.12.12-1.tar.gz at /home/casatest/casa6/casatestutils/nosedir/test_casaconfig/testrundata
01-Oct-2026 09:46:54 data_update: version installed or checked less than 1 day(s) ago, nothing updated or checked
01-Oct-2026 09:46:54 data_update using version casarundata-2026.02.19-1.tar.gz, acquiring the lock ...
01-Oct-2026 09:46:54 Removing files using manifest from previous install of casarundata-2025.12.12-1.tar.gz on 2026-10-01
01-Oct-2026 09:46:57 downloading casarundata contents to  /home/casatest/casa6/casatestutils/nosedir/test_casaconfig/testrundata (336M) ... done
01-Oct-2026 09:47:04 casarundata installed casarundata-2026.02.19-1.tar.gz at /home/casatest/casa6/casatestutils/nosedir/test_casaconfig/testrundata
01-Oct-2026 09:47:04 measures_update ... acquiring the lock ...
01-Oct-2026 09:47:04 A measures update has been requested by the force argument
01-Oct-2026 09:47:04   ... finding available measures ...
01-Oct-2026 09:47:04   ... downloading ./WSRT_Measures_20260928-160001.ztar from https://iers.astron.nl/ to /home/casatest/casa6/casatestutils/nosedir/test_casaconfig/testrundata ...
01-Oct-2026 09:47:04   ... measures data updated at /home/casatest/casa6/casatestutils/nosedir/test_casaconfig/testrundata
01-Oct-2026 09:47:04 measures_update: version installed or checked less than 1 day(s) ago, nothing updated or checked
01-Oct-2026 09:47:04 measures_update ... acquiring the lock ...
01-Oct-2026 09:47:04   ... finding available measures ...
01-Oct-2026 09:47:04   ... downloading ./WSRT_Measures_20260929-160001.ztar from https://iers.astron.nl/ to /home/casatest/casa6/casatestutils/nosedir/test_casaconfig/testrundata ...
01-Oct-2026 09:47:04   ... measures data updated at /home/casatest/casa6/casatestutils/nosedir/test_casaconfig/testrundata
01-Oct-2026 09:47:04 PASSED
01-Oct-2026 09:47:04
01-Oct-2026 09:47:04 =================================== FAILURES ===================================
01-Oct-2026 09:47:04 ______________ casaconfig_test.test_casaconfig_measures_available ______________
01-Oct-2026 09:47:04 test_casaconfig.py:176: in test_casaconfig_measures_available
01-Oct-2026 09:47:04     self.assertTrue(any(elem in self.get_meas_avail() for elem in [measuresdata_today, measuresdata_yesterday]))
01-Oct-2026 09:47:04 E   AssertionError: False is not true
01-Oct-2026 09:47:04 - generated xml file: /home/casatest/casa6/casatestutils/nosedir/xml/test_casaconfig/nose.xml -
01-Oct-2026 09:47:04 =========================== short test summary info ============================
01-Oct-2026 09:47:04 FAILED test_casaconfig.py::casaconfig_test::test_casaconfig_measures_available
01-Oct-2026 09:47:04 ============= 1 failed, 12 passed, 1 warning in 351.42s (0:05:51) ==============
01-Oct-2026 09:47:04 Namespace(list=False, verbose=False, dry_run=False, classes=None, file=None, mapfile=None, branch=None, merge_target=None, pkg=None, work_dir=None, ncores=2, test_paths='/home/casatest/casaconfig/tests', test_list=None, test_config=None, test_group=None, pmode=None, bamboo=False, cachedir=None, ignore_list='test_casampi,test_task_msview,test_task_imview,test_task_plotms', run_skipped=False, only_skipped=False)
01-Oct-2026 09:47:04
01-Oct-2026 09:47:04 Operating system: Linux
01-Oct-2026 09:47:04
01-Oct-2026 09:47:04 Arguments Sent Direct To Pytest :  []
01-Oct-2026 09:47:04
01-Oct-2026 09:47:04 Tests to Ignore:  ['test_casampi', 'test_task_msview', 'test_task_imview', 'test_task_plotms']
01-Oct-2026 09:47:04 Running 1 Test(s)
01-Oct-2026 09:47:04 Cleaning: /home/casatest/casa6/casatestutils/nosedir/
01-Oct-2026 09:47:04 Tests: ['/home/casatest/casaconfig/tests/test_casaconfig.py']
01-Oct-2026 09:47:04
01-Oct-2026 09:47:04 Setting Working Directory: /home/casatest/casa6/casatestutils/nosedir/test_casaconfig/
01-Oct-2026 09:47:04 Test Directory: /home/casatest/casa6/casatestutils/nosedir/test_casaconfig
01-Oct-2026 09:47:04
01-Oct-2026 09:47:04 Running Command: pytest --junitxml=/home/casatest/casa6/casatestutils/nosedir/xml/test_casaconfig/nose.xml -s --disable-pytest-warnings --verbose -ra --tb=short /home/casatest/casa6/casatestutils/nosedir/test_casaconfig/
01-Oct-2026 09:47:05 total 79564
01-Oct-2026 09:47:05 -rw-r--r-- 1 casaci 15001  1934135 Oct  1 13:39 casatasks-6.7.7.7a14849.dev4-py3-none-any.whl
01-Oct-2026 09:47:05 -rw-r--r-- 1 casaci root     14994 Oct  1 13:47 casatasks_test.log
01-Oct-2026 09:47:05 -rw-r--r-- 1 casaci 15001   161131 Oct  1 13:39 casatestutils-6.7.7.7a14849.dev4-py3-none-any.whl
01-Oct-2026 09:47:05 -rw-r--r-- 1 casaci 15001 79346756 Oct  1 13:39 casatools-6.7.7.7a14849.dev4-cp312-cp312-manylinux_2_28_x86_64.whl
01-Oct-2026 09:47:05 -rw-r--r-- 1 casaci root       907 Oct  1 13:47 requirements.txt
01-Oct-2026 09:47:05 -rw-r--r-- 1 casaci root      1878 Oct  1 13:47 test_casaconfig.xml
01-Oct-2026 09:47:05 Finished task 'Test wheel' with result: Success
01-Oct-2026 09:47:05 Starting task 'Inject is_641' of type 'com.atlassian.bamboo.plugins.bamboo-variable-inject-plugin:inject'
01-Oct-2026 09:47:05 Injected variable bamboo.inject.is_641=False in LOCAL scope
01-Oct-2026 09:47:05 Finished task 'Inject is_641' with result: Success
01-Oct-2026 09:47:05
Substituting variable: ${bamboo.agentId} with 153550849
01-Oct-2026 09:47:05
Substituting variable: ${bamboo.agentId} with 153550849
01-Oct-2026 09:47:05
Substituting variable: ${bamboo.agentId} with 153550849
01-Oct-2026 09:47:05
Substituting variable: ${bamboo.agentId} with 153550849
01-Oct-2026 09:47:05 Starting task 'Tar work directory' of type 'com.atlassian.bamboo.plugins.scripttask:task.builder.script'
01-Oct-2026 09:47:05
Beginning to execute external process for build 'CASASPECS - Dev Test 3.12 - CAS-14849 - Test Tasks Many Linux 2.28 Py3.12 #6 (CASASPECS-DEVTESTPY312147-TTM228PY312-6)'
... running command line:
/opt/ci_workspace/casa/bamboo/agent1/temp/CASASPECS-DEVTESTPY312147-TTM228PY312-6-ScriptBuildTask-16023930253978359744.sh
... in: /opt/ci_workspace/casa/bamboo/agent1/xml-data/build-dir/CASASPECS-DEVTESTPY312147-TTM228PY312
01-Oct-2026 09:47:05 Package working directory
01-Oct-2026 09:47:05 nosedir/
01-Oct-2026 09:47:05 nosedir/test_casaconfig/
01-Oct-2026 09:47:05 nosedir/test_casaconfig/test_casaconfig.py
01-Oct-2026 09:47:05 nosedir/test_casaconfig/conftest.py
01-Oct-2026 09:47:05 nosedir/test_casaconfig/casa-20261001-134113.log
01-Oct-2026 09:47:05 nosedir/test_casaconfig/casa-20261001-134114.log
01-Oct-2026 09:47:05 nosedir/test_casaconfig/short_summary.log
01-Oct-2026 09:47:05 nosedir/test_casaconfig/casa-20261001-134127.log
01-Oct-2026 09:47:05 nosedir/test_casaconfig/casa-20261001-134158.log
01-Oct-2026 09:47:05 nosedir/test_casaconfig/casa-20261001-134641.log
01-Oct-2026 09:47:05 nosedir/xml/
01-Oct-2026 09:47:05 nosedir/xml/test_casaconfig/
01-Oct-2026 09:47:05 nosedir/xml/test_casaconfig/nose.xml
01-Oct-2026 09:47:05 nosedir/summary_of_failed.log
01-Oct-2026 09:47:05 nosedir/requirements.txt
01-Oct-2026 09:47:05 total 79580
01-Oct-2026 09:47:05 -rw-r--r-- 1 casaci 15001  1934135 Oct  1 13:39 casatasks-6.7.7.7a14849.dev4-py3-none-any.whl
01-Oct-2026 09:47:05 -rw-r--r-- 1 casaci root     14994 Oct  1 13:47 casatasks_test.log
01-Oct-2026 09:47:05 -rw-r--r-- 1 casaci 15001   161131 Oct  1 13:39 casatestutils-6.7.7.7a14849.dev4-py3-none-any.whl
01-Oct-2026 09:47:05 -rw-r--r-- 1 casaci 15001 79346756 Oct  1 13:39 casatools-6.7.7.7a14849.dev4-cp312-cp312-manylinux_2_28_x86_64.whl
01-Oct-2026 09:47:05 -rw-r--r-- 1 casaci root       907 Oct  1 13:47 requirements.txt
01-Oct-2026 09:47:05 -rw-r--r-- 1 casaci root      1878 Oct  1 13:47 test_casaconfig.xml
01-Oct-2026 09:47:05 -rw-r--r-- 1 casaci root     12713 Oct  1 13:47 work-manylinux_228_casatasks-3.12.tar.gz
01-Oct-2026 09:47:05 Done packaging working directory
01-Oct-2026 09:47:05 Finished task 'Tar work directory' with result: Success
01-Oct-2026 09:47:05 Starting task 'Parse tests' of type 'com.atlassian.bamboo.plugins.testresultparser:task.testresultparser.junit'
01-Oct-2026 09:47:05 Parsing test results under /opt/ci_workspace/casa/bamboo/agent1/xml-data/build-dir/CASASPECS-DEVTESTPY312147-TTM228PY312...
01-Oct-2026 09:47:05 Failing task since 1 failing test cases were found.
01-Oct-2026 09:47:05 Finished task 'Parse tests' with result: Failed
01-Oct-2026 09:47:05 Running post build plugin 'Docker Container Cleanup'
01-Oct-2026 09:47:05
Beginning to execute external process for build 'CASASPECS - Dev Test 3.12 - CAS-14849 - Test Tasks Many Linux 2.28 Py3.12 #6 (CASASPECS-DEVTESTPY312147-TTM228PY312-6)'
... running command line:
/usr/bin/docker rm -f wheel-container-test_153550849
... in: /opt/ci_workspace/casa/bamboo/agent1/xml-data/build-dir/CASASPECS-DEVTESTPY312147-TTM228PY312
01-Oct-2026 09:47:07 wheel-container-test_153550849
01-Oct-2026 09:47:07 Running post build plugin 'NCover Results Collector'
01-Oct-2026 09:47:07 Running post build plugin 'Build Results Label Collector'
01-Oct-2026 09:47:07 Running post build plugin 'Clover Results Collector'
01-Oct-2026 09:47:07 Running post build plugin 'npm Cache Cleanup'
01-Oct-2026 09:47:07 Running post build plugin 'Artifact Copier'
01-Oct-2026 09:47:07 Publishing an artifact: Workdir
01-Oct-2026 09:47:07 Finished publishing of artifact Non required job artifact Http Compression On : [Workdir], patterns: [work*.tar.gz] anchored at: [wheeldirectory/] in 28.02 ms
01-Oct-2026 09:47:07 Publishing an artifact: XML Directories
01-Oct-2026 09:47:07 Finished publishing of artifact Non required job artifact Http Compression On : [XML Directories], patterns: [**/*.xml] anchored at: [wheeldirectory/] in 8.705 ms
01-Oct-2026 09:47:07 Publishing an artifact: casatasks_test.log
01-Oct-2026 09:47:07 Finished publishing of artifact Non required job artifact Http Compression On : [casatasks_test.log], patterns: [casatasks_test.log] anchored at: [wheeldirectory/] in 9.123 ms
01-Oct-2026 09:47:07 Publishing an artifact: requirements.txt
01-Oct-2026 09:47:07 Finished publishing of artifact Non required job artifact Http Compression On : [requirements.txt], patterns: [requirements.txt] anchored at: [wheeldirectory/] in 9.410 ms
01-Oct-2026 09:47:07 Finalising the build...
01-Oct-2026 09:47:07 Stopping timer.
01-Oct-2026 09:47:07 Build CASASPECS-DEVTESTPY312147-TTM228PY312-6 completed.
01-Oct-2026 09:47:08 Running on server: post build plugin 'Build Hanging Detection Configuration'
01-Oct-2026 09:47:08 Running on server: post build plugin 'NCover Results Collector'
01-Oct-2026 09:47:08 Running on server: post build plugin 'Build Labeller'
01-Oct-2026 09:47:08 Running on server: post build plugin 'Clover Delta Calculator'
01-Oct-2026 09:47:08 Running on server: post build plugin 'Maven Dependencies Postprocessor'
01-Oct-2026 09:47:08 All post build plugins have finished
01-Oct-2026 09:47:08 Generating build results summary...
01-Oct-2026 09:47:08 Saving build results to disk...
01-Oct-2026 09:47:08 Store variable context...
01-Oct-2026 09:47:08 Finished building CASASPECS-DEVTESTPY312147-TTM228PY312-6.