Build: #6 failed Manual run by CASA adm account
Build result summary
Details
- Completed
- Queue duration
- 1 second
- Duration
- 14 minutes
- Labels
- None
- Revisions
-
- CASA6
-
b7c9977a194ec0f6d5ce3a54c3a47be204959703
- OPEN-CASA-PKG
-
e5285e68467f01199807a1f1a978aec8a4781be7
- Total tests
- 1424
- Failing since
- #3 (Manual run by CASA adm account – )
- Fixed in
- #7 (Manual run by CASA adm account)
Tests
- 0 New failures
- 2 Existing failures
- 0 Fixed
- 10 Quarantined / skipped
Responsible
-
Bob Garwood
Automatically assigned
Code commits
| Author | Commit | Commit date | |
|---|---|---|---|
|
|
Bob Garwood |
b7c9977a194ec0f6d5ce3a54c3a47be204959703
|
|
Configuration changes
Some of the jobs or stages referenced by this result no longer exist.
Tests
| Status | Test | Failing since | View job | Duration | |
|---|---|---|---|---|---|
|
test_casaconfig
casaconfig_test.test_casaconfig_measures_available
|
Failing since build #3 (Manual run by CASA adm account) | Test Tasks Many Linux 2.28 Py3.12 | < 1 sec | ||
AssertionError: False is not true
test_casaconfig.py:176: in test_casaconfig_measures_available
self.assertTrue(any(elem in self.get_meas_avail() for elem in [measuresdata_today, measuresdata_yesterday]))
E AssertionError: False is not true
|
|||||
|
test_casaconfig
casaconfig_test.test_casaconfig_measures_available
|
Failing since build #3 (Manual run by CASA adm account) | Test Tasks macOS 15 Py3.12 | < 1 sec | ||
AssertionError: False is not true
test_casaconfig.py:176: in test_casaconfig_measures_available
self.assertTrue(any(elem in self.get_meas_avail() for elem in [measuresdata_today, measuresdata_yesterday]))
E AssertionError: False is not true
|
|||||