Build: #4 failed

Job: Test Tools macOS 15 Py3.12 was successful

Build log

The build generated 53,287 lines of output.   The output is too long and has been truncated to the last 1,000 lines. Download or view full build log.

30-Sep-2026 20:01:33 2026-10-01 00:01:34        WARN        calibrater::setvi(bool,bool)        Already using NEW VisibilityIterator.
30-Sep-2026 20:01:33 test_tool_calibrater.py::calibrater_test::test_returnDict
30-Sep-2026 20:01:33 Check that the returndict function gives a dictonary with the expected keys 
30-Sep-2026 20:01:33 PASSED
30-Sep-2026 20:01:33
30-Sep-2026 20:01:33 2026-10-01 00:01:34        INFO        calibrater::open        ****Using NEW VI2-driven calibrater tool****
30-Sep-2026 20:01:33 2026-10-01 00:01:34        INFO        calibrater::open        Opening MS: gaincaltest2.ms for calibration.
30-Sep-2026 20:01:33 2026-10-01 00:01:34        INFO                Clearing all model records in MS header.
30-Sep-2026 20:01:33 2026-10-01 00:01:34        INFO        VisSetUtil::addScrCols        Adding MODEL_DATA and CORRECTED_DATA column(s).
30-Sep-2026 20:01:34 2026-10-01 00:01:34        INFO        VisSetUtil::initScrCols        Initializing MODEL_DATA to (unity).
30-Sep-2026 20:01:34 2026-10-01 00:01:34        INFO        VisSetUtil::initScrCols        Initialized 328860 rows.
30-Sep-2026 20:01:34 2026-10-01 00:01:34        INFO        Calibrater::        Initializing nominal selection to the whole MS.
30-Sep-2026 20:01:34 2026-10-01 00:01:34        INFO        calibrater::setdata        Beginning selectvis--(MSSelection version)-------
30-Sep-2026 20:01:34 2026-10-01 00:01:34        INFO        calibrater::reset        Reseting solve/apply state
30-Sep-2026 20:01:34 2026-10-01 00:01:34        INFO        Calibrater::selectvis        Performing selection on MeasurementSet
30-Sep-2026 20:01:34 2026-10-01 00:01:34        INFO        Calibrater::selectvis+         Selecting on antenna/baseline: '0'
30-Sep-2026 20:01:34 2026-10-01 00:01:34        INFO        Calibrater::selectvis        By selection 328860 rows are reduced to 65772
30-Sep-2026 20:01:34 2026-10-01 00:01:34        INFO        Calibrater::selectvis        Frequency selection: Selecting all channels in all spws.
30-Sep-2026 20:01:34 2026-10-01 00:01:34        INFO        calibrater::setdata        chanmode=none nchan=1 start=0 step=1 mStart='0km/s' mStep='0km/s' msSelect=''
30-Sep-2026 20:01:34 2026-10-01 00:01:34        INFO        calibrater::setapply        Beginning setapply--(MSSelection version)-------
30-Sep-2026 20:01:34 2026-10-01 00:01:34        INFO        Calibrater::setapply(type, applypar)        Arranging to APPLY:
30-Sep-2026 20:01:34 2026-10-01 00:01:34        INFO        Calibrater::setapply(type, applypar)        .   G Jones: table=gaincaltest2.ms.G0 select= interp=linear spwmap=[-1] calWt=false
30-Sep-2026 20:01:34 2026-10-01 00:01:34        INFO        calibrater::correct        Beginning correct---------------------------
30-Sep-2026 20:01:34 2026-10-01 00:01:34        INFO        Calibrater::correct2 (VI2/VB2)        The following calibration terms are arranged for apply:
30-Sep-2026 20:01:34 2026-10-01 00:01:34        INFO        Calibrater::correct2 (VI2/VB2)        .   G Jones: table=gaincaltest2.ms.G0 select= interp=linear spwmap=[-1] calWt=false
30-Sep-2026 20:01:34 2026-10-01 00:01:35        INFO        calibrater::correct        Finished correcting.
30-Sep-2026 20:01:34 2026-10-01 00:01:35        WARN        calibrater::setvi(bool,bool)        Already using NEW VisibilityIterator.
30-Sep-2026 20:01:34 test_tool_calibrater.py::calibrater_test::test_selectVisBaseline
30-Sep-2026 20:01:34 Check that selectvis properly selects baseline/antenna
30-Sep-2026 20:01:34 65772 65772
30-Sep-2026 20:01:34 263088 263088
30-Sep-2026 20:01:34 PASSED
30-Sep-2026 20:01:34
30-Sep-2026 20:01:35 2026-10-01 00:01:35        INFO        calibrater::open        ****Using NEW VI2-driven calibrater tool****
30-Sep-2026 20:01:35 2026-10-01 00:01:35        INFO        calibrater::open        Opening MS: gaincaltest2.ms for calibration.
30-Sep-2026 20:01:35 2026-10-01 00:01:35        INFO                Clearing all model records in MS header.
30-Sep-2026 20:01:35 2026-10-01 00:01:35        INFO        VisSetUtil::addScrCols        Adding MODEL_DATA and CORRECTED_DATA column(s).
30-Sep-2026 20:01:35 2026-10-01 00:01:35        INFO        VisSetUtil::initScrCols        Initializing MODEL_DATA to (unity).
30-Sep-2026 20:01:35 2026-10-01 00:01:36        INFO        VisSetUtil::initScrCols        Initialized 328860 rows.
30-Sep-2026 20:01:35 2026-10-01 00:01:36        INFO        Calibrater::        Initializing nominal selection to the whole MS.
30-Sep-2026 20:01:35 2026-10-01 00:01:36        INFO        calibrater::setdata        Beginning selectvis--(MSSelection version)-------
30-Sep-2026 20:01:35 2026-10-01 00:01:36        INFO        calibrater::reset        Reseting solve/apply state
30-Sep-2026 20:01:35 2026-10-01 00:01:36        INFO        Calibrater::selectvis        Performing selection on MeasurementSet
30-Sep-2026 20:01:35 2026-10-01 00:01:36        INFO        Calibrater::selectvis+         Selecting on field: '0'
30-Sep-2026 20:01:35 2026-10-01 00:01:36        INFO        Calibrater::selectvis        By selection 328860 rows are reduced to 172260
30-Sep-2026 20:01:35 2026-10-01 00:01:36        INFO        Calibrater::selectvis        Frequency selection: Selecting all channels in all spws.
30-Sep-2026 20:01:35 2026-10-01 00:01:36        INFO        calibrater::setdata        chanmode=none nchan=1 start=0 step=1 mStart='0km/s' mStep='0km/s' msSelect=''
30-Sep-2026 20:01:35 2026-10-01 00:01:36        INFO        calibrater::setapply        Beginning setapply--(MSSelection version)-------
30-Sep-2026 20:01:35 2026-10-01 00:01:36        INFO        Calibrater::setapply(type, applypar)        Arranging to APPLY:
30-Sep-2026 20:01:35 2026-10-01 00:01:36        INFO        Calibrater::setapply(type, applypar)        .   G Jones: table=gaincaltest2.ms.G0 select= interp=linear spwmap=[-1] calWt=false
30-Sep-2026 20:01:35 2026-10-01 00:01:36        INFO        calibrater::correct        Beginning correct---------------------------
30-Sep-2026 20:01:35 2026-10-01 00:01:36        INFO        Calibrater::correct2 (VI2/VB2)        The following calibration terms are arranged for apply:
30-Sep-2026 20:01:35 2026-10-01 00:01:36        INFO        Calibrater::correct2 (VI2/VB2)        .   G Jones: table=gaincaltest2.ms.G0 select= interp=linear spwmap=[-1] calWt=false
30-Sep-2026 20:01:35 2026-10-01 00:01:36        INFO        calibrater::correct        Finished correcting.
30-Sep-2026 20:01:36 2026-10-01 00:01:36        WARN        calibrater::setvi(bool,bool)        Already using NEW VisibilityIterator.
30-Sep-2026 20:01:36 test_tool_calibrater.py::calibrater_test::test_selectVisField
30-Sep-2026 20:01:36 Check that the field is properly selected by selectvis
30-Sep-2026 20:01:36 PASSED
30-Sep-2026 20:01:36
30-Sep-2026 20:01:36 2026-10-01 00:01:36        INFO        calibrater::open        ****Using NEW VI2-driven calibrater tool****
30-Sep-2026 20:01:36 2026-10-01 00:01:36        INFO        calibrater::open        Opening MS: gaincaltest2.ms for calibration.
30-Sep-2026 20:01:36 2026-10-01 00:01:36        INFO                Clearing all model records in MS header.
30-Sep-2026 20:01:36 2026-10-01 00:01:36        INFO        VisSetUtil::addScrCols        Adding MODEL_DATA and CORRECTED_DATA column(s).
30-Sep-2026 20:01:36 2026-10-01 00:01:37        INFO        VisSetUtil::initScrCols        Initializing MODEL_DATA to (unity).
30-Sep-2026 20:01:36 2026-10-01 00:01:37        INFO        VisSetUtil::initScrCols        Initialized 328860 rows.
30-Sep-2026 20:01:36 2026-10-01 00:01:37        INFO        Calibrater::        Initializing nominal selection to the whole MS.
30-Sep-2026 20:01:36 2026-10-01 00:01:37        INFO        calibrater::setdata        Beginning selectvis--(MSSelection version)-------
30-Sep-2026 20:01:36 2026-10-01 00:01:37        INFO        calibrater::reset        Reseting solve/apply state
30-Sep-2026 20:01:36 2026-10-01 00:01:37        INFO        Calibrater::selectvis        Performing selection on MeasurementSet
30-Sep-2026 20:01:36 2026-10-01 00:01:37        INFO        Calibrater::selectvis+         Selecting on intent: '*AMPLI*'
30-Sep-2026 20:01:36 2026-10-01 00:01:37        INFO        Calibrater::selectvis        Selection did not drop any rows
30-Sep-2026 20:01:36 2026-10-01 00:01:37        INFO        Calibrater::selectvis        Frequency selection: Selecting all channels in all spws.
30-Sep-2026 20:01:36 2026-10-01 00:01:37        INFO        calibrater::setdata        chanmode=none nchan=1 start=0 step=1 mStart='0km/s' mStep='0km/s' msSelect=''
30-Sep-2026 20:01:36 2026-10-01 00:01:37        INFO        calibrater::setapply        Beginning setapply--(MSSelection version)-------
30-Sep-2026 20:01:36 2026-10-01 00:01:37        INFO        Calibrater::setapply(type, applypar)        Arranging to APPLY:
30-Sep-2026 20:01:36 2026-10-01 00:01:37        INFO        Calibrater::setapply(type, applypar)        .   G Jones: table=gaincaltest2.ms.G0 select= interp=linear spwmap=[-1] calWt=false
30-Sep-2026 20:01:36 2026-10-01 00:01:37        INFO        calibrater::correct        Beginning correct---------------------------
30-Sep-2026 20:01:36 2026-10-01 00:01:37        INFO        Calibrater::correct2 (VI2/VB2)        The following calibration terms are arranged for apply:
30-Sep-2026 20:01:36 2026-10-01 00:01:37        INFO        Calibrater::correct2 (VI2/VB2)        .   G Jones: table=gaincaltest2.ms.G0 select= interp=linear spwmap=[-1] calWt=false
30-Sep-2026 20:01:37 2026-10-01 00:01:38        INFO        calibrater::correct        Finished correcting.
30-Sep-2026 20:01:37 2026-10-01 00:01:38        WARN        calibrater::setvi(bool,bool)        Already using NEW VisibilityIterator.
30-Sep-2026 20:01:37 test_tool_calibrater.py::calibrater_test::test_selectVisIntent
30-Sep-2026 20:01:37 Check that the intent is properly selected by selectvis
30-Sep-2026 20:01:37 PASSED
30-Sep-2026 20:01:37
30-Sep-2026 20:01:37 2026-10-01 00:01:38        INFO        calibrater::open        ****Using NEW VI2-driven calibrater tool****
30-Sep-2026 20:01:37 2026-10-01 00:01:38        INFO        calibrater::open        Opening MS: gaincaltest2.ms for calibration.
30-Sep-2026 20:01:37 2026-10-01 00:01:38        INFO                Clearing all model records in MS header.
30-Sep-2026 20:01:37 2026-10-01 00:01:38        INFO        VisSetUtil::addScrCols        Adding MODEL_DATA and CORRECTED_DATA column(s).
30-Sep-2026 20:01:38 2026-10-01 00:01:38        INFO        VisSetUtil::initScrCols        Initializing MODEL_DATA to (unity).
30-Sep-2026 20:01:38 2026-10-01 00:01:38        INFO        VisSetUtil::initScrCols        Initialized 328860 rows.
30-Sep-2026 20:01:38 2026-10-01 00:01:38        INFO        Calibrater::        Initializing nominal selection to the whole MS.
30-Sep-2026 20:01:38 2026-10-01 00:01:38        INFO        calibrater::setdata        Beginning selectvis--(MSSelection version)-------
30-Sep-2026 20:01:38 2026-10-01 00:01:38        INFO        calibrater::reset        Reseting solve/apply state
30-Sep-2026 20:01:38 2026-10-01 00:01:38        INFO        Calibrater::selectvis        Performing selection on MeasurementSet
30-Sep-2026 20:01:38 2026-10-01 00:01:38        INFO        Calibrater::selectvis+         Selecting by observation IDs: '0'
30-Sep-2026 20:01:38 2026-10-01 00:01:38        INFO        Calibrater::selectvis        By selection 328860 rows are reduced to 318870
30-Sep-2026 20:01:38 2026-10-01 00:01:38        INFO        Calibrater::selectvis        Frequency selection: Selecting all channels in all spws.
30-Sep-2026 20:01:38 2026-10-01 00:01:38        INFO        calibrater::setdata        chanmode=none nchan=1 start=0 step=1 mStart='0km/s' mStep='0km/s' msSelect=''
30-Sep-2026 20:01:38 2026-10-01 00:01:38        INFO        calibrater::setapply        Beginning setapply--(MSSelection version)-------
30-Sep-2026 20:01:38 2026-10-01 00:01:38        INFO        Calibrater::setapply(type, applypar)        Arranging to APPLY:
30-Sep-2026 20:01:38 2026-10-01 00:01:38        INFO        Calibrater::setapply(type, applypar)        .   G Jones: table=gaincaltest2.ms.G0 select= interp=linear spwmap=[-1] calWt=false
30-Sep-2026 20:01:38 2026-10-01 00:01:38        INFO        calibrater::correct        Beginning correct---------------------------
30-Sep-2026 20:01:38 2026-10-01 00:01:38        INFO        Calibrater::correct2 (VI2/VB2)        The following calibration terms are arranged for apply:
30-Sep-2026 20:01:38 2026-10-01 00:01:38        INFO        Calibrater::correct2 (VI2/VB2)        .   G Jones: table=gaincaltest2.ms.G0 select= interp=linear spwmap=[-1] calWt=false
30-Sep-2026 20:01:38 2026-10-01 00:01:39        INFO        calibrater::correct        Finished correcting.
30-Sep-2026 20:01:39 2026-10-01 00:01:39        WARN        calibrater::setvi(bool,bool)        Already using NEW VisibilityIterator.
30-Sep-2026 20:01:39 test_tool_calibrater.py::calibrater_test::test_selectVisObs
30-Sep-2026 20:01:39 PASSED
30-Sep-2026 20:01:39
30-Sep-2026 20:01:39 2026-10-01 00:01:39        INFO        calibrater::open        ****Using NEW VI2-driven calibrater tool****
30-Sep-2026 20:01:39 2026-10-01 00:01:39        INFO        calibrater::open        Opening MS: gaincaltest2.ms for calibration.
30-Sep-2026 20:01:39 2026-10-01 00:01:39        INFO                Clearing all model records in MS header.
30-Sep-2026 20:01:39 2026-10-01 00:01:39        INFO        VisSetUtil::addScrCols        Adding MODEL_DATA and CORRECTED_DATA column(s).
30-Sep-2026 20:01:39 2026-10-01 00:01:40        INFO        VisSetUtil::initScrCols        Initializing MODEL_DATA to (unity).
30-Sep-2026 20:01:39 2026-10-01 00:01:40        INFO        VisSetUtil::initScrCols        Initialized 328860 rows.
30-Sep-2026 20:01:39 2026-10-01 00:01:40        INFO        Calibrater::        Initializing nominal selection to the whole MS.
30-Sep-2026 20:01:39 2026-10-01 00:01:40        INFO        calibrater::setdata        Beginning selectvis--(MSSelection version)-------
30-Sep-2026 20:01:39 2026-10-01 00:01:40        INFO        calibrater::reset        Reseting solve/apply state
30-Sep-2026 20:01:39 2026-10-01 00:01:40        INFO        Calibrater::selectvis        Performing selection on MeasurementSet
30-Sep-2026 20:01:39 2026-10-01 00:01:40        INFO        Calibrater::selectvis+         Selecting on scan: '2'
30-Sep-2026 20:01:39 2026-10-01 00:01:40        INFO        Calibrater::selectvis        By selection 328860 rows are reduced to 15660
30-Sep-2026 20:01:39 2026-10-01 00:01:40        INFO        Calibrater::selectvis        Frequency selection: Selecting all channels in all spws.
30-Sep-2026 20:01:39 2026-10-01 00:01:40        INFO        calibrater::setdata        chanmode=none nchan=1 start=0 step=1 mStart='0km/s' mStep='0km/s' msSelect=''
30-Sep-2026 20:01:39 2026-10-01 00:01:40        INFO        calibrater::setapply        Beginning setapply--(MSSelection version)-------
30-Sep-2026 20:01:39 2026-10-01 00:01:40        INFO        Calibrater::setapply(type, applypar)        Arranging to APPLY:
30-Sep-2026 20:01:39 2026-10-01 00:01:40        INFO        Calibrater::setapply(type, applypar)        .   G Jones: table=gaincaltest2.ms.G0 select= interp=linear spwmap=[-1] calWt=false
30-Sep-2026 20:01:39 2026-10-01 00:01:40        INFO        calibrater::correct        Beginning correct---------------------------
30-Sep-2026 20:01:39 2026-10-01 00:01:40        INFO        Calibrater::correct2 (VI2/VB2)        The following calibration terms are arranged for apply:
30-Sep-2026 20:01:39 2026-10-01 00:01:40        INFO        Calibrater::correct2 (VI2/VB2)        .   G Jones: table=gaincaltest2.ms.G0 select= interp=linear spwmap=[-1] calWt=false
30-Sep-2026 20:01:39 2026-10-01 00:01:40        INFO        calibrater::correct        Finished correcting.
30-Sep-2026 20:01:39 2026-10-01 00:01:40        WARN        calibrater::setvi(bool,bool)        Already using NEW VisibilityIterator.
30-Sep-2026 20:01:39 test_tool_calibrater.py::calibrater_test::test_selectVisScan
30-Sep-2026 20:01:39 Check tht the scan is properly selected by selectvis
30-Sep-2026 20:01:39 PASSED
30-Sep-2026 20:01:39
30-Sep-2026 20:01:39 2026-10-01 00:01:40        INFO        calibrater::open        ****Using NEW VI2-driven calibrater tool****
30-Sep-2026 20:01:39 2026-10-01 00:01:40        INFO        calibrater::open        Opening MS: gaincaltest2.ms for calibration.
30-Sep-2026 20:01:39 2026-10-01 00:01:40        INFO                Clearing all model records in MS header.
30-Sep-2026 20:01:39 2026-10-01 00:01:40        INFO        VisSetUtil::addScrCols        Adding MODEL_DATA and CORRECTED_DATA column(s).
30-Sep-2026 20:01:40 2026-10-01 00:01:40        INFO        VisSetUtil::initScrCols        Initializing MODEL_DATA to (unity).
30-Sep-2026 20:01:40 2026-10-01 00:01:40        INFO        VisSetUtil::initScrCols        Initialized 328860 rows.
30-Sep-2026 20:01:40 2026-10-01 00:01:40        INFO        Calibrater::        Initializing nominal selection to the whole MS.
30-Sep-2026 20:01:40 2026-10-01 00:01:40        INFO        calibrater::setdata        Beginning selectvis--(MSSelection version)-------
30-Sep-2026 20:01:40 2026-10-01 00:01:40        INFO        calibrater::reset        Reseting solve/apply state
30-Sep-2026 20:01:40 2026-10-01 00:01:40        INFO        Calibrater::selectvis        Performing selection on MeasurementSet
30-Sep-2026 20:01:40 2026-10-01 00:01:40        INFO        Calibrater::selectvis+         Selecting on spw: '0'
30-Sep-2026 20:01:40 2026-10-01 00:01:40        INFO        Calibrater::selectvis        By selection 328860 rows are reduced to 82215
30-Sep-2026 20:01:40 2026-10-01 00:01:40        INFO        Calibrater::selectvis        Frequency selection:
30-Sep-2026 20:01:40 2026-10-01 00:01:40        INFO        Calibrater::selectvis        .  Spw 0:0~7 (8 channels, step by 1)
30-Sep-2026 20:01:40 2026-10-01 00:01:40        INFO        calibrater::setdata        chanmode=none nchan=1 start=0 step=1 mStart='0km/s' mStep='0km/s' msSelect=''
30-Sep-2026 20:01:40 2026-10-01 00:01:40        INFO        calibrater::setapply        Beginning setapply--(MSSelection version)-------
30-Sep-2026 20:01:40 2026-10-01 00:01:40        INFO        Calibrater::setapply(type, applypar)        Arranging to APPLY:
30-Sep-2026 20:01:40 2026-10-01 00:01:41        INFO        Calibrater::setapply(type, applypar)        .   G Jones: table=gaincaltest2.ms.G0 select= interp=linear spwmap=[-1] calWt=false
30-Sep-2026 20:01:40 2026-10-01 00:01:41        INFO        calibrater::correct        Beginning correct---------------------------
30-Sep-2026 20:01:40 2026-10-01 00:01:41        INFO        Calibrater::correct2 (VI2/VB2)        The following calibration terms are arranged for apply:
30-Sep-2026 20:01:40 2026-10-01 00:01:41        INFO        Calibrater::correct2 (VI2/VB2)        .   G Jones: table=gaincaltest2.ms.G0 select= interp=linear spwmap=[-1] calWt=false
30-Sep-2026 20:01:40 2026-10-01 00:01:41        INFO        calibrater::correct        Finished correcting.
30-Sep-2026 20:01:40 2026-10-01 00:01:41        WARN        calibrater::setvi(bool,bool)        Already using NEW VisibilityIterator.
30-Sep-2026 20:01:40 test_tool_calibrater.py::calibrater_test::test_selectVisSpw
30-Sep-2026 20:01:40 Check that spw is properly selected by selectvis
30-Sep-2026 20:01:40 PASSED
30-Sep-2026 20:01:40
30-Sep-2026 20:01:41 2026-10-01 00:01:41        INFO        calibrater::open        ****Using NEW VI2-driven calibrater tool****
30-Sep-2026 20:01:41 2026-10-01 00:01:41        INFO        calibrater::open        Opening MS: gaincaltest2.ms for calibration.
30-Sep-2026 20:01:41 2026-10-01 00:01:41        INFO                Clearing all model records in MS header.
30-Sep-2026 20:01:41 2026-10-01 00:01:41        INFO        VisSetUtil::addScrCols        Adding MODEL_DATA and CORRECTED_DATA column(s).
30-Sep-2026 20:01:41 2026-10-01 00:01:41        INFO        VisSetUtil::initScrCols        Initializing MODEL_DATA to (unity).
30-Sep-2026 20:01:41 2026-10-01 00:01:42        INFO        VisSetUtil::initScrCols        Initialized 328860 rows.
30-Sep-2026 20:01:41 2026-10-01 00:01:42        INFO        Calibrater::        Initializing nominal selection to the whole MS.
30-Sep-2026 20:01:41 2026-10-01 00:01:42        INFO        calibrater::setdata        Beginning selectvis--(MSSelection version)-------
30-Sep-2026 20:01:41 2026-10-01 00:01:42        INFO        calibrater::reset        Reseting solve/apply state
30-Sep-2026 20:01:41 2026-10-01 00:01:42        INFO        Calibrater::selectvis        Performing selection on MeasurementSet
30-Sep-2026 20:01:41 2026-10-01 00:01:42        INFO        Calibrater::selectvis+         Selecting on time: '>04:38:23'
30-Sep-2026 20:01:41 2026-10-01 00:01:42        INFO        Calibrater::selectvis        By selection 328860 rows are reduced to 313200
30-Sep-2026 20:01:41 2026-10-01 00:01:42        INFO        Calibrater::selectvis        Frequency selection: Selecting all channels in all spws.
30-Sep-2026 20:01:41 2026-10-01 00:01:42        INFO        calibrater::setdata        chanmode=none nchan=1 start=0 step=1 mStart='0km/s' mStep='0km/s' msSelect=''
30-Sep-2026 20:01:41 2026-10-01 00:01:42        INFO        calibrater::setapply        Beginning setapply--(MSSelection version)-------
30-Sep-2026 20:01:41 2026-10-01 00:01:42        INFO        Calibrater::setapply(type, applypar)        Arranging to APPLY:
30-Sep-2026 20:01:41 2026-10-01 00:01:42        INFO        Calibrater::setapply(type, applypar)        .   G Jones: table=gaincaltest2.ms.G0 select= interp=linear spwmap=[-1] calWt=false
30-Sep-2026 20:01:41 2026-10-01 00:01:42        INFO        calibrater::correct        Beginning correct---------------------------
30-Sep-2026 20:01:41 2026-10-01 00:01:42        INFO        Calibrater::correct2 (VI2/VB2)        The following calibration terms are arranged for apply:
30-Sep-2026 20:01:41 2026-10-01 00:01:42        INFO        Calibrater::correct2 (VI2/VB2)        .   G Jones: table=gaincaltest2.ms.G0 select= interp=linear spwmap=[-1] calWt=false
30-Sep-2026 20:01:42 2026-10-01 00:01:42        INFO        calibrater::correct        Finished correcting.
30-Sep-2026 20:01:42 2026-10-01 00:01:42        WARN        calibrater::setvi(bool,bool)        Already using NEW VisibilityIterator.
30-Sep-2026 20:01:42 test_tool_calibrater.py::calibrater_test::test_selectVisTime
30-Sep-2026 20:01:42 Check that time is properly selected by selectvis
30-Sep-2026 20:01:42 PASSED
30-Sep-2026 20:01:42
30-Sep-2026 20:01:42 2026-10-01 00:01:43        INFO        calibrater::open        ****Using NEW VI2-driven calibrater tool****
30-Sep-2026 20:01:42 2026-10-01 00:01:43        INFO        calibrater::open        Opening MS: gaincaltest2.ms for calibration.
30-Sep-2026 20:01:42 2026-10-01 00:01:43        INFO                Clearing all model records in MS header.
30-Sep-2026 20:01:42 2026-10-01 00:01:43        INFO        VisSetUtil::addScrCols        Adding MODEL_DATA and CORRECTED_DATA column(s).
30-Sep-2026 20:01:42 2026-10-01 00:01:43        INFO        VisSetUtil::initScrCols        Initializing MODEL_DATA to (unity).
30-Sep-2026 20:01:42 2026-10-01 00:01:43        INFO        VisSetUtil::initScrCols        Initialized 328860 rows.
30-Sep-2026 20:01:42 2026-10-01 00:01:43        INFO        Calibrater::        Initializing nominal selection to the whole MS.
30-Sep-2026 20:01:42 2026-10-01 00:01:43        INFO        calibrater::setdata        Beginning selectvis--(MSSelection version)-------
30-Sep-2026 20:01:42 2026-10-01 00:01:43        INFO        calibrater::reset        Reseting solve/apply state
30-Sep-2026 20:01:42 2026-10-01 00:01:43        INFO        Calibrater::selectvis        Performing selection on MeasurementSet
30-Sep-2026 20:01:42 2026-10-01 00:01:43        INFO        Calibrater::selectvis+         Selecting on uvrange: '> 500000lambda'
30-Sep-2026 20:01:43 2026-10-01 00:01:43        INFO        Calibrater::selectvis        By selection 328860 rows are reduced to 103321
30-Sep-2026 20:01:43 2026-10-01 00:01:43        INFO        Calibrater::selectvis        Frequency selection: Selecting all channels in all spws.
30-Sep-2026 20:01:43 2026-10-01 00:01:43        INFO        calibrater::setdata        chanmode=none nchan=1 start=0 step=1 mStart='0km/s' mStep='0km/s' msSelect=''
30-Sep-2026 20:01:43 2026-10-01 00:01:43        INFO        calibrater::setapply        Beginning setapply--(MSSelection version)-------
30-Sep-2026 20:01:43 2026-10-01 00:01:43        INFO        Calibrater::setapply(type, applypar)        Arranging to APPLY:
30-Sep-2026 20:01:43 2026-10-01 00:01:43        INFO        Calibrater::setapply(type, applypar)        .   G Jones: table=gaincaltest2.ms.G0 select= interp=linear spwmap=[-1] calWt=false
30-Sep-2026 20:01:43 2026-10-01 00:01:43        INFO        calibrater::correct        Beginning correct---------------------------
30-Sep-2026 20:01:43 2026-10-01 00:01:43        INFO        Calibrater::correct2 (VI2/VB2)        The following calibration terms are arranged for apply:
30-Sep-2026 20:01:43 2026-10-01 00:01:43        INFO        Calibrater::correct2 (VI2/VB2)        .   G Jones: table=gaincaltest2.ms.G0 select= interp=linear spwmap=[-1] calWt=false
30-Sep-2026 20:01:43 2026-10-01 00:01:44        INFO        calibrater::correct        Finished correcting.
30-Sep-2026 20:01:43 2026-10-01 00:01:44        WARN        calibrater::setvi(bool,bool)        Already using NEW VisibilityIterator.
30-Sep-2026 20:01:43 test_tool_calibrater.py::calibrater_test::test_selectVisUVrange
30-Sep-2026 20:01:43 Check that selectvis properly selects for uvrange
30-Sep-2026 20:01:43 PASSED
30-Sep-2026 20:01:43
30-Sep-2026 20:01:43 2026-10-01 00:01:44        INFO        calibrater::open        ****Using NEW VI2-driven calibrater tool****
30-Sep-2026 20:01:43 2026-10-01 00:01:44        INFO        calibrater::open        Opening MS: gaincaltest2.ms for calibration.
30-Sep-2026 20:01:43 2026-10-01 00:01:44        INFO                Clearing all model records in MS header.
30-Sep-2026 20:01:43 2026-10-01 00:01:44        INFO        VisSetUtil::addScrCols        Adding MODEL_DATA and CORRECTED_DATA column(s).
30-Sep-2026 20:01:44 2026-10-01 00:01:44        INFO        VisSetUtil::initScrCols        Initializing MODEL_DATA to (unity).
30-Sep-2026 20:01:44 2026-10-01 00:01:44        INFO        VisSetUtil::initScrCols        Initialized 328860 rows.
30-Sep-2026 20:01:44 2026-10-01 00:01:44        INFO        Calibrater::        Initializing nominal selection to the whole MS.
30-Sep-2026 20:01:44 2026-10-01 00:01:44        INFO        calibrater::parsecallibfile        Beginning parsecallibfile-)-------
30-Sep-2026 20:01:44 2026-10-01 00:01:44        INFO        calibrater::setcallib        Beginning setcallib---------
30-Sep-2026 20:01:44 2026-10-01 00:01:44        INFO        Calibrater::setcallib2(callib)        Arranging to APPLY:
30-Sep-2026 20:01:44 2026-10-01 00:01:44        INFO                .   G Jones: table=gaincaltest2.ms.G0 (by cal library) calWt=true
30-Sep-2026 20:01:44 2026-10-01 00:01:44        INFO                .   0:
30-Sep-2026 20:01:44 2026-10-01 00:01:44        INFO        +             MS: obs= scan= fld= intent= spw=
30-Sep-2026 20:01:44 2026-10-01 00:01:44        INFO        +             CT: tinterp=linear finterp=
30-Sep-2026 20:01:44 2026-10-01 00:01:44        INFO        +                 obsmap=[]         scanmap=[]         fldmap=[]
30-Sep-2026 20:01:44 2026-10-01 00:01:44        INFO        +                 spwmap=[]         antmap=[]
30-Sep-2026 20:01:44 2026-10-01 00:01:44        INFO        calibrater::corrupt        Beginning corrupt---------------------------
30-Sep-2026 20:01:44 2026-10-01 00:01:44        INFO        Calibrater::corrupt2 (VI2/VB2)        The following calibration terms are arranged for apply:
30-Sep-2026 20:01:44 2026-10-01 00:01:44        INFO        Calibrater::corrupt2 (VI2/VB2)        .   G Jones: table=gaincaltest2.ms.G0 (by cal library) calWt=true
30-Sep-2026 20:01:44 2026-10-01 00:01:45        INFO        calibrater::corrupt        Finished corrupting.
30-Sep-2026 20:01:45 2026-10-01 00:01:45        WARN        calibrater::setvi(bool,bool)        Already using NEW VisibilityIterator.
30-Sep-2026 20:01:45 test_tool_calibrater.py::calibrater_test::test_setCalLib
30-Sep-2026 20:01:45 Check that a provided cal table can be used to corrupt the MODEL_DATA 
30-Sep-2026 20:01:45 PASSED
30-Sep-2026 20:01:45
30-Sep-2026 20:01:45 2026-10-01 00:01:45        INFO        calibrater::open        ****Using NEW VI2-driven calibrater tool****
30-Sep-2026 20:01:45 2026-10-01 00:01:45        INFO        calibrater::open        Opening MS: gaincaltest2.ms for calibration.
30-Sep-2026 20:01:45 2026-10-01 00:01:45        INFO                Clearing all model records in MS header.
30-Sep-2026 20:01:45 2026-10-01 00:01:45        INFO        VisSetUtil::addScrCols        Adding MODEL_DATA and CORRECTED_DATA column(s).
30-Sep-2026 20:01:45 2026-10-01 00:01:46        INFO        VisSetUtil::initScrCols        Initializing MODEL_DATA to (unity).
30-Sep-2026 20:01:45 2026-10-01 00:01:46        INFO        VisSetUtil::initScrCols        Initialized 328860 rows.
30-Sep-2026 20:01:45 2026-10-01 00:01:46        INFO        Calibrater::        Initializing nominal selection to the whole MS.
30-Sep-2026 20:01:45 2026-10-01 00:01:46        INFO        Calibrater::setCorrDepFlags        Setting correlation dependent flags = True
30-Sep-2026 20:01:45 2026-10-01 00:01:46        WARN        calibrater::setvi(bool,bool)        Already using NEW VisibilityIterator.
30-Sep-2026 20:01:45 test_tool_calibrater.py::calibrater_test::test_setCorrDepFlags
30-Sep-2026 20:01:45 Check that corrdepflags will be checked 
30-Sep-2026 20:01:45 PASSED
30-Sep-2026 20:01:45
30-Sep-2026 20:01:45 2026-10-01 00:01:46        INFO        calibrater::open        ****Using NEW VI2-driven calibrater tool****
30-Sep-2026 20:01:45 2026-10-01 00:01:46        INFO        calibrater::open        Opening MS: ngc5921.ms for calibration.
30-Sep-2026 20:01:45 2026-10-01 00:01:46        INFO                Clearing all model records in MS header.
30-Sep-2026 20:01:45 2026-10-01 00:01:46        INFO        VisSetUtil::addScrCols        Adding MODEL_DATA and CORRECTED_DATA column(s).
30-Sep-2026 20:01:45 2026-10-01 00:01:46        INFO        VisSetUtil::initScrCols        Initializing MODEL_DATA to (unity).
30-Sep-2026 20:01:45 2026-10-01 00:01:46        INFO        VisSetUtil::initScrCols        Initialized 22653 rows.
30-Sep-2026 20:01:45 2026-10-01 00:01:46        INFO        Calibrater::        Initializing nominal selection to the whole MS.
30-Sep-2026 20:01:45 2026-10-01 00:01:46        INFO        calibrater::smooth        Beginning smooth--(MSSelection version)-------
30-Sep-2026 20:01:45 2026-10-01 00:01:46        INFO        Calibrater::smooth        Beginning smoothing/interpolating method.
30-Sep-2026 20:01:45 2026-10-01 00:01:46        WARN                Found pre-v4.1 caltable (/Users/casaci/bamboohome/xml-data/build-dir/CASASPECS-DEVTESTPY312147-TTOARM15P312/casa6/casatestutils/nosedir/test_tool_calibrater/ngc5921.gcal); attempting to update...
30-Sep-2026 20:01:45 2026-10-01 00:01:46        WARN        +        SUCCEEDED: trivial OBSERVATION/OBSERVATION_ID have been added.
30-Sep-2026 20:01:45 2026-10-01 00:01:46        INFO        Calibrater::smooth        Storing result in testcalout.cal
30-Sep-2026 20:01:45 2026-10-01 00:01:46        INFO                Writing solutions to table: testcalout.cal
30-Sep-2026 20:01:45 2026-10-01 00:01:46        WARN        calibrater::setvi(bool,bool)        Already using NEW VisibilityIterator.
30-Sep-2026 20:01:45 test_tool_calibrater.py::calibrater_test::test_smoothedCalTables
30-Sep-2026 20:01:45 Check that the smooth command creates a smoothed cal table 
30-Sep-2026 20:01:45 PASSED
30-Sep-2026 20:01:45
30-Sep-2026 20:01:45 2026-10-01 00:01:46        WARN        calibrater::setvi(bool,bool)        Forcing use of OLD VisibilityIterator.
30-Sep-2026 20:01:45 2026-10-01 00:01:46        INFO        calibrater::open        ****Using OLD VI-driven calibrater tool****
30-Sep-2026 20:01:45 2026-10-01 00:01:46        INFO        calibrater::open        Opening MS: ngc5921.ms for calibration.
30-Sep-2026 20:01:45 2026-10-01 00:01:46        INFO                Clearing all model records in MS header.
30-Sep-2026 20:01:45 2026-10-01 00:01:46        INFO        VisSetUtil::addScrCols        Adding MODEL_DATA and CORRECTED_DATA column(s).
30-Sep-2026 20:01:45 2026-10-01 00:01:46        INFO        VisSetUtil::initScrCols        Initializing MODEL_DATA to (unity).
30-Sep-2026 20:01:45 2026-10-01 00:01:46        INFO        VisSetUtil::initScrCols        Initialized 22653 rows.
30-Sep-2026 20:01:45 2026-10-01 00:01:46        INFO        Calibrater::        Initializing nominal selection to the whole MS.
30-Sep-2026 20:01:46 2026-10-01 00:01:46        INFO        calibrater::setsolvebandpoly        Beginning setsolvebandpoly--(MSSelection version)-------
30-Sep-2026 20:01:46 2026-10-01 00:01:46        INFO        Calibrater::setsolvebandpoly        Arranging to SOLVE:
30-Sep-2026 20:01:46 2026-10-01 00:01:46        INFO        Calibrater::setsolvebandpoly        .   BPOLY: table=bpoly append=false solint=inf,none refantmode='flex' refant='none' minsnr=0 apmode= solnorm=true normtype=MEAN
30-Sep-2026 20:01:46 2026-10-01 00:01:46        INFO        calibrater::solve        Beginning solve-----------------------------
30-Sep-2026 20:01:46 2026-10-01 00:01:46        INFO        Calibrater::solve        The following calibration terms are arranged for apply:
30-Sep-2026 20:01:46 2026-10-01 00:01:46        INFO        Calibrater::solve        .   (None)
30-Sep-2026 20:01:46 2026-10-01 00:01:46        INFO        Calibrater::solve        The following calibration term is arranged for solve:
30-Sep-2026 20:01:46 2026-10-01 00:01:46        INFO        Calibrater::solve        .   BPOLY: table=bpoly append=false solint=inf,none refantmode='flex' refant='none' minsnr=0 apmode= solnorm=true normtype=MEAN
30-Sep-2026 20:01:46 2026-10-01 00:01:46        INFO        Calibrater::solve        Solving for BPOLY
30-Sep-2026 20:01:46 2026-10-01 00:01:46        INFO                For solint = inf, found 7 solution intervals.
30-Sep-2026 20:01:46 2026-10-01 00:01:46        INFO        BJonesPoly::selfSolveOne()         THIS IS THE NEW MULTI-SPW-FLEXIBLE VERSION
30-Sep-2026 20:01:46 2026-10-01 00:01:46        INFO        BJonesPoly::selfSolveOne()         Fitting bandpass amplitude and phase polynomials.
30-Sep-2026 20:01:46 2026-10-01 00:01:46        INFO        BJonesPoly::selfSolveOne()         Polynomial degree for amplitude is 5
30-Sep-2026 20:01:46 2026-10-01 00:01:46        INFO        BJonesPoly::selfSolveOne()         Polynomial degree for phase is 7
30-Sep-2026 20:01:46 2026-10-01 00:01:46        INFO        BJonesPoly::selfSolveOne()         Spectral grid for fit will have 63 points spaced by 24.4141 kHz.
30-Sep-2026 20:01:46 2026-10-01 00:01:46        INFO        BJonesPoly::selfSolveOne()         Polynomial solution will be valid over frequency range: 1.41267e+09-1.41418e+09 Hz.
30-Sep-2026 20:01:46 2026-10-01 00:01:46        INFO        BJonesPoly::selfSolveOne()         Total bandwidth: 1538.09 kHz.
30-Sep-2026 20:01:46 2026-10-01 00:01:46        INFO        BJonesPoly::selfSolveOne()         Found data for 351 baselines among 27 antennas.
30-Sep-2026 20:01:46 2026-10-01 00:01:46        INFO        BJonesPoly::selfSolveOne()         Fitting amplitude polynomial.
30-Sep-2026 20:01:46 2026-10-01 00:01:46        INFO        BJonesPoly::selfSolveOne()         Per-baseline RMS log(Amp) statistics: (min/mean/max) = 0.059507/0.0681762/0.0765806
30-Sep-2026 20:01:46 2026-10-01 00:01:46        INFO        BJonesPoly::selfSolveOne()         Fitting phase polynomial.
30-Sep-2026 20:01:46 2026-10-01 00:01:46        INFO        BJonesPoly::selfSolveOne()         Per baseline RMS phase (deg) statistics: (min/mean/max) = 0.33653/0.750193/1.6779
30-Sep-2026 20:01:46 2026-10-01 00:01:46        INFO        BJonesPoly::selfSolveOne()         Fitting amplitude polynomial.
30-Sep-2026 20:01:46 2026-10-01 00:01:46        INFO        BJonesPoly::selfSolveOne()         Per-baseline RMS log(Amp) statistics: (min/mean/max) = 0.0630839/0.0689061/0.0756384
30-Sep-2026 20:01:46 2026-10-01 00:01:46        INFO        BJonesPoly::selfSolveOne()         Fitting phase polynomial.
30-Sep-2026 20:01:46 2026-10-01 00:01:46        INFO        BJonesPoly::selfSolveOne()         Per baseline RMS phase (deg) statistics: (min/mean/max) = 0.279482/0.74979/1.59355
30-Sep-2026 20:01:46 2026-10-01 00:01:46        INFO        BJonesPoly::selfSolveOne()         Normalizing antenna-based solutions.
30-Sep-2026 20:01:46 2026-10-01 00:01:46        INFO        BJonesPoly::updateCalTable()         Storing calibration in table bpoly
30-Sep-2026 20:01:46 2026-10-01 00:01:46        INFO        BJonesPoly::selfSolveOne()         THIS IS THE NEW MULTI-SPW-FLEXIBLE VERSION
30-Sep-2026 20:01:46 2026-10-01 00:01:46        INFO        BJonesPoly::selfSolveOne()         Fitting bandpass amplitude and phase polynomials.
30-Sep-2026 20:01:46 2026-10-01 00:01:46        INFO        BJonesPoly::selfSolveOne()         Polynomial degree for amplitude is 5
30-Sep-2026 20:01:46 2026-10-01 00:01:46        INFO        BJonesPoly::selfSolveOne()         Polynomial degree for phase is 7
30-Sep-2026 20:01:46 2026-10-01 00:01:46        INFO        BJonesPoly::selfSolveOne()         Spectral grid for fit will have 63 points spaced by 24.4141 kHz.
30-Sep-2026 20:01:46 2026-10-01 00:01:46        INFO        BJonesPoly::selfSolveOne()         Polynomial solution will be valid over frequency range: 1.41267e+09-1.41418e+09 Hz.
30-Sep-2026 20:01:46 2026-10-01 00:01:46        INFO        BJonesPoly::selfSolveOne()         Total bandwidth: 1538.09 kHz.
30-Sep-2026 20:01:46 2026-10-01 00:01:46        INFO        BJonesPoly::selfSolveOne()         Found data for 351 baselines among 27 antennas.
30-Sep-2026 20:01:46 2026-10-01 00:01:46        INFO        BJonesPoly::selfSolveOne()         Fitting amplitude polynomial.
30-Sep-2026 20:01:46 2026-10-01 00:01:46        INFO        BJonesPoly::selfSolveOne()         Per-baseline RMS log(Amp) statistics: (min/mean/max) = 0.0672607/0.089081/0.111106
30-Sep-2026 20:01:46 2026-10-01 00:01:46        INFO        BJonesPoly::selfSolveOne()         Fitting phase polynomial.
30-Sep-2026 20:01:46 2026-10-01 00:01:46        INFO        BJonesPoly::selfSolveOne()         Per baseline RMS phase (deg) statistics: (min/mean/max) = 2.31075/3.32219/4.29305
30-Sep-2026 20:01:46 2026-10-01 00:01:46        INFO        BJonesPoly::selfSolveOne()         Fitting amplitude polynomial.
30-Sep-2026 20:01:46 2026-10-01 00:01:46        INFO        BJonesPoly::selfSolveOne()         Per-baseline RMS log(Amp) statistics: (min/mean/max) = 0.0652822/0.0889198/0.116912
30-Sep-2026 20:01:46 2026-10-01 00:01:46        INFO        BJonesPoly::selfSolveOne()         Fitting phase polynomial.
30-Sep-2026 20:01:46 2026-10-01 00:01:46        INFO        BJonesPoly::selfSolveOne()         Per baseline RMS phase (deg) statistics: (min/mean/max) = 2.44269/3.26616/4.3519
30-Sep-2026 20:01:46 2026-10-01 00:01:46        INFO        BJonesPoly::selfSolveOne()         Normalizing antenna-based solutions.
30-Sep-2026 20:01:46 2026-10-01 00:01:46        INFO        BJonesPoly::updateCalTable()         Storing calibration in table bpoly
30-Sep-2026 20:01:46 2026-10-01 00:01:46        INFO        BJonesPoly::selfSolveOne()         THIS IS THE NEW MULTI-SPW-FLEXIBLE VERSION
30-Sep-2026 20:01:46 2026-10-01 00:01:46        INFO        BJonesPoly::selfSolveOne()         Fitting bandpass amplitude and phase polynomials.
30-Sep-2026 20:01:46 2026-10-01 00:01:46        INFO        BJonesPoly::selfSolveOne()         Polynomial degree for amplitude is 5
30-Sep-2026 20:01:46 2026-10-01 00:01:46        INFO        BJonesPoly::selfSolveOne()         Polynomial degree for phase is 7
30-Sep-2026 20:01:46 2026-10-01 00:01:46        INFO        BJonesPoly::selfSolveOne()         Spectral grid for fit will have 63 points spaced by 24.4141 kHz.
30-Sep-2026 20:01:46 2026-10-01 00:01:46        INFO        BJonesPoly::selfSolveOne()         Polynomial solution will be valid over frequency range: 1.41267e+09-1.41418e+09 Hz.
30-Sep-2026 20:01:46 2026-10-01 00:01:46        INFO        BJonesPoly::selfSolveOne()         Total bandwidth: 1538.09 kHz.
30-Sep-2026 20:01:46 2026-10-01 00:01:46        INFO        BJonesPoly::selfSolveOne()         Found data for 351 baselines among 27 antennas.
30-Sep-2026 20:01:46 2026-10-01 00:01:46        INFO        BJonesPoly::selfSolveOne()         Fitting amplitude polynomial.
30-Sep-2026 20:01:46 2026-10-01 00:01:46        INFO        BJonesPoly::selfSolveOne()         Per-baseline RMS log(Amp) statistics: (min/mean/max) = 0.350681/0.587724/0.894558
30-Sep-2026 20:01:46 2026-10-01 00:01:46        INFO        BJonesPoly::selfSolveOne()         Fitting phase polynomial.
30-Sep-2026 20:01:46 2026-10-01 00:01:47        INFO        BJonesPoly::selfSolveOne()         Per baseline RMS phase (deg) statistics: (min/mean/max) = 21.296/59.0077/111.454
30-Sep-2026 20:01:46 2026-10-01 00:01:47        INFO        BJonesPoly::selfSolveOne()         Fitting amplitude polynomial.
30-Sep-2026 20:01:46 2026-10-01 00:01:47        INFO        BJonesPoly::selfSolveOne()         Per-baseline RMS log(Amp) statistics: (min/mean/max) = 0.354236/0.581733/0.988903
30-Sep-2026 20:01:46 2026-10-01 00:01:47        INFO        BJonesPoly::selfSolveOne()         Fitting phase polynomial.
30-Sep-2026 20:01:47 2026-10-01 00:01:47        INFO        BJonesPoly::selfSolveOne()         Per baseline RMS phase (deg) statistics: (min/mean/max) = 17.2419/56.3249/117.264
30-Sep-2026 20:01:47 2026-10-01 00:01:47        INFO        BJonesPoly::selfSolveOne()         Normalizing antenna-based solutions.
30-Sep-2026 20:01:47 2026-10-01 00:01:47        INFO        BJonesPoly::updateCalTable()         Storing calibration in table bpoly
30-Sep-2026 20:01:47 2026-10-01 00:01:47        INFO        BJonesPoly::selfSolveOne()         THIS IS THE NEW MULTI-SPW-FLEXIBLE VERSION
30-Sep-2026 20:01:47 2026-10-01 00:01:47        INFO        BJonesPoly::selfSolveOne()         Fitting bandpass amplitude and phase polynomials.
30-Sep-2026 20:01:47 2026-10-01 00:01:47        INFO        BJonesPoly::selfSolveOne()         Polynomial degree for amplitude is 5
30-Sep-2026 20:01:47 2026-10-01 00:01:47        INFO        BJonesPoly::selfSolveOne()         Polynomial degree for phase is 7
30-Sep-2026 20:01:47 2026-10-01 00:01:47        INFO        BJonesPoly::selfSolveOne()         Spectral grid for fit will have 63 points spaced by 24.4141 kHz.
30-Sep-2026 20:01:47 2026-10-01 00:01:47        INFO        BJonesPoly::selfSolveOne()         Polynomial solution will be valid over frequency range: 1.41267e+09-1.41418e+09 Hz.
30-Sep-2026 20:01:47 2026-10-01 00:01:47        INFO        BJonesPoly::selfSolveOne()         Total bandwidth: 1538.09 kHz.
30-Sep-2026 20:01:47 2026-10-01 00:01:47        INFO        BJonesPoly::selfSolveOne()         Found data for 351 baselines among 27 antennas.
30-Sep-2026 20:01:47 2026-10-01 00:01:47        INFO        BJonesPoly::selfSolveOne()         Fitting amplitude polynomial.
30-Sep-2026 20:01:47 2026-10-01 00:01:47        INFO        BJonesPoly::selfSolveOne()         Per-baseline RMS log(Amp) statistics: (min/mean/max) = 0.0850169/0.113968/0.15276
30-Sep-2026 20:01:47 2026-10-01 00:01:47        INFO        BJonesPoly::selfSolveOne()         Fitting phase polynomial.
30-Sep-2026 20:01:47 2026-10-01 00:01:47        INFO        BJonesPoly::selfSolveOne()         Per baseline RMS phase (deg) statistics: (min/mean/max) = 3.67561/5.33243/8.17296
30-Sep-2026 20:01:47 2026-10-01 00:01:47        INFO        BJonesPoly::selfSolveOne()         Fitting amplitude polynomial.
30-Sep-2026 20:01:47 2026-10-01 00:01:47        INFO        BJonesPoly::selfSolveOne()         Per-baseline RMS log(Amp) statistics: (min/mean/max) = 0.0784237/0.114345/0.159908
30-Sep-2026 20:01:47 2026-10-01 00:01:47        INFO        BJonesPoly::selfSolveOne()         Fitting phase polynomial.
30-Sep-2026 20:01:47 2026-10-01 00:01:48        INFO        BJonesPoly::selfSolveOne()         Per baseline RMS phase (deg) statistics: (min/mean/max) = 3.46392/5.27232/7.20673
30-Sep-2026 20:01:47 2026-10-01 00:01:48        INFO        BJonesPoly::selfSolveOne()         Normalizing antenna-based solutions.
30-Sep-2026 20:01:47 2026-10-01 00:01:48        INFO        BJonesPoly::updateCalTable()         Storing calibration in table bpoly
30-Sep-2026 20:01:47 2026-10-01 00:01:48        INFO        BJonesPoly::selfSolveOne()         THIS IS THE NEW MULTI-SPW-FLEXIBLE VERSION
30-Sep-2026 20:01:47 2026-10-01 00:01:48        INFO        BJonesPoly::selfSolveOne()         Fitting bandpass amplitude and phase polynomials.
30-Sep-2026 20:01:47 2026-10-01 00:01:48        INFO        BJonesPoly::selfSolveOne()         Polynomial degree for amplitude is 5
30-Sep-2026 20:01:47 2026-10-01 00:01:48        INFO        BJonesPoly::selfSolveOne()         Polynomial degree for phase is 7
30-Sep-2026 20:01:47 2026-10-01 00:01:48        INFO        BJonesPoly::selfSolveOne()         Spectral grid for fit will have 63 points spaced by 24.4141 kHz.
30-Sep-2026 20:01:47 2026-10-01 00:01:48        INFO        BJonesPoly::selfSolveOne()         Polynomial solution will be valid over frequency range: 1.41267e+09-1.41418e+09 Hz.
30-Sep-2026 20:01:47 2026-10-01 00:01:48        INFO        BJonesPoly::selfSolveOne()         Total bandwidth: 1538.09 kHz.
30-Sep-2026 20:01:47 2026-10-01 00:01:48        INFO        BJonesPoly::selfSolveOne()         Found data for 351 baselines among 27 antennas.
30-Sep-2026 20:01:47 2026-10-01 00:01:48        INFO        BJonesPoly::selfSolveOne()         Fitting amplitude polynomial.
30-Sep-2026 20:01:47 2026-10-01 00:01:48        INFO        BJonesPoly::selfSolveOne()         Per-baseline RMS log(Amp) statistics: (min/mean/max) = 0.0703936/0.102501/0.131676
30-Sep-2026 20:01:47 2026-10-01 00:01:48        INFO        BJonesPoly::selfSolveOne()         Fitting phase polynomial.
30-Sep-2026 20:01:47 2026-10-01 00:01:48        INFO        BJonesPoly::selfSolveOne()         Per baseline RMS phase (deg) statistics: (min/mean/max) = 2.98728/4.47977/5.84264
30-Sep-2026 20:01:47 2026-10-01 00:01:48        INFO        BJonesPoly::selfSolveOne()         Fitting amplitude polynomial.
30-Sep-2026 20:01:47 2026-10-01 00:01:48        INFO        BJonesPoly::selfSolveOne()         Per-baseline RMS log(Amp) statistics: (min/mean/max) = 0.0751114/0.102994/0.138529
30-Sep-2026 20:01:47 2026-10-01 00:01:48        INFO        BJonesPoly::selfSolveOne()         Fitting phase polynomial.
30-Sep-2026 20:01:47 2026-10-01 00:01:48        INFO        BJonesPoly::selfSolveOne()         Per baseline RMS phase (deg) statistics: (min/mean/max) = 3.18629/4.47068/5.89411
30-Sep-2026 20:01:47 2026-10-01 00:01:48        INFO        BJonesPoly::selfSolveOne()         Normalizing antenna-based solutions.
30-Sep-2026 20:01:47 2026-10-01 00:01:48        INFO        BJonesPoly::updateCalTable()         Storing calibration in table bpoly
30-Sep-2026 20:01:47 2026-10-01 00:01:48        INFO        BJonesPoly::selfSolveOne()         THIS IS THE NEW MULTI-SPW-FLEXIBLE VERSION
30-Sep-2026 20:01:47 2026-10-01 00:01:48        INFO        BJonesPoly::selfSolveOne()         Fitting bandpass amplitude and phase polynomials.
30-Sep-2026 20:01:47 2026-10-01 00:01:48        INFO        BJonesPoly::selfSolveOne()         Polynomial degree for amplitude is 5
30-Sep-2026 20:01:47 2026-10-01 00:01:48        INFO        BJonesPoly::selfSolveOne()         Polynomial degree for phase is 7
30-Sep-2026 20:01:47 2026-10-01 00:01:48        INFO        BJonesPoly::selfSolveOne()         Spectral grid for fit will have 63 points spaced by 24.4141 kHz.
30-Sep-2026 20:01:47 2026-10-01 00:01:48        INFO        BJonesPoly::selfSolveOne()         Polynomial solution will be valid over frequency range: 1.41267e+09-1.41418e+09 Hz.
30-Sep-2026 20:01:47 2026-10-01 00:01:48        INFO        BJonesPoly::selfSolveOne()         Total bandwidth: 1538.09 kHz.
30-Sep-2026 20:01:47 2026-10-01 00:01:48        INFO        BJonesPoly::selfSolveOne()         Found data for 351 baselines among 27 antennas.
30-Sep-2026 20:01:47 2026-10-01 00:01:48        INFO        BJonesPoly::selfSolveOne()         Fitting amplitude polynomial.
30-Sep-2026 20:01:47 2026-10-01 00:01:48        INFO        BJonesPoly::selfSolveOne()         Per-baseline RMS log(Amp) statistics: (min/mean/max) = 0.350626/0.604424/0.974388
30-Sep-2026 20:01:47 2026-10-01 00:01:48        INFO        BJonesPoly::selfSolveOne()         Fitting phase polynomial.
30-Sep-2026 20:01:48 2026-10-01 00:01:48        INFO        BJonesPoly::selfSolveOne()         Per baseline RMS phase (deg) statistics: (min/mean/max) = 21.2542/59.3511/120.719
30-Sep-2026 20:01:48 2026-10-01 00:01:48        INFO        BJonesPoly::selfSolveOne()         Fitting amplitude polynomial.
30-Sep-2026 20:01:48 2026-10-01 00:01:48        INFO        BJonesPoly::selfSolveOne()         Per-baseline RMS log(Amp) statistics: (min/mean/max) = 0.382806/0.598119/0.941571
30-Sep-2026 20:01:48 2026-10-01 00:01:48        INFO        BJonesPoly::selfSolveOne()         Fitting phase polynomial.
30-Sep-2026 20:01:48 2026-10-01 00:01:49        INFO        BJonesPoly::selfSolveOne()         Per baseline RMS phase (deg) statistics: (min/mean/max) = 20.0637/57.2112/118.101
30-Sep-2026 20:01:48 2026-10-01 00:01:49        INFO        BJonesPoly::selfSolveOne()         Normalizing antenna-based solutions.
30-Sep-2026 20:01:48 2026-10-01 00:01:49        INFO        BJonesPoly::updateCalTable()         Storing calibration in table bpoly
30-Sep-2026 20:01:48 2026-10-01 00:01:49        INFO        BJonesPoly::selfSolveOne()         THIS IS THE NEW MULTI-SPW-FLEXIBLE VERSION
30-Sep-2026 20:01:48 2026-10-01 00:01:49        INFO        BJonesPoly::selfSolveOne()         Fitting bandpass amplitude and phase polynomials.
30-Sep-2026 20:01:48 2026-10-01 00:01:49        INFO        BJonesPoly::selfSolveOne()         Polynomial degree for amplitude is 5
30-Sep-2026 20:01:48 2026-10-01 00:01:49        INFO        BJonesPoly::selfSolveOne()         Polynomial degree for phase is 7
30-Sep-2026 20:01:48 2026-10-01 00:01:49        INFO        BJonesPoly::selfSolveOne()         Spectral grid for fit will have 63 points spaced by 24.4141 kHz.
30-Sep-2026 20:01:48 2026-10-01 00:01:49        INFO        BJonesPoly::selfSolveOne()         Polynomial solution will be valid over frequency range: 1.41267e+09-1.41418e+09 Hz.
30-Sep-2026 20:01:48 2026-10-01 00:01:49        INFO        BJonesPoly::selfSolveOne()         Total bandwidth: 1538.09 kHz.
30-Sep-2026 20:01:48 2026-10-01 00:01:49        INFO        BJonesPoly::selfSolveOne()         Found data for 351 baselines among 27 antennas.
30-Sep-2026 20:01:48 2026-10-01 00:01:49        INFO        BJonesPoly::selfSolveOne()         Fitting amplitude polynomial.
30-Sep-2026 20:01:48 2026-10-01 00:01:49        INFO        BJonesPoly::selfSolveOne()         Per-baseline RMS log(Amp) statistics: (min/mean/max) = 0.0750931/0.0978998/0.125897
30-Sep-2026 20:01:48 2026-10-01 00:01:49        INFO        BJonesPoly::selfSolveOne()         Fitting phase polynomial.
30-Sep-2026 20:01:48 2026-10-01 00:01:49        INFO        BJonesPoly::selfSolveOne()         Per baseline RMS phase (deg) statistics: (min/mean/max) = 2.72933/3.98787/5.33715
30-Sep-2026 20:01:48 2026-10-01 00:01:49        INFO        BJonesPoly::selfSolveOne()         Fitting amplitude polynomial.
30-Sep-2026 20:01:48 2026-10-01 00:01:49        INFO        BJonesPoly::selfSolveOne()         Per-baseline RMS log(Amp) statistics: (min/mean/max) = 0.0658572/0.0972125/0.140794
30-Sep-2026 20:01:48 2026-10-01 00:01:49        INFO        BJonesPoly::selfSolveOne()         Fitting phase polynomial.
30-Sep-2026 20:01:48 2026-10-01 00:01:49        INFO        BJonesPoly::selfSolveOne()         Per baseline RMS phase (deg) statistics: (min/mean/max) = 2.97943/3.97841/5.72903
30-Sep-2026 20:01:48 2026-10-01 00:01:49        INFO        BJonesPoly::selfSolveOne()         Normalizing antenna-based solutions.
30-Sep-2026 20:01:48 2026-10-01 00:01:49        INFO        BJonesPoly::updateCalTable()         Storing calibration in table bpoly
30-Sep-2026 20:01:48 2026-10-01 00:01:49        INFO        Calibrater::solve          Found good BPOLY solutions in 7 slots.
30-Sep-2026 20:01:48 2026-10-01 00:01:49        INFO        calibrater::solve        Finished solving.
30-Sep-2026 20:01:48 2026-10-01 00:01:49        WARN        calibrater::setvi(bool,bool)        Forcing use of NEW VisibilityIterator.
30-Sep-2026 20:01:48 test_tool_calibrater.py::calibrater_test::test_solveBandpass
30-Sep-2026 20:01:48 Check that solve band poly creates the output table
30-Sep-2026 20:01:48 PASSED
30-Sep-2026 20:01:48
30-Sep-2026 20:01:48 2026-10-01 00:01:49        WARN        calibrater::setvi(bool,bool)        Forcing use of OLD VisibilityIterator.
30-Sep-2026 20:01:48 2026-10-01 00:01:49        INFO        calibrater::open        ****Using OLD VI-driven calibrater tool****
30-Sep-2026 20:01:48 2026-10-01 00:01:49        INFO        calibrater::open        Opening MS: ngc5921.ms for calibration.
30-Sep-2026 20:01:48 2026-10-01 00:01:49        INFO                Clearing all model records in MS header.
30-Sep-2026 20:01:48 2026-10-01 00:01:49        INFO        VisSetUtil::addScrCols        Adding MODEL_DATA and CORRECTED_DATA column(s).
30-Sep-2026 20:01:49 2026-10-01 00:01:49        INFO        VisSetUtil::initScrCols        Initializing MODEL_DATA to (unity).
30-Sep-2026 20:01:49 2026-10-01 00:01:49        INFO        VisSetUtil::initScrCols        Initialized 22653 rows.
30-Sep-2026 20:01:49 2026-10-01 00:01:49        INFO        Calibrater::        Initializing nominal selection to the whole MS.
30-Sep-2026 20:01:49 2026-10-01 00:01:49        INFO        calibrater::setsolvegainspline        Beginning setsolvegainspline--(MSSelection version)-------
30-Sep-2026 20:01:49 2026-10-01 00:01:49        INFO        Calibrater::setsolvegainspline        Arranging to SOLVE:
30-Sep-2026 20:01:49 2026-10-01 00:01:49        INFO        Calibrater::setsolvegainspline        .   GSPLINE: table=gainspline append=false solint=inf refantmode='flex' refant='none' minsnr=0 apmode=AMP solnorm=false
30-Sep-2026 20:01:49 2026-10-01 00:01:49        INFO        calibrater::solve        Beginning solve-----------------------------
30-Sep-2026 20:01:49 2026-10-01 00:01:49        INFO        Calibrater::solve        The following calibration terms are arranged for apply:
30-Sep-2026 20:01:49 2026-10-01 00:01:49        INFO        Calibrater::solve        .   (None)
30-Sep-2026 20:01:49 2026-10-01 00:01:49        INFO        Calibrater::solve        The following calibration term is arranged for solve:
30-Sep-2026 20:01:49 2026-10-01 00:01:49        INFO        Calibrater::solve        .   GSPLINE: table=gainspline append=false solint=inf refantmode='flex' refant='none' minsnr=0 apmode=AMP solnorm=false
30-Sep-2026 20:01:49 2026-10-01 00:01:49        INFO        GJonesSpline::solve()         Fitting time-dependent cubic splines.
30-Sep-2026 20:01:49 2026-10-01 00:01:49        INFO        GJonesSpline::solve()         Solving for phase splines with splinetime= 10800
30-Sep-2026 20:01:49 2026-10-01 00:01:49        INFO        GJonesSpline::solve()         Solving for amplitude splines with splinetime= 10800
30-Sep-2026 20:01:49 2026-10-01 00:01:49        INFO        GJonesSpline::solve()         Accumulating data for:  field= 1331+30500002_0, spw= 0, nchan= 63
30-Sep-2026 20:01:49 2026-10-01 00:01:49        INFO        GJonesSpline::solve()         Accumulating data for:  field= 1445+09900002_0, spw= 0, nchan= 63
30-Sep-2026 20:01:49 2026-10-01 00:01:49        INFO        GJonesSpline::solve()         Accumulating data for:  field= N5921_2, spw= 0, nchan= 63
30-Sep-2026 20:01:49 2026-10-01 00:01:49        INFO        GJonesSpline::solve()         Number of timestamps in data = 60
30-Sep-2026 20:01:49 2026-10-01 00:01:49        INFO        GJonesSpline::getKnots()         Gridded splinetime = 5280 sec.
30-Sep-2026 20:01:49 2026-10-01 00:01:49        INFO        GJonesSpline::solve()         Number of cubic spline control points = 4
30-Sep-2026 20:01:49 2026-10-01 00:01:49        INFO        GJonesSpline::solve()         Number of cubic spline knots = 8
30-Sep-2026 20:01:49 2026-10-01 00:01:49        INFO        GJonesSpline::solve()         Number of cubic spline segments = 1
30-Sep-2026 20:01:49 2026-10-01 00:01:49        INFO        GJonesSpline::solve()         Fitting amplitude spline.
30-Sep-2026 20:01:49 test_tool_calibrater.py::calibrater_test::test_solveGainspline  DPBTRF ;problem leading minor           23
30-Sep-2026 20:01:49 DPBTRF ;problem leading minor           23
30-Sep-2026 20:01:49 2026-10-01 00:01:49        INFO        GJonesSpline::solve()         Searching for and correcting phase-wraps on each baseline.
30-Sep-2026 20:01:49 2026-10-01 00:01:49        INFO        GJonesSpline::solve()         Fitting phase spline.
30-Sep-2026 20:01:49 DPBTRF ;problem leading minor           22
30-Sep-2026 20:01:49 DPBTRF ;problem leading minor           22
30-Sep-2026 20:01:49 2026-10-01 00:01:49        INFO        GJonesSpline::updateCalTable         Storing solutions in table gainspline
30-Sep-2026 20:01:49 2026-10-01 00:01:49        INFO        calibrater::solve        Finished solving.
30-Sep-2026 20:01:49 2026-10-01 00:01:49        WARN        calibrater::setvi(bool,bool)        Forcing use of NEW VisibilityIterator.
30-Sep-2026 20:01:49
30-Sep-2026 20:01:49 Check that solve gain spline creates the output table 
30-Sep-2026 20:01:49 PASSED
30-Sep-2026 20:01:49
30-Sep-2026 20:01:49 2026-10-01 00:01:49        INFO        calibrater::open        ****Using NEW VI2-driven calibrater tool****
30-Sep-2026 20:01:49 2026-10-01 00:01:49        INFO        calibrater::open        Opening MS: gaincaltest2.ms for calibration.
30-Sep-2026 20:01:49 2026-10-01 00:01:49        INFO                Clearing all model records in MS header.
30-Sep-2026 20:01:49 2026-10-01 00:01:49        INFO        VisSetUtil::addScrCols        Adding MODEL_DATA and CORRECTED_DATA column(s).
30-Sep-2026 20:01:49 2026-10-01 00:01:50        INFO        VisSetUtil::initScrCols        Initializing MODEL_DATA to (unity).
30-Sep-2026 20:01:49 2026-10-01 00:01:50        INFO        VisSetUtil::initScrCols        Initialized 328860 rows.
30-Sep-2026 20:01:49 2026-10-01 00:01:50        INFO        Calibrater::        Initializing nominal selection to the whole MS.
30-Sep-2026 20:01:49 2026-10-01 00:01:50        INFO        calibrater::specifycal        Beginning specifycal-----------------------
30-Sep-2026 20:01:49 2026-10-01 00:01:50        INFO                Creating G Jones table from specified parameters.
30-Sep-2026 20:01:49 2026-10-01 00:01:50        INFO                Generating 'G' corrections.
30-Sep-2026 20:01:49 2026-10-01 00:01:50        INFO                Specified parameter(s) (per spw and pol) repeated on all antennas.
30-Sep-2026 20:01:49 2026-10-01 00:01:50        INFO                Specified parameter(s) (per spw and antenna) repeated on all polarizations.
30-Sep-2026 20:01:49 2026-10-01 00:01:50        INFO                spwId=1 antId=<all> polId=<all> parameter= 3   (ip0,ip1 = [0, 0, 0],[1, 0, 9])
30-Sep-2026 20:01:49 2026-10-01 00:01:50        INFO                Writing solutions to table: testcalout.cal
30-Sep-2026 20:01:49 2026-10-01 00:01:50        WARN        calibrater::setvi(bool,bool)        Already using NEW VisibilityIterator.
30-Sep-2026 20:01:49 test_tool_calibrater.py::calibrater_test::test_specifyCal
30-Sep-2026 20:01:49 Check that specifycal can set values for specific spws and antennas
30-Sep-2026 20:01:49 PASSED
30-Sep-2026 20:01:49
30-Sep-2026 20:01:49 2026-10-01 00:01:50        WARN        calibrater::setvi(bool,bool)        Forcing use of OLD VisibilityIterator.
30-Sep-2026 20:01:49 2026-10-01 00:01:50        INFO        calibrater::open        ****Using OLD VI-driven calibrater tool****
30-Sep-2026 20:01:49 2026-10-01 00:01:50        INFO        calibrater::open        Opening MS: gaincaltest2.ms for calibration.
30-Sep-2026 20:01:49 2026-10-01 00:01:50        INFO                Clearing all model records in MS header.
30-Sep-2026 20:01:49 2026-10-01 00:01:50        INFO        VisSetUtil::addScrCols        Adding MODEL_DATA and CORRECTED_DATA column(s).
30-Sep-2026 20:01:50 2026-10-01 00:01:50        INFO        VisSetUtil::initScrCols        Initializing MODEL_DATA to (unity).
30-Sep-2026 20:01:50 2026-10-01 00:01:50        INFO        VisSetUtil::initScrCols        Initialized 328860 rows.
30-Sep-2026 20:01:50 2026-10-01 00:01:50        INFO        Calibrater::        Initializing nominal selection to the whole MS.
30-Sep-2026 20:01:50 2026-10-01 00:01:50        INFO        calibrater::setapply        Beginning setapply--(MSSelection version)-------
30-Sep-2026 20:01:50 2026-10-01 00:01:50        INFO        Calibrater::setapply(type, applypar)        Arranging to APPLY:
30-Sep-2026 20:01:50 2026-10-01 00:01:50        INFO        Calibrater::setapply(type, applypar)        .   G Jones: table=gaincaltest2.ms.G0 select= interp=linear spwmap=[-1] calWt=false
30-Sep-2026 20:01:50 2026-10-01 00:01:50        INFO        calibrater::setsolve        Beginning setsolve--(MSSelection version)-------
30-Sep-2026 20:01:50 2026-10-01 00:01:50        INFO        Calibrater::setsolve        Arranging to SOLVE:
30-Sep-2026 20:01:50 2026-10-01 00:01:50        INFO        Calibrater::setsolve        .   Mf Mueller: table=output.ms append=false solint=inf,none refantmode='flex' refant='none' minsnr=0 apmode=AP solnorm=false
30-Sep-2026 20:01:50 2026-10-01 00:01:50        INFO        Calibrater::state        The following calibration terms are arranged for apply:
30-Sep-2026 20:01:50 2026-10-01 00:01:50        INFO        Calibrater::state        .   G Jones: table=gaincaltest2.ms.G0 select= interp=linear spwmap=[-1] calWt=false
30-Sep-2026 20:01:50 2026-10-01 00:01:50        INFO        Calibrater::state        The following calibration term is arranged for solve:
30-Sep-2026 20:01:50 2026-10-01 00:01:50        INFO        Calibrater::state        .   Mf Mueller: table=output.ms append=false solint=inf,none refantmode='flex' refant='none' minsnr=0 apmode=AP solnorm=false
30-Sep-2026 20:01:50 2026-10-01 00:01:50        INFO        calibrater::solve        Beginning solve-----------------------------
30-Sep-2026 20:01:50 2026-10-01 00:01:50        INFO        Calibrater::solve        The following calibration terms are arranged for apply:
30-Sep-2026 20:01:50 2026-10-01 00:01:50        INFO        Calibrater::solve        .   G Jones: table=gaincaltest2.ms.G0 select= interp=linear spwmap=[-1] calWt=false
30-Sep-2026 20:01:50 2026-10-01 00:01:50        INFO        Calibrater::solve        The following calibration term is arranged for solve:
30-Sep-2026 20:01:50 2026-10-01 00:01:50        INFO        Calibrater::solve        .   Mf Mueller: table=output.ms append=false solint=inf,none refantmode='flex' refant='none' minsnr=0 apmode=AP solnorm=false
30-Sep-2026 20:01:50 2026-10-01 00:01:50        INFO                Solving for Mf Mueller
30-Sep-2026 20:01:50 2026-10-01 00:01:51        INFO                For solint = inf, found 84 solution intervals.
30-Sep-2026 20:01:50 2026-10-01 00:01:51        INFO                  Found good Mf Mueller solutions in 84 intervals.
30-Sep-2026 20:01:50 2026-10-01 00:01:51        INFO                Writing solutions to table: output.ms
30-Sep-2026 20:01:50 2026-10-01 00:01:51        INFO        calibrater::solve        Finished solving.
30-Sep-2026 20:01:50 2026-10-01 00:01:51        WARN        calibrater::setvi(bool,bool)        Forcing use of NEW VisibilityIterator.
30-Sep-2026 20:01:51 test_tool_calibrater.py::calibrater_test::test_standardPath
30-Sep-2026 20:01:51 open setapply setsolve state solve close 
30-Sep-2026 20:01:51 PASSED
30-Sep-2026 20:01:51
30-Sep-2026 20:01:51 2026-10-01 00:01:51        INFO        calibrater::open        ****Using NEW VI2-driven calibrater tool****
30-Sep-2026 20:01:51 2026-10-01 00:01:51        INFO        calibrater::open        Opening MS: gaincaltest2.ms for calibration.
30-Sep-2026 20:01:51 2026-10-01 00:01:51        INFO                Clearing all model records in MS header.
30-Sep-2026 20:01:51 2026-10-01 00:01:51        INFO        VisSetUtil::addScrCols        Adding MODEL_DATA and CORRECTED_DATA column(s).
30-Sep-2026 20:01:51 2026-10-01 00:01:51        INFO        VisSetUtil::initScrCols        Initializing MODEL_DATA to (unity).
30-Sep-2026 20:01:51 2026-10-01 00:01:52        INFO        VisSetUtil::initScrCols        Initialized 328860 rows.
30-Sep-2026 20:01:51 2026-10-01 00:01:52        INFO        Calibrater::        Initializing nominal selection to the whole MS.
30-Sep-2026 20:01:51 2026-10-01 00:01:52        INFO        name::        No table opened.
30-Sep-2026 20:01:51 2026-10-01 00:01:52        INFO        showcache::        The Table Cache has the following 16 entries:
30-Sep-2026 20:01:51 2026-10-01 00:01:52        INFO        showcache::            0: "/Users/casaci/bamboohome/xml-data/build-dir/CASASPECS-DEVTESTPY312147-TTOARM15P312/casa6/casatestutils/nosedir/test_tool_calibrater/gaincaltest2.ms"
30-Sep-2026 20:01:51 2026-10-01 00:01:52        INFO        showcache::            1: "/Users/casaci/bamboohome/xml-data/build-dir/CASASPECS-DEVTESTPY312147-TTOARM15P312/casa6/casatestutils/nosedir/test_tool_calibrater/gaincaltest2.ms/ANTENNA"
30-Sep-2026 20:01:51 2026-10-01 00:01:52        INFO        showcache::            2: "/Users/casaci/bamboohome/xml-data/build-dir/CASASPECS-DEVTESTPY312147-TTOARM15P312/casa6/casatestutils/nosedir/test_tool_calibrater/gaincaltest2.ms/DATA_DESCRIPTION"
30-Sep-2026 20:01:51 2026-10-01 00:01:52        INFO        showcache::            3: "/Users/casaci/bamboohome/xml-data/build-dir/CASASPECS-DEVTESTPY312147-TTOARM15P312/casa6/casatestutils/nosedir/test_tool_calibrater/gaincaltest2.ms/FEED"
30-Sep-2026 20:01:51 2026-10-01 00:01:52        INFO        showcache::            4: "/Users/casaci/bamboohome/xml-data/build-dir/CASASPECS-DEVTESTPY312147-TTOARM15P312/casa6/casatestutils/nosedir/test_tool_calibrater/gaincaltest2.ms/FIELD"
30-Sep-2026 20:01:51 2026-10-01 00:01:52        INFO        showcache::            5: "/Users/casaci/bamboohome/xml-data/build-dir/CASASPECS-DEVTESTPY312147-TTOARM15P312/casa6/casatestutils/nosedir/test_tool_calibrater/gaincaltest2.ms/FLAG_CMD"
30-Sep-2026 20:01:51 2026-10-01 00:01:52        INFO        showcache::            6: "/Users/casaci/bamboohome/xml-data/build-dir/CASASPECS-DEVTESTPY312147-TTOARM15P312/casa6/casatestutils/nosedir/test_tool_calibrater/gaincaltest2.ms/HISTORY"
30-Sep-2026 20:01:51 2026-10-01 00:01:52        INFO        showcache::            7: "/Users/casaci/bamboohome/xml-data/build-dir/CASASPECS-DEVTESTPY312147-TTOARM15P312/casa6/casatestutils/nosedir/test_tool_calibrater/gaincaltest2.ms/OBSERVATION"
30-Sep-2026 20:01:51 2026-10-01 00:01:52        INFO        showcache::            8: "/Users/casaci/bamboohome/xml-data/build-dir/CASASPECS-DEVTESTPY312147-TTOARM15P312/casa6/casatestutils/nosedir/test_tool_calibrater/gaincaltest2.ms/POINTING"
30-Sep-2026 20:01:51 2026-10-01 00:01:52        INFO        showcache::            9: "/Users/casaci/bamboohome/xml-data/build-dir/CASASPECS-DEVTESTPY312147-TTOARM15P312/casa6/casatestutils/nosedir/test_tool_calibrater/gaincaltest2.ms/POLARIZATION"
30-Sep-2026 20:01:51 2026-10-01 00:01:52        INFO        showcache::            10: "/Users/casaci/bamboohome/xml-data/build-dir/CASASPECS-DEVTESTPY312147-TTOARM15P312/casa6/casatestutils/nosedir/test_tool_calibrater/gaincaltest2.ms/PROCESSOR"
30-Sep-2026 20:01:51 2026-10-01 00:01:52        INFO        showcache::            11: "/Users/casaci/bamboohome/xml-data/build-dir/CASASPECS-DEVTESTPY312147-TTOARM15P312/casa6/casatestutils/nosedir/test_tool_calibrater/gaincaltest2.ms/SOURCE"
30-Sep-2026 20:01:51 2026-10-01 00:01:52        INFO        showcache::            12: "/Users/casaci/bamboohome/xml-data/build-dir/CASASPECS-DEVTESTPY312147-TTOARM15P312/casa6/casatestutils/nosedir/test_tool_calibrater/gaincaltest2.ms/SPECTRAL_WINDOW"
30-Sep-2026 20:01:51 2026-10-01 00:01:52        INFO        showcache::            13: "/Users/casaci/bamboohome/xml-data/build-dir/CASASPECS-DEVTESTPY312147-TTOARM15P312/casa6/casatestutils/nosedir/test_tool_calibrater/gaincaltest2.ms/STATE"
30-Sep-2026 20:01:51 2026-10-01 00:01:52        INFO        showcache::            14: "/Users/casaci/bamboohome/xml-data/build-dir/CASASPECS-DEVTESTPY312147-TTOARM15P312/casa6/casatestutils/nosedir/test_tool_calibrater/gaincaltest2.ms/SYSCAL"
30-Sep-2026 20:01:51 2026-10-01 00:01:52        INFO        showcache::            15: "/Users/casaci/bamboohome/xml-data/build-dir/CASASPECS-DEVTESTPY312147-TTOARM15P312/casa6/casatestutils/nosedir/test_tool_calibrater/gaincaltest2.ms/WEATHER"
30-Sep-2026 20:01:51 2026-10-01 00:01:52        INFO        name::        No table opened.
30-Sep-2026 20:01:51 2026-10-01 00:01:52        INFO        showcache::        The Table Cache is empty.
30-Sep-2026 20:01:51 2026-10-01 00:01:52        WARN        calibrater::setvi(bool,bool)        Already using NEW VisibilityIterator.
30-Sep-2026 20:01:51 test_tool_calibrater.py::calibrater_test::test_takesMs
30-Sep-2026 20:01:51 Check that the calibrater tool can open and close an MS 
30-Sep-2026 20:01:51 PASSED
30-Sep-2026 20:01:51
30-Sep-2026 20:01:51 2026-10-01 00:01:52        INFO        calibrater::open        ****Using NEW VI2-driven calibrater tool****
30-Sep-2026 20:01:51 2026-10-01 00:01:52        INFO        calibrater::open        Opening MS: gaincaltest2.ms for calibration.
30-Sep-2026 20:01:51 2026-10-01 00:01:52        INFO                Clearing all model records in MS header.
30-Sep-2026 20:01:51 2026-10-01 00:01:52        INFO        VisSetUtil::addScrCols        Adding MODEL_DATA and CORRECTED_DATA column(s).
30-Sep-2026 20:01:52 2026-10-01 00:01:52        INFO        VisSetUtil::initScrCols        Initializing MODEL_DATA to (unity).
30-Sep-2026 20:01:52 2026-10-01 00:01:52        INFO        VisSetUtil::initScrCols        Initialized 328860 rows.
30-Sep-2026 20:01:52 2026-10-01 00:01:52        INFO        Calibrater::        Initializing nominal selection to the whole MS.
30-Sep-2026 20:01:52 2026-10-01 00:01:52        INFO        calibrater::setapply        Beginning setapply--(MSSelection version)-------
30-Sep-2026 20:01:52 2026-10-01 00:01:52        INFO        Calibrater::setapply(type, applypar)        Arranging to APPLY:
30-Sep-2026 20:01:52 2026-10-01 00:01:52        INFO        Calibrater::setapply(type, applypar)        .   G Jones: table=gaincaltest2.ms.G0 select= interp=linear spwmap=[-1] calWt=false
30-Sep-2026 20:01:52 2026-10-01 00:01:52        INFO        calibrater::correct        Beginning correct---------------------------
30-Sep-2026 20:01:52 2026-10-01 00:01:52        INFO        Calibrater::correct2 (VI2/VB2)        The following calibration terms are arranged for apply:
30-Sep-2026 20:01:52 2026-10-01 00:01:52        INFO        Calibrater::correct2 (VI2/VB2)        .   G Jones: table=gaincaltest2.ms.G0 select= interp=linear spwmap=[-1] calWt=false
30-Sep-2026 20:01:52 2026-10-01 00:01:53        INFO        calibrater::correct        Finished correcting.
30-Sep-2026 20:01:53 2026-10-01 00:01:53        WARN        calibrater::setvi(bool,bool)        Already using NEW VisibilityIterator.
30-Sep-2026 20:01:53 test_tool_calibrater.py::calibrater_test::test_writeToCorrected
30-Sep-2026 20:01:53 Check that the tool writes to the CORRECTED_DATA column 
30-Sep-2026 20:01:53 PASSED
30-Sep-2026 20:01:53
30-Sep-2026 20:01:53 - generated xml file: /Users/casaci/bamboohome/xml-data/build-dir/CASASPECS-DEVTESTPY312147-TTOARM15P312/casa6/casatestutils/nosedir/xml/test_tool_calibrater/nose.xml -
30-Sep-2026 20:01:53 ======================== 24 passed, 1 warning in 28.38s ========================
30-Sep-2026 20:01:53 ============================= test session starts ==============================
30-Sep-2026 20:01:53 platform darwin -- Python 3.12.8, pytest-9.1.1, pluggy-1.6.0 -- /Users/casaci/bamboohome/xml-data/build-dir/CASASPECS-DEVTESTPY312147-TTOARM15P312/casa6testenv/bin/python
30-Sep-2026 20:01:53 cachedir: .pytest_cache
30-Sep-2026 20:01:53 rootdir: /Users/casaci/bamboohome/xml-data/build-dir/CASASPECS-DEVTESTPY312147-TTOARM15P312/casa6/casatestutils/nosedir/test_tool_image_pbcor
30-Sep-2026 20:01:53 configfile: pytest.ini
30-Sep-2026 20:01:54 collecting ... collected 9 items
30-Sep-2026 20:01:54
30-Sep-2026 20:01:54
30-Sep-2026 20:01:54 2026-10-01 00:01:55        INFO        FITSCoordinateUtil::fromFITSHeader        passing empty or nonexistant spectral Coordinate axis
30-Sep-2026 20:01:54 2026-10-01 00:01:55        INFO        FITSCoordinateUtil::fromFITSHeader        passing empty or nonexistant spectral Coordinate axis
30-Sep-2026 20:01:54 2026-10-01 00:01:55        INFO        CasacRegionManager::fromBCS        No directional region specified. Using full positional plane.
30-Sep-2026 20:01:54 2026-10-01 00:01:55        INFO        CasacRegionManager::fromBCS        Using all spectral channels.
30-Sep-2026 20:01:54 2026-10-01 00:01:55        INFO        CasacRegionManager::fromBCS        Using polarizations ALL
30-Sep-2026 20:01:54 2026-10-01 00:01:55        INFO        ImageRegion::fromRecord        Selected bounding box :
30-Sep-2026 20:01:54 2026-10-01 00:01:55        INFO        ImageRegion::fromRecord+            [0, 0, 0, 0] to [112, 75, 4, 1]  (00:03:44.024, -00.38.00.046, 1.415e+09Hz, I to 23:56:15.977, +00.37.00.043, 1.415e+09Hz, Q)
30-Sep-2026 20:01:54 2026-10-01 00:01:55        INFO        ImageRegion::fromRecord        Selected bounding box :
30-Sep-2026 20:01:54 2026-10-01 00:01:55        INFO        ImageRegion::fromRecord+            [0, 0, 0, 0] to [112, 75, 4, 1]  (00:03:44.024, -00.38.00.046, 1.415e+09Hz, I to 23:56:15.977, +00.37.00.043, 1.415e+09Hz, Q)
30-Sep-2026 20:01:54 2026-10-01 00:01:55        INFO        SubImageFactory::createImage        Creating image 'mypb.im' of shape [113, 76, 5, 2]
30-Sep-2026 20:01:54 2026-10-01 00:01:55        INFO        ImageMaskAttacher::makeMask        Created mask `mask0'
30-Sep-2026 20:01:54 2026-10-01 00:01:55        INFO        ImageRegion::fromRecord        Selected bounding box :
30-Sep-2026 20:01:54 2026-10-01 00:01:55        INFO        ImageRegion::fromRecord+            [0, 0, 0, 0] to [112, 75, 0, 0]  (00:03:44.024, -00.38.00.046, 1.415e+09Hz, I to 23:56:15.977, +00.37.00.043, 1.415e+09Hz, I)
30-Sep-2026 20:01:54 2026-10-01 00:01:55        INFO        CasacRegionManager::fromBCS        No directional region specified. Using full positional plane.
30-Sep-2026 20:01:54 2026-10-01 00:01:55        INFO        CasacRegionManager::fromBCS        Using all spectral channels.
30-Sep-2026 20:01:54 2026-10-01 00:01:55        INFO        CasacRegionManager::fromBCS        Using polarizations ALL
30-Sep-2026 20:01:54 2026-10-01 00:01:55        INFO        ImageRegion::fromRecord        Selected bounding box :
30-Sep-2026 20:01:54 2026-10-01 00:01:55        INFO        ImageRegion::fromRecord+            [0, 0, 0, 0] to [112, 75, 4, 1]  (00:03:44.024, -00.38.00.046, 1.415e+09Hz, I to 23:56:15.977, +00.37.00.043, 1.415e+09Hz, Q)
30-Sep-2026 20:01:54 2026-10-01 00:01:55        INFO        ImageRegion::fromRecord        Selected bounding box :
30-Sep-2026 20:01:54 2026-10-01 00:01:55        INFO        ImageRegion::fromRecord+            [0, 0, 0, 0] to [112, 75, 4, 1]  (00:03:44.024, -00.38.00.046, 1.415e+09Hz, I to 23:56:15.977, +00.37.00.043, 1.415e+09Hz, Q)
30-Sep-2026 20:01:54 2026-10-01 00:01:55        INFO        SubImageFactory::createImage        Creating image 'mypb.im' of shape [113, 76, 5, 2]
30-Sep-2026 20:01:54 2026-10-01 00:01:55        INFO        ImageMaskAttacher::makeMask        Created mask `mask0'
30-Sep-2026 20:01:54 2026-10-01 00:01:55        INFO        name::        No table opened.
30-Sep-2026 20:01:54 2026-10-01 00:01:55        INFO        showcache::        The Table Cache is empty.
30-Sep-2026 20:01:54 test_tool_image_pbcor.py::ia_pbcor_test::test_4d_image_with_2d_pb
30-Sep-2026 20:01:54 ia.pbcor: Test full image divide with cutoff. Primary beam is 2 D, image is 4 D
30-Sep-2026 20:01:54 PASSED
30-Sep-2026 20:01:54
30-Sep-2026 20:01:54 2026-10-01 00:01:55        INFO        SubImageFactory::createImage        Creating image 'mypb.im' of shape [5, 5, 1, 1]
30-Sep-2026 20:01:54 2026-10-01 00:01:55        INFO        name::        No table opened.
30-Sep-2026 20:01:54 2026-10-01 00:01:55        INFO        showcache::        The Table Cache is empty.
30-Sep-2026 20:01:54 test_tool_image_pbcor.py::ia_pbcor_test::test_diff_spectral_coordinate
30-Sep-2026 20:01:54 Verify fix that a different spectral coordinates in target and template don't matter, CAS-5096
30-Sep-2026 20:01:54 PASSED
30-Sep-2026 20:01:54
30-Sep-2026 20:01:54 2026-10-01 00:01:55        INFO        ImageFactory::createImage        Created Paged image 't_in.im' of shape [20, 20, 4, 20] with float valued pixels.
30-Sep-2026 20:01:54 2026-10-01 00:01:55        INFO        ImageFactory::createImage        Created Paged image 't_pb_in.im' of shape [20, 20, 4, 20] with float valued pixels.
30-Sep-2026 20:01:54 2026-10-01 00:01:55        INFO        CasacRegionManager::fromBCS        No directional region specified. Using full positional plane.
30-Sep-2026 20:01:54 2026-10-01 00:01:55        INFO        CasacRegionManager::fromBCS        Using all spectral channels.
30-Sep-2026 20:01:54 2026-10-01 00:01:55        INFO        CasacRegionManager::fromBCS        Using polarizations I
30-Sep-2026 20:01:54 2026-10-01 00:01:55        INFO        ImageRegion::fromRecord        Selected bounding box :
30-Sep-2026 20:01:54 2026-10-01 00:01:55        INFO        ImageRegion::fromRecord+            [0, 0, 0, 0] to [19, 19, 0, 19]  (00:00:40.000, -00.10.00.001, I, 1.41499e+09Hz to 23:59:24.000, +00.09.00.001, I, 1.41501e+09Hz)
30-Sep-2026 20:01:54 2026-10-01 00:01:55        INFO        ImageRegion::fromRecord        Selected bounding box :
30-Sep-2026 20:01:54 2026-10-01 00:01:55        INFO        ImageRegion::fromRecord+            [0, 0, 0, 0] to [19, 19, 0, 19]  (00:00:40.000, -00.10.00.001, I, 1.41499e+09Hz to 23:59:24.000, +00.09.00.001, I, 1.41501e+09Hz)
30-Sep-2026 20:01:54 2026-10-01 00:01:55        INFO        SubImageFactory::createImage        Creating image 't_out.im' of shape [20, 20, 1, 20]
30-Sep-2026 20:01:54 2026-10-01 00:01:55        INFO        name::        No table opened.
30-Sep-2026 20:01:54 2026-10-01 00:01:55        INFO        showcache::        The Table Cache is empty.
30-Sep-2026 20:01:54 test_tool_image_pbcor.py::ia_pbcor_test::test_empty_region_and_stokes
30-Sep-2026 20:01:54 Test specifying stokes with empty region works (CAS-11708)
30-Sep-2026 20:01:54 PASSED
30-Sep-2026 20:01:54
30-Sep-2026 20:01:54 2026-10-01 00:01:55        SEVERE        image::open (file /private/var/folders/60/83wxljbx2vlfbx_hy0yfv8rc0000gn/T/build-via-sdist-hto6_n3j/casatools-6.7.7.7a14849.dev3/src/tools/image/image_cmpt.cc, line 4208)        Exception Reported: Exception: File name is empty.
30-Sep-2026 20:01:54 2026-10-01 00:01:55        SEVERE        image::open (file /private/var/folders/60/83wxljbx2vlfbx_hy0yfv8rc0000gn/T/build-via-sdist-hto6_n3j/casatools-6.7.7.7a14849.dev3/src/tools/image/image_cmpt.cc, line 4208)+        ... thrown by static void casa::ImageFactory::_checkInfile(const String &) at File: /Users/casaci/bamboohome/xml-data/build-dir/CASASPECS-DBC257-BPO15AP312/casa6/casatools/src/code/imageanalysis/ImageAnalysis/ImageFactory2.cc, line: 373
30-Sep-2026 20:01:54 2026-10-01 00:01:55        SEVERE        image::open (file /private/var/folders/60/83wxljbx2vlfbx_hy0yfv8rc0000gn/T/build-via-sdist-hto6_n3j/casatools-6.7.7.7a14849.dev3/src/tools/image/image_cmpt.cc, line 4208)        Exception Reported: Exception: File totally_bogus does not exist..
30-Sep-2026 20:01:54 2026-10-01 00:01:55        SEVERE        image::open (file /private/var/folders/60/83wxljbx2vlfbx_hy0yfv8rc0000gn/T/build-via-sdist-hto6_n3j/casatools-6.7.7.7a14849.dev3/src/tools/image/image_cmpt.cc, line 4208)+        ... thrown by static void casa::ImageFactory::_checkInfile(const String &) at File: /Users/casaci/bamboohome/xml-data/build-dir/CASASPECS-DBC257-BPO15AP312/casa6/casatools/src/code/imageanalysis/ImageAnalysis/ImageFactory2.cc, line: 378
30-Sep-2026 20:01:54 2026-10-01 00:01:55        INFO        FITSCoordinateUtil::fromFITSHeader        passing empty or nonexistant spectral Coordinate axis
30-Sep-2026 20:01:54 2026-10-01 00:01:55        SEVERE        image::pbcor (file /private/var/folders/60/83wxljbx2vlfbx_hy0yfv8rc0000gn/T/build-via-sdist-hto6_n3j/casatools-6.7.7.7a14849.dev3/src/tools/image/image_cmpt.cc, line 4289)        Exception Reported: Exception: The image filename is empty.
30-Sep-2026 20:01:54 2026-10-01 00:01:55        SEVERE        image::pbcor (file /private/var/folders/60/83wxljbx2vlfbx_hy0yfv8rc0000gn/T/build-via-sdist-hto6_n3j/casatools-6.7.7.7a14849.dev3/src/tools/image/image_cmpt.cc, line 4289)+        ... thrown by static void casacore::ImageUtilities::openImage(ImageInterface<T> *&, const String &) [T = float] at File: /Users/casaci/bamboohome/xml-data/build-dir/CASASPECS-DBC257-BPO15AP312/casainstall/include/casacore/images/Images/ImageUtilities2.tcc, line: 258
30-Sep-2026 20:01:54 2026-10-01 00:01:55        INFO        FITSCoordinateUtil::fromFITSHeader        passing empty or nonexistant spectral Coordinate axis
30-Sep-2026 20:01:54 2026-10-01 00:01:55        SEVERE        image::pbcor (file /private/var/folders/60/83wxljbx2vlfbx_hy0yfv8rc0000gn/T/build-via-sdist-hto6_n3j/casatools-6.7.7.7a14849.dev3/src/tools/image/image_cmpt.cc, line 4289)        Exception Reported: Exception: File 'totally_bogus2' does not exist.
30-Sep-2026 20:01:54 2026-10-01 00:01:55        SEVERE        image::pbcor (file /private/var/folders/60/83wxljbx2vlfbx_hy0yfv8rc0000gn/T/build-via-sdist-hto6_n3j/casatools-6.7.7.7a14849.dev3/src/tools/image/image_cmpt.cc, line 4289)+        ... thrown by static void casacore::ImageUtilities::openImage(ImageInterface<T> *&, const String &) [T = float] at File: /Users/casaci/bamboohome/xml-data/build-dir/CASASPECS-DBC257-BPO15AP312/casainstall/include/casacore/images/Images/ImageUtilities2.tcc, line: 263
30-Sep-2026 20:01:54 2026-10-01 00:01:55        INFO        FITSCoordinateUtil::fromFITSHeader        passing empty or nonexistant spectral Coordinate axis
30-Sep-2026 20:01:54 2026-10-01 00:01:55        INFO        FITSCoordinateUtil::fromFITSHeader        passing empty or nonexistant spectral Coordinate axis
30-Sep-2026 20:01:54 2026-10-01 00:01:55        SEVERE        ImageInputProcessor::_process        Requested output image /bogusplace/bogusimage cannot be created so will not be written
30-Sep-2026 20:01:54 2026-10-01 00:01:55        SEVERE        image::pbcor (file /private/var/folders/60/83wxljbx2vlfbx_hy0yfv8rc0000gn/T/build-via-sdist-hto6_n3j/casatools-6.7.7.7a14849.dev3/src/tools/image/image_cmpt.cc, line 4289)        Exception Reported: 2026-10-01 00:01:55        SEVERE        ImageInputProcessor::_process        Requested output image /bogusplace/bogusimage cannot be created so will not be written
30-Sep-2026 20:01:54 2026-10-01 00:01:55        INFO        FITSCoordinateUtil::fromFITSHeader        passing empty or nonexistant spectral Coordinate axis
30-Sep-2026 20:01:54 2026-10-01 00:01:55        INFO        FITSCoordinateUtil::fromFITSHeader        passing empty or nonexistant spectral Coordinate axis
30-Sep-2026 20:01:54 2026-10-01 00:01:55        WARN                /Users/casaci/bamboohome/xml-data/build-dir/CASASPECS-DEVTESTPY312147-TTOARM15P312/casa6/casatestutils/nosedir/test_tool_image_pbcor/pbtest1_im.fits is not a valid or readable table
30-Sep-2026 20:01:54 2026-10-01 00:01:55        SEVERE                Cannot read image /Users/casaci/bamboohome/xml-data/build-dir/CASASPECS-DEVTESTPY312147-TTOARM15P312/casa6/casatestutils/nosedir/test_tool_image_pbcor/pbtest1_im.fits to get region bogus_region
30-Sep-2026 20:01:54 2026-10-01 00:01:55        SEVERE        image::pbcor (file /private/var/folders/60/83wxljbx2vlfbx_hy0yfv8rc0000gn/T/build-via-sdist-hto6_n3j/casatools-6.7.7.7a14849.dev3/src/tools/image/image_cmpt.cc, line 4289)        Exception Reported: Unable to open region file or region table description bogus_region in image /Users/casaci/bamboohome/xml-data/build-dir/CASASPECS-DEVTESTPY312147-TTOARM15P312/casa6/casatestutils/nosedir/test_tool_image_pbcor/pbtest1_im.fits at File: /Users/casaci/bamboohome/xml-data/build-dir/CASASPECS-DBC257-BPO15AP312/casa6/casatools/src/code/imageanalysis/Regions/CasacRegionManager.cc, line: 489
30-Sep-2026 20:01:54 2026-10-01 00:01:55        INFO        FITSCoordinateUtil::fromFITSHeader        passing empty or nonexistant spectral Coordinate axis
30-Sep-2026 20:01:54 2026-10-01 00:01:55        INFO        FITSCoordinateUtil::fromFITSHeader        passing empty or nonexistant spectral Coordinate axis
30-Sep-2026 20:01:54 2026-10-01 00:01:55        SEVERE        image::pbcor (file /private/var/folders/60/83wxljbx2vlfbx_hy0yfv8rc0000gn/T/build-via-sdist-hto6_n3j/casatools-6.7.7.7a14849.dev3/src/tools/image/image_cmpt.cc, line 4289)        Exception Reported: Unknown mode zz
30-Sep-2026 20:01:54 2026-10-01 00:01:55        INFO        FITSCoordinateUtil::fromFITSHeader        passing empty or nonexistant spectral Coordinate axis
30-Sep-2026 20:01:54 2026-10-01 00:01:55        INFO        FITSCoordinateUtil::fromFITSHeader        passing empty or nonexistant spectral Coordinate axis
30-Sep-2026 20:01:54 2026-10-01 00:01:55        SEVERE        image::pbcor (file /private/var/folders/60/83wxljbx2vlfbx_hy0yfv8rc0000gn/T/build-via-sdist-hto6_n3j/casatools-6.7.7.7a14849.dev3/src/tools/image/image_cmpt.cc, line 4289)        Exception Reported: Coordinate systems of image and template are different: The DirectionCoordinates have differing LinearXform components at File: /Users/casaci/bamboohome/xml-data/build-dir/CASASPECS-DBC257-BPO15AP312/casa6/casatools/src/code/imageanalysis/ImageAnalysis/ImagePrimaryBeamCorrector.cc, line: 144
30-Sep-2026 20:01:54 2026-10-01 00:01:55        INFO        name::        No table opened.
30-Sep-2026 20:01:54 2026-10-01 00:01:55        INFO        showcache::        The Table Cache is empty.
30-Sep-2026 20:01:54 test_tool_image_pbcor.py::ia_pbcor_test::test_exceptions
30-Sep-2026 20:01:54 ia.pbcor: Test various exception cases
30-Sep-2026 20:01:54 PASSED
30-Sep-2026 20:01:54
30-Sep-2026 20:01:54 2026-10-01 00:01:55        INFO        FITSCoordinateUtil::fromFITSHeader        passing empty or nonexistant spectral Coordinate axis
30-Sep-2026 20:01:54 2026-10-01 00:01:55        INFO        FITSCoordinateUtil::fromFITSHeader        passing empty or nonexistant spectral Coordinate axis
30-Sep-2026 20:01:54 2026-10-01 00:01:55        INFO        FITSCoordinateUtil::fromFITSHeader        passing empty or nonexistant spectral Coordinate axis
30-Sep-2026 20:01:54 2026-10-01 00:01:55        INFO        CasacRegionManager::fromBCS        No directional region specified. Using full positional plane.
30-Sep-2026 20:01:54 2026-10-01 00:01:55        INFO        ImageRegion::fromRecord        Selected bounding box :
30-Sep-2026 20:01:54 2026-10-01 00:01:55        INFO        ImageRegion::fromRecord+            [0, 0] to [112, 75]  (00:00:29.333, -00.07.24.000 to 23:59:29.600, +00.07.36.000)
30-Sep-2026 20:01:54 2026-10-01 00:01:55        INFO        ImageRegion::fromRecord        Selected bounding box :
30-Sep-2026 20:01:54 2026-10-01 00:01:55        INFO        ImageRegion::fromRecord+            [0, 0] to [112, 75]  (00:00:29.333, -00.07.24.000 to 23:59:29.600, +00.07.36.000)
30-Sep-2026 20:01:54 2026-10-01 00:01:55        INFO        SubImageFactory::createImage        Creating image 'mypb.im' of shape [113, 76]
30-Sep-2026 20:01:54 2026-10-01 00:01:55        INFO        FITSCoordinateUtil::fromFITSHeader        passing empty or nonexistant spectral Coordinate axis
30-Sep-2026 20:01:54 2026-10-01 00:01:55        INFO        FITSCoordinateUtil::fromFITSHeader        passing empty or nonexistant spectral Coordinate axis
30-Sep-2026 20:01:54 2026-10-01 00:01:55        INFO        CasacRegionManager::fromBCS        No directional region specified. Using full positional plane.
30-Sep-2026 20:01:54 2026-10-01 00:01:55        INFO        ImageRegion::fromRecord        Selected bounding box :
30-Sep-2026 20:01:54 2026-10-01 00:01:55        INFO        ImageRegion::fromRecord+            [0, 0] to [112, 75]  (00:00:29.333, -00.07.24.000 to 23:59:29.600, +00.07.36.000)
30-Sep-2026 20:01:54 2026-10-01 00:01:55        INFO        ImageRegion::fromRecord        Selected bounding box :
30-Sep-2026 20:01:54 2026-10-01 00:01:55        INFO        ImageRegion::fromRecord+            [0, 0] to [112, 75]  (00:00:29.333, -00.07.24.000 to 23:59:29.600, +00.07.36.000)
30-Sep-2026 20:01:54 2026-10-01 00:01:55        INFO        SubImageFactory::createImage        Creating image 'mypb.im' of shape [113, 76]
30-Sep-2026 20:01:54 2026-10-01 00:01:55        INFO        FITSCoordinateUtil::fromFITSHeader        passing empty or nonexistant spectral Coordinate axis
30-Sep-2026 20:01:54 2026-10-01 00:01:55        INFO        name::        No table opened.
30-Sep-2026 20:01:54 2026-10-01 00:01:55        INFO        showcache::        The Table Cache is empty.
30-Sep-2026 20:01:54 test_tool_image_pbcor.py::ia_pbcor_test::test_full_image_divide
30-Sep-2026 20:01:54 ia.pbcor: Test full image divide
30-Sep-2026 20:01:54 PASSED
30-Sep-2026 20:01:54
30-Sep-2026 20:01:54 2026-10-01 00:01:55        INFO        FITSCoordinateUtil::fromFITSHeader        passing empty or nonexistant spectral Coordinate axis
30-Sep-2026 20:01:54 2026-10-01 00:01:55        INFO        FITSCoordinateUtil::fromFITSHeader        passing empty or nonexistant spectral Coordinate axis
30-Sep-2026 20:01:54 2026-10-01 00:01:55        INFO        FITSCoordinateUtil::fromFITSHeader        passing empty or nonexistant spectral Coordinate axis
30-Sep-2026 20:01:54 2026-10-01 00:01:55        INFO        CasacRegionManager::fromBCS        No directional region specified. Using full positional plane.
30-Sep-2026 20:01:54 2026-10-01 00:01:55        INFO        ImageRegion::fromRecord        Selected bounding box :
30-Sep-2026 20:01:54 2026-10-01 00:01:55        INFO        ImageRegion::fromRecord+            [0, 0] to [112, 75]  (00:00:29.333, -00.07.24.000 to 23:59:29.600, +00.07.36.000)
30-Sep-2026 20:01:54 2026-10-01 00:01:55        INFO        ImageRegion::fromRecord        Selected bounding box :
30-Sep-2026 20:01:54 2026-10-01 00:01:55        INFO        ImageRegion::fromRecord+            [0, 0] to [112, 75]  (00:00:29.333, -00.07.24.000 to 23:59:29.600, +00.07.36.000)
30-Sep-2026 20:01:54 2026-10-01 00:01:55        INFO        SubImageFactory::createImage        Creating image 'mypb.im' of shape [113, 76]
30-Sep-2026 20:01:54 2026-10-01 00:01:55        INFO        ImageMaskAttacher::makeMask        Created mask `mask0'
30-Sep-2026 20:01:54 2026-10-01 00:01:55        INFO        FITSCoordinateUtil::fromFITSHeader        passing empty or nonexistant spectral Coordinate axis
30-Sep-2026 20:01:54 2026-10-01 00:01:55        INFO        CasacRegionManager::fromBCS        No directional region specified. Using full positional plane.
30-Sep-2026 20:01:54 2026-10-01 00:01:55        INFO        ImageRegion::fromRecord        Selected bounding box :
30-Sep-2026 20:01:54 2026-10-01 00:01:55        INFO        ImageRegion::fromRecord+            [0, 0] to [112, 75]  (00:00:29.333, -00.07.24.000 to 23:59:29.600, +00.07.36.000)
30-Sep-2026 20:01:54 2026-10-01 00:01:55        INFO        ImageRegion::fromRecord        Selected bounding box :
30-Sep-2026 20:01:54 2026-10-01 00:01:55        INFO        ImageRegion::fromRecord+            [0, 0] to [112, 75]  (00:00:29.333, -00.07.24.000 to 23:59:29.600, +00.07.36.000)
30-Sep-2026 20:01:54 2026-10-01 00:01:55        INFO        SubImageFactory::createImage        Creating image 'mypb.im' of shape [113, 76]
30-Sep-2026 20:01:54 2026-10-01 00:01:55        INFO        ImageMaskAttacher::makeMask        Created mask `mask0'
30-Sep-2026 20:01:54 2026-10-01 00:01:55        INFO        name::        No table opened.
30-Sep-2026 20:01:54 2026-10-01 00:01:55        INFO        showcache::        The Table Cache is empty.
30-Sep-2026 20:01:54 test_tool_image_pbcor.py::ia_pbcor_test::test_full_image_using_cutoff
30-Sep-2026 20:01:54 ia.pbcor: Test full image divide with cutoff
30-Sep-2026 20:01:54 PASSED
30-Sep-2026 20:01:54
30-Sep-2026 20:01:54 2026-10-01 00:01:55        INFO        ImageFactory::createImage        Created Paged image 'zz.im' of shape [20, 20] with float valued pixels.
30-Sep-2026 20:01:54 2026-10-01 00:01:55        INFO        SubImageFactory::createImage        Creating image 'pb_out.im' of shape [20, 20]
30-Sep-2026 20:01:54 2026-10-01 00:01:55        INFO        ::::ImageFactory::createImage        Created Paged image 'zz.im' of shape [20, 20] with float valued pixels.
30-Sep-2026 20:01:54 2026-10-01 00:01:55        INFO        ::::image::fromshape        Ran ia.fromshape
30-Sep-2026 20:01:54 2026-10-01 00:01:55        INFO        ::::image::fromshape        ia.fromshape(outfile="zz.im", shape=[20,20], csys={...}, linear=false, overwrite=false, log=true, type="f")
30-Sep-2026 20:01:54 2026-10-01 00:01:55        INFO        ::::image::pbcor        Ran ia.pbcor
30-Sep-2026 20:01:54 2026-10-01 00:01:55        INFO        ::::image::pbcor        ia.pbcor(pbimage="(...)", outfile="pb_out.im", overwrite=false, box="", region={...}, chans="", stokes="", mask="", mode="divide", cutoff=-1.000000, stretch=false)
30-Sep-2026 20:01:54 2026-10-01 00:01:55        INFO        name::        No table opened.
30-Sep-2026 20:01:54 2026-10-01 00:01:55        INFO        showcache::        The Table Cache is empty.
30-Sep-2026 20:01:54 test_tool_image_pbcor.py::ia_pbcor_test::test_history
30-Sep-2026 20:01:54 Test history records are written
30-Sep-2026 20:01:54 PASSED
30-Sep-2026 20:01:54
30-Sep-2026 20:01:54 2026-10-01 00:01:55        INFO        FITSCoordinateUtil::fromFITSHeader        passing empty or nonexistant spectral Coordinate axis
30-Sep-2026 20:01:54 2026-10-01 00:01:55        INFO        ImageFactory::createImage        Created Paged image 'mult_pb.im' of shape [113, 76] with float valued pixels.
30-Sep-2026 20:01:54 2026-10-01 00:01:55        INFO        CasacRegionManager::fromBCS        No directional region specified. Using full positional plane.
30-Sep-2026 20:01:54 2026-10-01 00:01:55        INFO        CasacRegionManager::fromBCS        Using all spectral channels.
30-Sep-2026 20:01:54 2026-10-01 00:01:55        INFO        CasacRegionManager::fromBCS        Using polarizations ALL
30-Sep-2026 20:01:54 2026-10-01 00:01:55        INFO        ImageRegion::fromRecord        Selected bounding box :
30-Sep-2026 20:01:54 2026-10-01 00:01:55        INFO        ImageRegion::fromRecord+            [0, 0, 0, 0] to [112, 75, 4, 1]  (00:03:44.024, -00.38.00.046, 1.415e+09Hz, I to 23:56:15.977, +00.37.00.043, 1.415e+09Hz, Q)
30-Sep-2026 20:01:54 2026-10-01 00:01:55        INFO        ImageRegion::fromRecord        Selected bounding box :
30-Sep-2026 20:01:54 2026-10-01 00:01:55        INFO        ImageRegion::fromRecord+            [0, 0, 0, 0] to [112, 75, 4, 1]  (00:03:44.024, -00.38.00.046, 1.415e+09Hz, I to 23:56:15.977, +00.37.00.043, 1.415e+09Hz, Q)
30-Sep-2026 20:01:54 2026-10-01 00:01:55        INFO        SubImageFactory::createImage        Creating image 'mypb.im' of shape [113, 76, 5, 2]
30-Sep-2026 20:01:54 2026-10-01 00:01:55        INFO        ImageMaskAttacher::makeMask        Created mask `mask0'
30-Sep-2026 20:01:54 2026-10-01 00:01:55        INFO        ImageRegion::fromRecord        Selected bounding box :
30-Sep-2026 20:01:54 2026-10-01 00:01:55        INFO        ImageRegion::fromRecord+            [0, 0, 0, 0] to [112, 75, 0, 0]  (00:03:44.024, -00.38.00.046, 1.415e+09Hz, I to 23:56:15.977, +00.37.00.043, 1.415e+09Hz, I)
30-Sep-2026 20:01:54 2026-10-01 00:01:55        INFO        CasacRegionManager::fromBCS        No directional region specified. Using full positional plane.
30-Sep-2026 20:01:54 2026-10-01 00:01:55        INFO        CasacRegionManager::fromBCS        Using all spectral channels.
30-Sep-2026 20:01:54 2026-10-01 00:01:55        INFO        CasacRegionManager::fromBCS        Using polarizations ALL
30-Sep-2026 20:01:54 2026-10-01 00:01:55        INFO        ImageRegion::fromRecord        Selected bounding box :
30-Sep-2026 20:01:54 2026-10-01 00:01:55        INFO        ImageRegion::fromRecord+            [0, 0, 0, 0] to [112, 75, 4, 1]  (00:03:44.024, -00.38.00.046, 1.415e+09Hz, I to 23:56:15.977, +00.37.00.043, 1.415e+09Hz, Q)
30-Sep-2026 20:01:54 2026-10-01 00:01:55        INFO        ImageRegion::fromRecord        Selected bounding box :
30-Sep-2026 20:01:54 2026-10-01 00:01:55        INFO        ImageRegion::fromRecord+            [0, 0, 0, 0] to [112, 75, 4, 1]  (00:03:44.024, -00.38.00.046, 1.415e+09Hz, I to 23:56:15.977, +00.37.00.043, 1.415e+09Hz, Q)
30-Sep-2026 20:01:54 2026-10-01 00:01:55        INFO        SubImageFactory::createImage        Creating image 'mypb.im' of shape [113, 76, 5, 2]
30-Sep-2026 20:01:54 2026-10-01 00:01:55        INFO        ImageMaskAttacher::makeMask        Created mask `mask0'
30-Sep-2026 20:01:54 2026-10-01 00:01:55        INFO        name::        No table opened.
30-Sep-2026 20:01:54 2026-10-01 00:01:55        INFO        showcache::        The Table Cache is empty.
30-Sep-2026 20:01:54 test_tool_image_pbcor.py::ia_pbcor_test::test_multiply
30-Sep-2026 20:01:54 ia.pbcor: Test full image multiply with cutoff. Primary beam is 2 D, image is 4 D
30-Sep-2026 20:01:54 PASSED
30-Sep-2026 20:01:54
30-Sep-2026 20:01:54 2026-10-01 00:01:55        INFO        ImageFactory::createImage        Created Temp image  of shape [113, 76, 1, 1] with float valued pixels.
30-Sep-2026 20:01:54 2026-10-01 00:01:55        INFO        SubImageFactory::createImage        Creating image 'maskim' of shape [113, 76, 1, 1]
30-Sep-2026 20:01:54 2026-10-01 00:01:55        INFO        FITSCoordinateUtil::fromFITSHeader        passing empty or nonexistant spectral Coordinate axis
30-Sep-2026 20:01:54 2026-10-01 00:01:55        SEVERE        image::pbcor (file /private/var/folders/60/83wxljbx2vlfbx_hy0yfv8rc0000gn/T/build-via-sdist-hto6_n3j/casatools-6.7.7.7a14849.dev3/src/tools/image/image_cmpt.cc, line 4289)        Exception Reported: The input image shape ([113, 76, 5, 2]) and mask shape ([113, 76, 1, 1]) are different, and it was specified that the mask should not be extended, so the mask cannot be applied to the (sub)image. Specifying that the mask should be extended may resolve the issue at File: /Users/casaci/bamboohome/xml-data/build-dir/CASASPECS-DBC257-BPO15AP312/casa6/casatools/src/code/imageanalysis/ImageAnalysis/SubImageFactory.tcc, line: 306
30-Sep-2026 20:01:54 2026-10-01 00:01:55        WARN        image::open (file /private/var/folders/60/83wxljbx2vlfbx_hy0yfv8rc0000gn/T/build-via-sdist-hto6_n3j/casatools-6.7.7.7a14849.dev3/src/tools/image/image_cmpt.cc, line 4208)        Another image is already open, closing first
30-Sep-2026 20:01:54 2026-10-01 00:01:55        INFO        FITSCoordinateUtil::fromFITSHeader        passing empty or nonexistant spectral Coordinate axis
30-Sep-2026 20:01:54 2026-10-01 00:01:55        INFO        SubImageFactory::createImage        Creating image 'blahblah' of shape [113, 76, 5, 2]
30-Sep-2026 20:01:54 2026-10-01 00:01:55        INFO        ImageMaskAttacher::makeMask        Created mask `mask0'
30-Sep-2026 20:01:54 2026-10-01 00:01:55        INFO        name::        No table opened.
30-Sep-2026 20:01:54 2026-10-01 00:01:55        INFO        showcache::        The Table Cache is empty.
30-Sep-2026 20:01:54 test_tool_image_pbcor.py::ia_pbcor_test::test_stretch
30-Sep-2026 20:01:54 ia.pbcor(): Test stretch parameter
30-Sep-2026 20:01:54 PASSED
30-Sep-2026 20:01:54
30-Sep-2026 20:01:54 - generated xml file: /Users/casaci/bamboohome/xml-data/build-dir/CASASPECS-DEVTESTPY312147-TTOARM15P312/casa6/casatestutils/nosedir/xml/test_tool_image_pbcor/nose.xml -
30-Sep-2026 20:01:54 ========================= 9 passed, 1 warning in 1.64s =========================
30-Sep-2026 20:01:54
30-Sep-2026 20:01:54
30-Sep-2026 20:01:54 Setting Working Directory: /Users/casaci/bamboohome/xml-data/build-dir/CASASPECS-DEVTESTPY312147-TTOARM15P312/casa6/casatestutils/nosedir/test_tool_image_subimage/
30-Sep-2026 20:01:54 Test Directory: /Users/casaci/bamboohome/xml-data/build-dir/CASASPECS-DEVTESTPY312147-TTOARM15P312/casa6/casatestutils/nosedir/test_tool_image_subimage
30-Sep-2026 20:01:54
30-Sep-2026 20:01:54 Running Command: pytest --junitxml=/Users/casaci/bamboohome/xml-data/build-dir/CASASPECS-DEVTESTPY312147-TTOARM15P312/casa6/casatestutils/nosedir/xml/test_tool_image_subimage/nose.xml -s --disable-pytest-warnings --verbose -ra --tb=short /Users/casaci/bamboohome/xml-data/build-dir/CASASPECS-DEVTESTPY312147-TTOARM15P312/casa6/casatestutils/nosedir/test_tool_image_subimage/
30-Sep-2026 20:01:54
30-Sep-2026 20:01:54 Setting Working Directory: /Users/casaci/bamboohome/xml-data/build-dir/CASASPECS-DEVTESTPY312147-TTOARM15P312/casa6/casatestutils/nosedir/test_tool_image_regrid/
30-Sep-2026 20:01:54 Test Directory: /Users/casaci/bamboohome/xml-data/build-dir/CASASPECS-DEVTESTPY312147-TTOARM15P312/casa6/casatestutils/nosedir/test_tool_image_regrid
30-Sep-2026 20:01:54
30-Sep-2026 20:01:54 Running Command: pytest --junitxml=/Users/casaci/bamboohome/xml-data/build-dir/CASASPECS-DEVTESTPY312147-TTOARM15P312/casa6/casatestutils/nosedir/xml/test_tool_image_regrid/nose.xml -s --disable-pytest-warnings --verbose -ra --tb=short /Users/casaci/bamboohome/xml-data/build-dir/CASASPECS-DEVTESTPY312147-TTOARM15P312/casa6/casatestutils/nosedir/test_tool_image_regrid/
30-Sep-2026 20:01:54
30-Sep-2026 20:01:54 Setting Working Directory: /Users/casaci/bamboohome/xml-data/build-dir/CASASPECS-DEVTESTPY312147-TTOARM15P312/casa6/casatestutils/nosedir/test_tool_ms_createmultims/
30-Sep-2026 20:01:54 Test Directory: /Users/casaci/bamboohome/xml-data/build-dir/CASASPECS-DEVTESTPY312147-TTOARM15P312/casa6/casatestutils/nosedir/test_tool_ms_createmultims
30-Sep-2026 20:01:54
30-Sep-2026 20:01:54 Running Command: pytest --junitxml=/Users/casaci/bamboohome/xml-data/build-dir/CASASPECS-DEVTESTPY312147-TTOARM15P312/casa6/casatestutils/nosedir/xml/test_tool_ms_createmultims/nose.xml -s --disable-pytest-warnings --verbose -ra --tb=short /Users/casaci/bamboohome/xml-data/build-dir/CASASPECS-DEVTESTPY312147-TTOARM15P312/casa6/casatestutils/nosedir/test_tool_ms_createmultims/
30-Sep-2026 20:01:54
30-Sep-2026 20:01:54 Setting Working Directory: /Users/casaci/bamboohome/xml-data/build-dir/CASASPECS-DEVTESTPY312147-TTOARM15P312/casa6/casatestutils/nosedir/test_tool_vpmanager/
30-Sep-2026 20:01:54 Test Directory: /Users/casaci/bamboohome/xml-data/build-dir/CASASPECS-DEVTESTPY312147-TTOARM15P312/casa6/casatestutils/nosedir/test_tool_vpmanager
30-Sep-2026 20:01:54
30-Sep-2026 20:01:54 Running Command: pytest --junitxml=/Users/casaci/bamboohome/xml-data/build-dir/CASASPECS-DEVTESTPY312147-TTOARM15P312/casa6/casatestutils/nosedir/xml/test_tool_vpmanager/nose.xml -s --disable-pytest-warnings --verbose -ra --tb=short /Users/casaci/bamboohome/xml-data/build-dir/CASASPECS-DEVTESTPY312147-TTOARM15P312/casa6/casatestutils/nosedir/test_tool_vpmanager/
30-Sep-2026 20:01:54
30-Sep-2026 20:01:54 Setting Working Directory: /Users/casaci/bamboohome/xml-data/build-dir/CASASPECS-DEVTESTPY312147-TTOARM15P312/casa6/casatestutils/nosedir/test_tool_image_statistics/
30-Sep-2026 20:01:54 Test Directory: /Users/casaci/bamboohome/xml-data/build-dir/CASASPECS-DEVTESTPY312147-TTOARM15P312/casa6/casatestutils/nosedir/test_tool_image_statistics
30-Sep-2026 20:01:54
30-Sep-2026 20:01:54 Running Command: pytest --junitxml=/Users/casaci/bamboohome/xml-data/build-dir/CASASPECS-DEVTESTPY312147-TTOARM15P312/casa6/casatestutils/nosedir/xml/test_tool_image_statistics/nose.xml -s --disable-pytest-warnings --verbose -ra --tb=short /Users/casaci/bamboohome/xml-data/build-dir/CASASPECS-DEVTESTPY312147-TTOARM15P312/casa6/casatestutils/nosedir/test_tool_image_statistics/
30-Sep-2026 20:01:54
30-Sep-2026 20:01:54 Setting Working Directory: /Users/casaci/bamboohome/xml-data/build-dir/CASASPECS-DEVTESTPY312147-TTOARM15P312/casa6/casatestutils/nosedir/test_tool_ms/
30-Sep-2026 20:01:54 Test Directory: /Users/casaci/bamboohome/xml-data/build-dir/CASASPECS-DEVTESTPY312147-TTOARM15P312/casa6/casatestutils/nosedir/test_tool_ms
30-Sep-2026 20:01:54
30-Sep-2026 20:01:54 Running Command: pytest --junitxml=/Users/casaci/bamboohome/xml-data/build-dir/CASASPECS-DEVTESTPY312147-TTOARM15P312/casa6/casatestutils/nosedir/xml/test_tool_ms/nose.xml -s --disable-pytest-warnings --verbose -ra --tb=short /Users/casaci/bamboohome/xml-data/build-dir/CASASPECS-DEVTESTPY312147-TTOARM15P312/casa6/casatestutils/nosedir/test_tool_ms/
30-Sep-2026 20:01:54
30-Sep-2026 20:01:54 Setting Working Directory: /Users/casaci/bamboohome/xml-data/build-dir/CASASPECS-DEVTESTPY312147-TTOARM15P312/casa6/casatestutils/nosedir/test_tool_sdm_toms/
30-Sep-2026 20:01:54 Test Directory: /Users/casaci/bamboohome/xml-data/build-dir/CASASPECS-DEVTESTPY312147-TTOARM15P312/casa6/casatestutils/nosedir/test_tool_sdm_toms
30-Sep-2026 20:01:54
30-Sep-2026 20:01:54 Running Command: pytest --junitxml=/Users/casaci/bamboohome/xml-data/build-dir/CASASPECS-DEVTESTPY312147-TTOARM15P312/casa6/casatestutils/nosedir/xml/test_tool_sdm_toms/nose.xml -s --disable-pytest-warnings --verbose -ra --tb=short /Users/casaci/bamboohome/xml-data/build-dir/CASASPECS-DEVTESTPY312147-TTOARM15P312/casa6/casatestutils/nosedir/test_tool_sdm_toms/
30-Sep-2026 20:01:54
30-Sep-2026 20:01:54 Setting Working Directory: /Users/casaci/bamboohome/xml-data/build-dir/CASASPECS-DEVTESTPY312147-TTOARM15P312/casa6/casatestutils/nosedir/test_tool_image_deviation/
30-Sep-2026 20:01:54 Test Directory: /Users/casaci/bamboohome/xml-data/build-dir/CASASPECS-DEVTESTPY312147-TTOARM15P312/casa6/casatestutils/nosedir/test_tool_image_deviation
30-Sep-2026 20:01:54
30-Sep-2026 20:01:54 Running Command: pytest --junitxml=/Users/casaci/bamboohome/xml-data/build-dir/CASASPECS-DEVTESTPY312147-TTOARM15P312/casa6/casatestutils/nosedir/xml/test_tool_image_deviation/nose.xml -s --disable-pytest-warnings --verbose -ra --tb=short /Users/casaci/bamboohome/xml-data/build-dir/CASASPECS-DEVTESTPY312147-TTOARM15P312/casa6/casatestutils/nosedir/test_tool_image_deviation/
30-Sep-2026 20:01:54
30-Sep-2026 20:01:54 Setting Working Directory: /Users/casaci/bamboohome/xml-data/build-dir/CASASPECS-DEVTESTPY312147-TTOARM15P312/casa6/casatestutils/nosedir/test_tool_logsink/
30-Sep-2026 20:01:54 Test Directory: /Users/casaci/bamboohome/xml-data/build-dir/CASASPECS-DEVTESTPY312147-TTOARM15P312/casa6/casatestutils/nosedir/test_tool_logsink
30-Sep-2026 20:01:54
30-Sep-2026 20:01:54 Running Command: pytest --junitxml=/Users/casaci/bamboohome/xml-data/build-dir/CASASPECS-DEVTESTPY312147-TTOARM15P312/casa6/casatestutils/nosedir/xml/test_tool_logsink/nose.xml -s --disable-pytest-warnings --verbose -ra --tb=short /Users/casaci/bamboohome/xml-data/build-dir/CASASPECS-DEVTESTPY312147-TTOARM15P312/casa6/casatestutils/nosedir/test_tool_logsink/
30-Sep-2026 20:01:54
30-Sep-2026 20:01:54 Setting Working Directory: /Users/casaci/bamboohome/xml-data/build-dir/CASASPECS-DEVTESTPY312147-TTOARM15P312/casa6/casatestutils/nosedir/test_tool_ms_statwt/
30-Sep-2026 20:01:54 Test Directory: /Users/casaci/bamboohome/xml-data/build-dir/CASASPECS-DEVTESTPY312147-TTOARM15P312/casa6/casatestutils/nosedir/test_tool_ms_statwt
30-Sep-2026 20:01:54
30-Sep-2026 20:01:54 Running Command: pytest --junitxml=/Users/casaci/bamboohome/xml-data/build-dir/CASASPECS-DEVTESTPY312147-TTOARM15P312/casa6/casatestutils/nosedir/xml/test_tool_ms_statwt/nose.xml -s --disable-pytest-warnings --verbose -ra --tb=short /Users/casaci/bamboohome/xml-data/build-dir/CASASPECS-DEVTESTPY312147-TTOARM15P312/casa6/casatestutils/nosedir/test_tool_ms_statwt/
30-Sep-2026 20:01:54
30-Sep-2026 20:01:54 Setting Working Directory: /Users/casaci/bamboohome/xml-data/build-dir/CASASPECS-DEVTESTPY312147-TTOARM15P312/casa6/casatestutils/nosedir/test_tool_coordsys/
30-Sep-2026 20:01:54 Test Directory: /Users/casaci/bamboohome/xml-data/build-dir/CASASPECS-DEVTESTPY312147-TTOARM15P312/casa6/casatestutils/nosedir/test_tool_coordsys
30-Sep-2026 20:01:54
30-Sep-2026 20:01:54 Running Command: pytest --junitxml=/Users/casaci/bamboohome/xml-data/build-dir/CASASPECS-DEVTESTPY312147-TTOARM15P312/casa6/casatestutils/nosedir/xml/test_tool_coordsys/nose.xml -s --disable-pytest-warnings --verbose -ra --tb=short /Users/casaci/bamboohome/xml-data/build-dir/CASASPECS-DEVTESTPY312147-TTOARM15P312/casa6/casatestutils/nosedir/test_tool_coordsys/
30-Sep-2026 20:01:54
30-Sep-2026 20:01:54 Setting Working Directory: /Users/casaci/bamboohome/xml-data/build-dir/CASASPECS-DEVTESTPY312147-TTOARM15P312/casa6/casatestutils/nosedir/test_tool_msmetadata/
30-Sep-2026 20:01:54 Test Directory: /Users/casaci/bamboohome/xml-data/build-dir/CASASPECS-DEVTESTPY312147-TTOARM15P312/casa6/casatestutils/nosedir/test_tool_msmetadata
30-Sep-2026 20:01:54
30-Sep-2026 20:01:54 Running Command: pytest --junitxml=/Users/casaci/bamboohome/xml-data/build-dir/CASASPECS-DEVTESTPY312147-TTOARM15P312/casa6/casatestutils/nosedir/xml/test_tool_msmetadata/nose.xml -s --disable-pytest-warnings --verbose -ra --tb=short /Users/casaci/bamboohome/xml-data/build-dir/CASASPECS-DEVTESTPY312147-TTOARM15P312/casa6/casatestutils/nosedir/test_tool_msmetadata/
30-Sep-2026 20:01:54
30-Sep-2026 20:01:54 Setting Working Directory: /Users/casaci/bamboohome/xml-data/build-dir/CASASPECS-DEVTESTPY312147-TTOARM15P312/casa6/casatestutils/nosedir/test_tool_measures/
30-Sep-2026 20:01:54 Test Directory: /Users/casaci/bamboohome/xml-data/build-dir/CASASPECS-DEVTESTPY312147-TTOARM15P312/casa6/casatestutils/nosedir/test_tool_measures
30-Sep-2026 20:01:54
30-Sep-2026 20:01:54 Running Command: pytest --junitxml=/Users/casaci/bamboohome/xml-data/build-dir/CASASPECS-DEVTESTPY312147-TTOARM15P312/casa6/casatestutils/nosedir/xml/test_tool_measures/nose.xml -s --disable-pytest-warnings --verbose -ra --tb=short /Users/casaci/bamboohome/xml-data/build-dir/CASASPECS-DEVTESTPY312147-TTOARM15P312/casa6/casatestutils/nosedir/test_tool_measures/
30-Sep-2026 20:01:54
30-Sep-2026 20:01:54 Setting Working Directory: /Users/casaci/bamboohome/xml-data/build-dir/CASASPECS-DEVTESTPY312147-TTOARM15P312/casa6/casatestutils/nosedir/test_tool_synthesisutils/
30-Sep-2026 20:01:54 Test Directory: /Users/casaci/bamboohome/xml-data/build-dir/CASASPECS-DEVTESTPY312147-TTOARM15P312/casa6/casatestutils/nosedir/test_tool_synthesisutils
30-Sep-2026 20:01:54
30-Sep-2026 20:01:54 Running Command: pytest --junitxml=/Users/casaci/bamboohome/xml-data/build-dir/CASASPECS-DEVTESTPY312147-TTOARM15P312/casa6/casatestutils/nosedir/xml/test_tool_synthesisutils/nose.xml -s --disable-pytest-warnings --verbose -ra --tb=short /Users/casaci/bamboohome/xml-data/build-dir/CASASPECS-DEVTESTPY312147-TTOARM15P312/casa6/casatestutils/nosedir/test_tool_synthesisutils/
30-Sep-2026 20:01:54
30-Sep-2026 20:01:54 Setting Working Directory: /Users/casaci/bamboohome/xml-data/build-dir/CASASPECS-DEVTESTPY312147-TTOARM15P312/casa6/casatestutils/nosedir/test_tool_image/
30-Sep-2026 20:01:54 Test Directory: /Users/casaci/bamboohome/xml-data/build-dir/CASASPECS-DEVTESTPY312147-TTOARM15P312/casa6/casatestutils/nosedir/test_tool_image
30-Sep-2026 20:01:54
30-Sep-2026 20:01:54 Running Command: pytest --junitxml=/Users/casaci/bamboohome/xml-data/build-dir/CASASPECS-DEVTESTPY312147-TTOARM15P312/casa6/casatestutils/nosedir/xml/test_tool_image/nose.xml -s --disable-pytest-warnings --verbose -ra --tb=short /Users/casaci/bamboohome/xml-data/build-dir/CASASPECS-DEVTESTPY312147-TTOARM15P312/casa6/casatestutils/nosedir/test_tool_image/
30-Sep-2026 20:01:54
30-Sep-2026 20:01:54 Setting Working Directory: /Users/casaci/bamboohome/xml-data/build-dir/CASASPECS-DEVTESTPY312147-TTOARM15P312/casa6/casatestutils/nosedir/test_tool_msuvbinner/
30-Sep-2026 20:01:54 Test Directory: /Users/casaci/bamboohome/xml-data/build-dir/CASASPECS-DEVTESTPY312147-TTOARM15P312/casa6/casatestutils/nosedir/test_tool_msuvbinner
30-Sep-2026 20:01:54
30-Sep-2026 20:01:54 Running Command: pytest --junitxml=/Users/casaci/bamboohome/xml-data/build-dir/CASASPECS-DEVTESTPY312147-TTOARM15P312/casa6/casatestutils/nosedir/xml/test_tool_msuvbinner/nose.xml -s --disable-pytest-warnings --verbose -ra --tb=short /Users/casaci/bamboohome/xml-data/build-dir/CASASPECS-DEVTESTPY312147-TTOARM15P312/casa6/casatestutils/nosedir/test_tool_msuvbinner/
30-Sep-2026 20:01:54
30-Sep-2026 20:01:54 Setting Working Directory: /Users/casaci/bamboohome/xml-data/build-dir/CASASPECS-DEVTESTPY312147-TTOARM15P312/casa6/casatestutils/nosedir/test_tool_quanta/
30-Sep-2026 20:01:54 Test Directory: /Users/casaci/bamboohome/xml-data/build-dir/CASASPECS-DEVTESTPY312147-TTOARM15P312/casa6/casatestutils/nosedir/test_tool_quanta
30-Sep-2026 20:01:54
30-Sep-2026 20:01:54 Running Command: pytest --junitxml=/Users/casaci/bamboohome/xml-data/build-dir/CASASPECS-DEVTESTPY312147-TTOARM15P312/casa6/casatestutils/nosedir/xml/test_tool_quanta/nose.xml -s --disable-pytest-warnings --verbose -ra --tb=short /Users/casaci/bamboohome/xml-data/build-dir/CASASPECS-DEVTESTPY312147-TTOARM15P312/casa6/casatestutils/nosedir/test_tool_quanta/
30-Sep-2026 20:01:54
30-Sep-2026 20:01:54 Setting Working Directory: /Users/casaci/bamboohome/xml-data/build-dir/CASASPECS-DEVTESTPY312147-TTOARM15P312/casa6/casatestutils/nosedir/test_tool_image_pv/
30-Sep-2026 20:01:54 Test Directory: /Users/casaci/bamboohome/xml-data/build-dir/CASASPECS-DEVTESTPY312147-TTOARM15P312/casa6/casatestutils/nosedir/test_tool_image_pv
30-Sep-2026 20:01:54
30-Sep-2026 20:01:54 Running Command: pytest --junitxml=/Users/casaci/bamboohome/xml-data/build-dir/CASASPECS-DEVTESTPY312147-TTOARM15P312/casa6/casatestutils/nosedir/xml/test_tool_image_pv/nose.xml -s --disable-pytest-warnings --verbose -ra --tb=short /Users/casaci/bamboohome/xml-data/build-dir/CASASPECS-DEVTESTPY312147-TTOARM15P312/casa6/casatestutils/nosedir/test_tool_image_pv/
30-Sep-2026 20:01:54
30-Sep-2026 20:01:54 Setting Working Directory: /Users/casaci/bamboohome/xml-data/build-dir/CASASPECS-DEVTESTPY312147-TTOARM15P312/casa6/casatestutils/nosedir/test_tool_image_fitprofile/
30-Sep-2026 20:01:54 Test Directory: /Users/casaci/bamboohome/xml-data/build-dir/CASASPECS-DEVTESTPY312147-TTOARM15P312/casa6/casatestutils/nosedir/test_tool_image_fitprofile
30-Sep-2026 20:01:54
30-Sep-2026 20:01:54 Running Command: pytest --junitxml=/Users/casaci/bamboohome/xml-data/build-dir/CASASPECS-DEVTESTPY312147-TTOARM15P312/casa6/casatestutils/nosedir/xml/test_tool_image_fitprofile/nose.xml -s --disable-pytest-warnings --verbose -ra --tb=short /Users/casaci/bamboohome/xml-data/build-dir/CASASPECS-DEVTESTPY312147-TTOARM15P312/casa6/casatestutils/nosedir/test_tool_image_fitprofile/
30-Sep-2026 20:01:54
30-Sep-2026 20:01:54 Setting Working Directory: /Users/casaci/bamboohome/xml-data/build-dir/CASASPECS-DEVTESTPY312147-TTOARM15P312/casa6/casatestutils/nosedir/test_tool_image_rebin/
30-Sep-2026 20:01:54 Test Directory: /Users/casaci/bamboohome/xml-data/build-dir/CASASPECS-DEVTESTPY312147-TTOARM15P312/casa6/casatestutils/nosedir/test_tool_image_rebin
30-Sep-2026 20:01:54
30-Sep-2026 20:01:54 Running Command: pytest --junitxml=/Users/casaci/bamboohome/xml-data/build-dir/CASASPECS-DEVTESTPY312147-TTOARM15P312/casa6/casatestutils/nosedir/xml/test_tool_image_rebin/nose.xml -s --disable-pytest-warnings --verbose -ra --tb=short /Users/casaci/bamboohome/xml-data/build-dir/CASASPECS-DEVTESTPY312147-TTOARM15P312/casa6/casatestutils/nosedir/test_tool_image_rebin/
30-Sep-2026 20:01:54
30-Sep-2026 20:01:54 Setting Working Directory: /Users/casaci/bamboohome/xml-data/build-dir/CASASPECS-DEVTESTPY312147-TTOARM15P312/casa6/casatestutils/nosedir/test_tool_calanalysis/
30-Sep-2026 20:01:54 Test Directory: /Users/casaci/bamboohome/xml-data/build-dir/CASASPECS-DEVTESTPY312147-TTOARM15P312/casa6/casatestutils/nosedir/test_tool_calanalysis
30-Sep-2026 20:01:54
30-Sep-2026 20:01:54 Running Command: pytest --junitxml=/Users/casaci/bamboohome/xml-data/build-dir/CASASPECS-DEVTESTPY312147-TTOARM15P312/casa6/casatestutils/nosedir/xml/test_tool_calanalysis/nose.xml -s --disable-pytest-warnings --verbose -ra --tb=short /Users/casaci/bamboohome/xml-data/build-dir/CASASPECS-DEVTESTPY312147-TTOARM15P312/casa6/casatestutils/nosedir/test_tool_calanalysis/
30-Sep-2026 20:01:54
30-Sep-2026 20:01:54 Setting Working Directory: /Users/casaci/bamboohome/xml-data/build-dir/CASASPECS-DEVTESTPY312147-TTOARM15P312/casa6/casatestutils/nosedir/test_tool_linearmosaic/
30-Sep-2026 20:01:54 Test Directory: /Users/casaci/bamboohome/xml-data/build-dir/CASASPECS-DEVTESTPY312147-TTOARM15P312/casa6/casatestutils/nosedir/test_tool_linearmosaic
30-Sep-2026 20:01:54
30-Sep-2026 20:01:54 Running Command: pytest --junitxml=/Users/casaci/bamboohome/xml-data/build-dir/CASASPECS-DEVTESTPY312147-TTOARM15P312/casa6/casatestutils/nosedir/xml/test_tool_linearmosaic/nose.xml -s --disable-pytest-warnings --verbose -ra --tb=short /Users/casaci/bamboohome/xml-data/build-dir/CASASPECS-DEVTESTPY312147-TTOARM15P312/casa6/casatestutils/nosedir/test_tool_linearmosaic/
30-Sep-2026 20:01:54
30-Sep-2026 20:01:54 Setting Working Directory: /Users/casaci/bamboohome/xml-data/build-dir/CASASPECS-DEVTESTPY312147-TTOARM15P312/casa6/casatestutils/nosedir/test_tool_calibrater/
30-Sep-2026 20:01:54 Test Directory: /Users/casaci/bamboohome/xml-data/build-dir/CASASPECS-DEVTESTPY312147-TTOARM15P312/casa6/casatestutils/nosedir/test_tool_calibrater
30-Sep-2026 20:01:54
30-Sep-2026 20:01:54 Running Command: pytest --junitxml=/Users/casaci/bamboohome/xml-data/build-dir/CASASPECS-DEVTESTPY312147-TTOARM15P312/casa6/casatestutils/nosedir/xml/test_tool_calibrater/nose.xml -s --disable-pytest-warnings --verbose -ra --tb=short /Users/casaci/bamboohome/xml-data/build-dir/CASASPECS-DEVTESTPY312147-TTOARM15P312/casa6/casatestutils/nosedir/test_tool_calibrater/
30-Sep-2026 20:01:54
30-Sep-2026 20:01:54 Setting Working Directory: /Users/casaci/bamboohome/xml-data/build-dir/CASASPECS-DEVTESTPY312147-TTOARM15P312/casa6/casatestutils/nosedir/test_tool_image_pbcor/
30-Sep-2026 20:01:54 Test Directory: /Users/casaci/bamboohome/xml-data/build-dir/CASASPECS-DEVTESTPY312147-TTOARM15P312/casa6/casatestutils/nosedir/test_tool_image_pbcor
30-Sep-2026 20:01:54
30-Sep-2026 20:01:54 Running Command: pytest --junitxml=/Users/casaci/bamboohome/xml-data/build-dir/CASASPECS-DEVTESTPY312147-TTOARM15P312/casa6/casatestutils/nosedir/xml/test_tool_image_pbcor/nose.xml -s --disable-pytest-warnings --verbose -ra --tb=short /Users/casaci/bamboohome/xml-data/build-dir/CASASPECS-DEVTESTPY312147-TTOARM15P312/casa6/casatestutils/nosedir/test_tool_image_pbcor/
30-Sep-2026 20:01:54 Finished task 'Test wheel' with result: Success
30-Sep-2026 20:01:54 Starting task 'Parse tests' of type 'com.atlassian.bamboo.plugins.testresultparser:task.testresultparser.junit'
30-Sep-2026 20:01:54 Parsing test results under /Users/casaci/bamboohome/xml-data/build-dir/CASASPECS-DEVTESTPY312147-TTOARM15P312...
30-Sep-2026 20:01:55 Finished task 'Parse tests' with result: Success
30-Sep-2026 20:01:55
Substituting variable: ${bamboo.agentId} with 142606339
30-Sep-2026 20:01:55
Substituting variable: ${bamboo.agentId} with 142606339
30-Sep-2026 20:01:55 Starting task 'Upload wheels' of type 'com.atlassian.bamboo.plugins.scripttask:task.builder.script'
30-Sep-2026 20:01:55
Beginning to execute external process for build 'CASASPECS - Dev Test 3.12 - CAS-14849 - Test Tools macOS 15 Py3.12 #4 (CASASPECS-DEVTESTPY312147-TTOARM15P312-4)'
... running command line:
/Users/casaci/bamboohome/temp/CASASPECS-DEVTESTPY312147-TTOARM15P312-4-ScriptBuildTask-6983959543552277123.sh
... in: /Users/casaci/bamboohome/xml-data/build-dir/CASASPECS-DEVTESTPY312147-TTOARM15P312
30-Sep-2026 20:01:55 Cloning into 'casa-build-utils'...
30-Sep-2026 20:01:55 /Users/casaci/bamboohome/xml-data/build-dir/CASASPECS-DEVTESTPY312147-TTOARM15P312
30-Sep-2026 20:01:57 Collecting twine
30-Sep-2026 20:01:57   Using cached twine-6.2.0-py3-none-any.whl (42 kB)
30-Sep-2026 20:01:57 Collecting rich>=12.0.0
30-Sep-2026 20:01:57   Using cached rich-15.0.0-py3-none-any.whl (310 kB)
30-Sep-2026 20:01:57 Collecting requests>=2.20
30-Sep-2026 20:01:57   Using cached requests-2.32.5-py3-none-any.whl (64 kB)
30-Sep-2026 20:01:57 Collecting importlib-metadata>=3.6
30-Sep-2026 20:01:57   Using cached importlib_metadata-8.7.1-py3-none-any.whl (27 kB)
30-Sep-2026 20:01:57 Collecting rfc3986>=1.4.0
30-Sep-2026 20:01:57   Using cached rfc3986-2.0.0-py2.py3-none-any.whl (31 kB)
30-Sep-2026 20:01:57 Collecting requests-toolbelt!=0.9.0,>=0.8.0
30-Sep-2026 20:01:57   Using cached requests_toolbelt-1.0.0-py2.py3-none-any.whl (54 kB)
30-Sep-2026 20:01:57 Collecting packaging>=24.0
30-Sep-2026 20:01:57   Using cached packaging-26.3-py3-none-any.whl (129 kB)
30-Sep-2026 20:01:57 Collecting id
30-Sep-2026 20:01:57   Using cached id-1.6.1-py3-none-any.whl (14 kB)
30-Sep-2026 20:01:57 Collecting urllib3>=1.26.0
30-Sep-2026 20:01:57   Using cached urllib3-2.6.3-py3-none-any.whl (131 kB)
30-Sep-2026 20:01:57 Collecting keyring>=21.2.0
30-Sep-2026 20:01:57   Using cached keyring-25.7.0-py3-none-any.whl (39 kB)
30-Sep-2026 20:01:57 Collecting readme-renderer>=35.0
30-Sep-2026 20:01:57   Using cached readme_renderer-44.0-py3-none-any.whl (13 kB)
30-Sep-2026 20:01:57 Collecting zipp>=3.20
30-Sep-2026 20:01:57   Using cached zipp-3.23.1-py3-none-any.whl (10 kB)
30-Sep-2026 20:01:57 Collecting jaraco.functools
30-Sep-2026 20:01:57   Using cached jaraco_functools-4.4.0-py3-none-any.whl (10 kB)
30-Sep-2026 20:01:57 Collecting jaraco.classes
30-Sep-2026 20:01:57   Using cached jaraco.classes-3.4.0-py3-none-any.whl (6.8 kB)
30-Sep-2026 20:01:57 Collecting jaraco.context
30-Sep-2026 20:01:57   Using cached jaraco_context-6.1.1-py3-none-any.whl (7.0 kB)
30-Sep-2026 20:01:57 Collecting nh3>=0.2.14
30-Sep-2026 20:01:57   Using cached nh3-0.3.7-cp38-abi3-macosx_10_12_x86_64.macosx_11_0_arm64.macosx_10_12_universal2.whl (1.5 MB)
30-Sep-2026 20:01:57 Collecting docutils>=0.21.2
30-Sep-2026 20:01:57   Using cached docutils-0.23-py3-none-any.whl (634 kB)
30-Sep-2026 20:01:57 Collecting Pygments>=2.5.1
30-Sep-2026 20:01:57   Using cached pygments-2.21.0-py3-none-any.whl (1.3 MB)
30-Sep-2026 20:01:57 Collecting idna<4,>=2.5
30-Sep-2026 20:01:57   Using cached idna-3.20-py3-none-any.whl (69 kB)
30-Sep-2026 20:01:57 Collecting certifi>=2017.4.17
30-Sep-2026 20:01:57   Using cached certifi-2026.7.22-py3-none-any.whl (136 kB)
30-Sep-2026 20:01:58 Collecting charset_normalizer<4,>=2
30-Sep-2026 20:01:58   Using cached charset_normalizer-3.5.2-cp39-cp39-macosx_10_9_universal2.whl (374 kB)
30-Sep-2026 20:01:58 Collecting markdown-it-py>=2.2.0
30-Sep-2026 20:01:58   Using cached markdown_it_py-3.0.0-py3-none-any.whl (87 kB)
30-Sep-2026 20:01:58 Collecting mdurl~=0.1
30-Sep-2026 20:01:58   Using cached mdurl-0.1.2-py3-none-any.whl (10.0 kB)
30-Sep-2026 20:01:58 Collecting more-itertools
30-Sep-2026 20:01:58   Using cached more_itertools-10.8.0-py3-none-any.whl (69 kB)
30-Sep-2026 20:01:58 Collecting backports.tarfile
30-Sep-2026 20:01:58   Using cached backports.tarfile-1.2.0-py3-none-any.whl (30 kB)
30-Sep-2026 20:01:58 Installing collected packages: zipp, urllib3, more-itertools, mdurl, idna, charset-normalizer, certifi, backports.tarfile, requests, Pygments, nh3, markdown-it-py, jaraco.functools, jaraco.context, jaraco.classes, importlib-metadata, docutils, rich, rfc3986, requests-toolbelt, readme-renderer, packaging, keyring, id, twine
30-Sep-2026 20:01:59 Successfully installed Pygments-2.21.0 backports.tarfile-1.2.0 certifi-2026.7.22 charset-normalizer-3.5.2 docutils-0.23 id-1.6.1 idna-3.20 importlib-metadata-8.7.1 jaraco.classes-3.4.0 jaraco.context-6.1.1 jaraco.functools-4.4.0 keyring-25.7.0 markdown-it-py-3.0.0 mdurl-0.1.2 more-itertools-10.8.0 nh3-0.3.7 packaging-26.3 readme-renderer-44.0 requests-2.32.5 requests-toolbelt-1.0.0 rfc3986-2.0.0 rich-15.0.0 twine-6.2.0 urllib3-2.6.3 zipp-3.23.1
30-Sep-2026 20:01:59 WARNING: You are using pip version 21.2.4; however, version 26.0.1 is available.
30-Sep-2026 20:01:59 You should consider upgrading via the '/Users/casaci/bamboohome/xml-data/build-dir/CASASPECS-DEVTESTPY312147-TTOARM15P312/wheeldirectory/casa6testenv/bin/python3 -m pip install --upgrade pip' command.
30-Sep-2026 20:01:59 /Users/casaci/bamboohome/xml-data/build-dir/CASASPECS-DEVTESTPY312147-TTOARM15P312/wheeldirectory/casa6testenv/lib/python3.9/site-packages/urllib3/__init__.py:35: NotOpenSSLWarning: urllib3 v2 only supports OpenSSL 1.1.1+, currently the 'ssl' module is compiled with 'LibreSSL 2.8.3'. See: https://github.com/urllib3/urllib3/issues/3020
30-Sep-2026 20:01:59   warnings.warn(
30-Sep-2026 20:01:59 Uploading distributions to
30-Sep-2026 20:01:59 https://casa-pip.nrao.edu:443/repository/casa-dev-wheel/
30-Sep-2026 20:01:59 Uploading casatools-6.7.7.7a14849.dev3-cp312-cp312-macosx_15_0_arm64.whl
30-Sep-2026 20:01:59
30-Sep-2026 20:02:00   0% ━━━━━━━━━━━━━━━━━━━━━━━━━━━━━━━━━━━━━━━━ 0.0/72.1 MB • --:-- • ?
30-Sep-2026 20:02:00   8% ━━━╺━━━━━━━━━━━━━━━━━━━━━━━━━━━━━━━━━━━━ 6.0/72.1 MB • 00:01 • 79.7 MB/s
30-Sep-2026 20:02:00 16% ━━━━━━╸━━━━━━━━━━━━━━━━━━━━━━━━━━━━━━━━━ 11.8/72.1 MB • 00:01 • 63.3 MB/s
30-Sep-2026 20:02:00 21% ━━━━━━━━╺━━━━━━━━━━━━━━━━━━━━━━━━━━━━━━━ 15.1/72.1 MB • 00:02 • 52.4 MB/s
30-Sep-2026 20:02:00 25% ━━━━━━━━━━╺━━━━━━━━━━━━━━━━━━━━━━━━━━━━━ 18.1/72.1 MB • 00:02 • 47.7 MB/s
30-Sep-2026 20:02:00 29% ━━━━━━━━━━━╸━━━━━━━━━━━━━━━━━━━━━━━━━━━━ 20.9/72.1 MB • 00:02 • 37.3 MB/s
30-Sep-2026 20:02:00 35% ━━━━━━━━━━━━━━╺━━━━━━━━━━━━━━━━━━━━━━━━━ 25.3/72.1 MB • 00:02 • 31.7 MB/s
30-Sep-2026 20:02:00 40% ━━━━━━━━━━━━━━━╸━━━━━━━━━━━━━━━━━━━━━━━━ 28.6/72.1 MB • 00:02 • 35.5 MB/s
30-Sep-2026 20:02:00 44% ━━━━━━━━━━━━━━━━━╸━━━━━━━━━━━━━━━━━━━━━━ 31.6/72.1 MB • 00:02 • 31.9 MB/s
30-Sep-2026 20:02:01 48% ━━━━━━━━━━━━━━━━━━━╺━━━━━━━━━━━━━━━━━━━━ 34.4/72.1 MB • 00:02 • 28.3 MB/s
30-Sep-2026 20:02:01 52% ━━━━━━━━━━━━━━━━━━━━╸━━━━━━━━━━━━━━━━━━━ 37.5/72.1 MB • 00:02 • 30.2 MB/s
30-Sep-2026 20:02:01 59% ━━━━━━━━━━━━━━━━━━━━━━━╸━━━━━━━━━━━━━━━━ 42.5/72.1 MB • 00:01 • 34.0 MB/s
30-Sep-2026 20:02:01 63% ━━━━━━━━━━━━━━━━━━━━━━━━━╺━━━━━━━━━━━━━━ 45.1/72.1 MB • 00:01 • 32.7 MB/s
30-Sep-2026 20:02:01 67% ━━━━━━━━━━━━━━━━━━━━━━━━━━╸━━━━━━━━━━━━━ 48.0/72.1 MB • 00:01 • 31.5 MB/s
30-Sep-2026 20:02:01 73% ━━━━━━━━━━━━━━━━━━━━━━━━━━━━━╺━━━━━━━━━━ 52.9/72.1 MB • 00:01 • 30.8 MB/s
30-Sep-2026 20:02:01 77% ━━━━━━━━━━━━━━━━━━━━━━━━━━━━━━╸━━━━━━━━━ 55.8/72.1 MB • 00:01 • 32.7 MB/s
30-Sep-2026 20:02:01 81% ━━━━━━━━━━━━━━━━━━━━━━━━━━━━━━━━╺━━━━━━━ 58.6/72.1 MB • 00:01 • 30.7 MB/s
30-Sep-2026 20:02:01 88% ━━━━━━━━━━━━━━━━━━━━━━━━━━━━━━━━━━━╺━━━━ 63.2/72.1 MB • 00:01 • 33.0 MB/s
30-Sep-2026 20:02:02 92% ━━━━━━━━━━━━━━━━━━━━━━━━━━━━━━━━━━━━╸━━━ 66.4/72.1 MB • 00:01 • 32.9 MB/s
30-Sep-2026 20:02:02 96% ━━━━━━━━━━━━━━━━━━━━━━━━━━━━━━━━━━━━━━╺━ 69.4/72.1 MB • 00:01 • 32.8 MB/s
30-Sep-2026 20:02:02 100% ━━━━━━━━━━━━━━━━━━━━━━━━━━━━━━━━━━━━━━━━ 72.1/72.1 MB • 00:02 • 29.3 MB/s
30-Sep-2026 20:02:02 100% ━━━━━━━━━━━━━━━━━━━━━━━━━━━━━━━━━━━━━━━━ 72.1/72.1 MB • 00:02 • 29.3 MB/s
30-Sep-2026 20:02:02 100% ━━━━━━━━━━━━━━━━━━━━━━━━━━━━━━━━━━━━━━━━ 72.1/72.1 MB • 00:02 • 29.3 MB/s
30-Sep-2026 20:02:02 100% ━━━━━━━━━━━━━━━━━━━━━━━━━━━━━━━━━━━━━━━━ 72.1/72.1 MB • 00:02 • 29.3 MB/s
30-Sep-2026 20:02:02 100% ━━━━━━━━━━━━━━━━━━━━━━━━━━━━━━━━━━━━━━━━ 72.1/72.1 MB • 00:02 • 29.3 MB/s
30-Sep-2026 20:02:02 /Users/casaci/bamboohome/xml-data/build-dir/CASASPECS-DEVTESTPY312147-TTOARM15P312
30-Sep-2026 20:02:02 Finished task 'Upload wheels' with result: Success
30-Sep-2026 20:02:02 Running post build plugin 'Docker Container Cleanup'
30-Sep-2026 20:02:02 Running post build plugin 'NCover Results Collector'
30-Sep-2026 20:02:02 Running post build plugin 'Build Results Label Collector'
30-Sep-2026 20:02:02 Running post build plugin 'Clover Results Collector'
30-Sep-2026 20:02:02 Running post build plugin 'npm Cache Cleanup'
30-Sep-2026 20:02:02 Running post build plugin 'Artifact Copier'
30-Sep-2026 20:02:02 Finalising the build...
30-Sep-2026 20:02:02 Stopping timer.
30-Sep-2026 20:02:02 Build CASASPECS-DEVTESTPY312147-TTOARM15P312-4 completed.
30-Sep-2026 20:02:02 Running on server: post build plugin 'Build Hanging Detection Configuration'
30-Sep-2026 20:02:02 Running on server: post build plugin 'NCover Results Collector'
30-Sep-2026 20:02:02 Running on server: post build plugin 'Build Labeller'
30-Sep-2026 20:02:02 Running on server: post build plugin 'Clover Delta Calculator'
30-Sep-2026 20:02:02 Running on server: post build plugin 'Maven Dependencies Postprocessor'
30-Sep-2026 20:02:02 All post build plugins have finished
30-Sep-2026 20:02:02 Generating build results summary...
30-Sep-2026 20:02:03 Saving build results to disk...
30-Sep-2026 20:02:03 Store variable context...
30-Sep-2026 20:02:03 Finished building CASASPECS-DEVTESTPY312147-TTOARM15P312-4.