Build: #4 failed

Job: Test Tasks Many Linux 2.28 Py3.12 failed

Build log

The build generated 582 lines of output. Download or view full build log.

30-Sep-2026 19:50:14 Build CASASPECS - Dev Test 3.12 - CAS-14849 - Test Tasks Many Linux 2.28 Py3.12 #4 (CASASPECS-DEVTESTPY312147-TTM228PY312-4) is being prepared for building on agent casaci-4.cv.nrao.edu, bamboo version: 9.6.26
30-Sep-2026 19:50:14 Remote agent on host casaci-4.cv.nrao.edu
30-Sep-2026 19:50:14 Build working directory is /opt/ci_workspace/casa/bamboo/agent6/xml-data/build-dir/CASASPECS-DEVTESTPY312147-TTM228PY312
30-Sep-2026 19:50:14 Executing build CASASPECS - Dev Test 3.12 - CAS-14849 - Test Tasks Many Linux 2.28 Py3.12 #4 (CASASPECS-DEVTESTPY312147-TTM228PY312-4)
30-Sep-2026 19:50:14 Starting task 'Source Code Checkout' of type 'com.atlassian.bamboo.plugins.vcs:task.vcs.checkout'
30-Sep-2026 19:50:14 Build always requires a clean checkout
30-Sep-2026 19:50:14 Cleaning build directory '/opt/ci_workspace/casa/bamboo/agent6/xml-data/build-dir/CASASPECS-DEVTESTPY312147-TTM228PY312'
30-Sep-2026 19:50:14 Checking out into /opt/ci_workspace/casa/bamboo/agent6/xml-data/build-dir/CASASPECS-DEVTESTPY312147-TTM228PY312
30-Sep-2026 19:50:14 Updating source code to revision: 0162b0f21d9253a10cd8a3ebc52b074f3465cdd1
30-Sep-2026 19:50:14 Fetching 'refs/heads/CAS-14849' from 'ssh://git@open-bitbucket.nrao.edu:7999/casa/casa6.git'.
30-Sep-2026 19:50:14 Warning: Permanently added '[127.0.0.1]:42831' (RSA) to the list of known hosts.
30-Sep-2026 19:50:14 X11 forwarding request failed on channel 0
30-Sep-2026 19:50:15 Checking out revision 0162b0f21d9253a10cd8a3ebc52b074f3465cdd1.
30-Sep-2026 19:50:15 Creating local git repository in '/opt/ci_workspace/casa/bamboo/agent6/xml-data/build-dir/CASASPECS-DEVTESTPY312147-TTM228PY312/.git'.
30-Sep-2026 19:50:15 Cloning into '/opt/ci_workspace/casa/bamboo/agent6/xml-data/build-dir/CASASPECS-DEVTESTPY312147-TTM228PY312'...
30-Sep-2026 19:50:15 done.
30-Sep-2026 19:50:16 Switched to a new branch 'CAS-14849'
30-Sep-2026 19:50:16 branch 'CAS-14849' set up to track 'origin/CAS-14849'.
30-Sep-2026 19:50:17 Submodule 'casatools/casacore' (https://github.com/casacore/casacore.git) registered for path 'casatools/casacore'
30-Sep-2026 19:50:17 Submodule 'casatools/grpc-source' (https://github.com/grpc/grpc) registered for path 'casatools/grpc-source'
30-Sep-2026 19:50:17 Cloning into '/opt/ci_workspace/casa/bamboo/agent6/xml-data/build-dir/CASASPECS-DEVTESTPY312147-TTM228PY312/casatools/casacore'...
30-Sep-2026 19:50:24 Cloning into '/opt/ci_workspace/casa/bamboo/agent6/xml-data/build-dir/CASASPECS-DEVTESTPY312147-TTM228PY312/casatools/grpc-source'...
30-Sep-2026 19:50:42 Submodule path 'casatools/casacore': checked out 'aaf72eb7edd5a5fecefa78ca04713233b7b6ffd6'
30-Sep-2026 19:50:42 Submodule path 'casatools/grpc-source': checked out 'cca868ac8f3641df4003a82b7fc54c921e14f765'
30-Sep-2026 19:50:42 Submodule 'third_party/abseil-cpp' (https://github.com/abseil/abseil-cpp) registered for path 'casatools/grpc-source/third_party/abseil-cpp'
30-Sep-2026 19:50:42 Submodule 'third_party/benchmark' (https://github.com/google/benchmark) registered for path 'casatools/grpc-source/third_party/benchmark'
30-Sep-2026 19:50:42 Submodule 'third_party/bloaty' (https://github.com/google/bloaty.git) registered for path 'casatools/grpc-source/third_party/bloaty'
30-Sep-2026 19:50:42 Submodule 'third_party/boringssl' (https://github.com/google/boringssl.git) registered for path 'casatools/grpc-source/third_party/boringssl'
30-Sep-2026 19:50:42 Submodule 'third_party/boringssl-with-bazel' (https://github.com/google/boringssl.git) registered for path 'casatools/grpc-source/third_party/boringssl-with-bazel'
30-Sep-2026 19:50:42 Submodule 'third_party/cares/cares' (https://github.com/c-ares/c-ares.git) registered for path 'casatools/grpc-source/third_party/cares/cares'
30-Sep-2026 19:50:42 Submodule 'third_party/gflags' (https://github.com/gflags/gflags.git) registered for path 'casatools/grpc-source/third_party/gflags'
30-Sep-2026 19:50:42 Submodule 'third_party/googletest' (https://github.com/google/googletest.git) registered for path 'casatools/grpc-source/third_party/googletest'
30-Sep-2026 19:50:42 Submodule 'third_party/protobuf' (https://github.com/google/protobuf.git) registered for path 'casatools/grpc-source/third_party/protobuf'
30-Sep-2026 19:50:42 Submodule 'third_party/zlib' (https://github.com/madler/zlib) registered for path 'casatools/grpc-source/third_party/zlib'
30-Sep-2026 19:50:42 Cloning into '/opt/ci_workspace/casa/bamboo/agent6/xml-data/build-dir/CASASPECS-DEVTESTPY312147-TTM228PY312/casatools/grpc-source/third_party/abseil-cpp'...
30-Sep-2026 19:50:43 Cloning into '/opt/ci_workspace/casa/bamboo/agent6/xml-data/build-dir/CASASPECS-DEVTESTPY312147-TTM228PY312/casatools/grpc-source/third_party/benchmark'...
30-Sep-2026 19:50:44 Cloning into '/opt/ci_workspace/casa/bamboo/agent6/xml-data/build-dir/CASASPECS-DEVTESTPY312147-TTM228PY312/casatools/grpc-source/third_party/bloaty'...
30-Sep-2026 19:50:44 Cloning into '/opt/ci_workspace/casa/bamboo/agent6/xml-data/build-dir/CASASPECS-DEVTESTPY312147-TTM228PY312/casatools/grpc-source/third_party/boringssl'...
30-Sep-2026 19:50:53 Cloning into '/opt/ci_workspace/casa/bamboo/agent6/xml-data/build-dir/CASASPECS-DEVTESTPY312147-TTM228PY312/casatools/grpc-source/third_party/boringssl-with-bazel'...
30-Sep-2026 19:51:02 Cloning into '/opt/ci_workspace/casa/bamboo/agent6/xml-data/build-dir/CASASPECS-DEVTESTPY312147-TTM228PY312/casatools/grpc-source/third_party/cares/cares'...
30-Sep-2026 19:51:03 Cloning into '/opt/ci_workspace/casa/bamboo/agent6/xml-data/build-dir/CASASPECS-DEVTESTPY312147-TTM228PY312/casatools/grpc-source/third_party/gflags'...
30-Sep-2026 19:51:04 Cloning into '/opt/ci_workspace/casa/bamboo/agent6/xml-data/build-dir/CASASPECS-DEVTESTPY312147-TTM228PY312/casatools/grpc-source/third_party/googletest'...
30-Sep-2026 19:51:05 Cloning into '/opt/ci_workspace/casa/bamboo/agent6/xml-data/build-dir/CASASPECS-DEVTESTPY312147-TTM228PY312/casatools/grpc-source/third_party/protobuf'...
30-Sep-2026 19:51:13 Cloning into '/opt/ci_workspace/casa/bamboo/agent6/xml-data/build-dir/CASASPECS-DEVTESTPY312147-TTM228PY312/casatools/grpc-source/third_party/zlib'...
30-Sep-2026 19:51:13 Submodule path 'casatools/grpc-source/third_party/abseil-cpp': checked out 'cc4bed2d74f7c8717e31f9579214ab52a9c9c610'
30-Sep-2026 19:51:13 Submodule path 'casatools/grpc-source/third_party/benchmark': checked out '5b7683f49e1e9223cf9927b24f6fd3d6bd82e3f8'
30-Sep-2026 19:51:13 Submodule path 'casatools/grpc-source/third_party/bloaty': checked out '73594cde8c9a52a102c4341c244c833aa61b9c06'
30-Sep-2026 19:51:13 Submodule 'third_party/googletest' (https://github.com/google/googletest.git) registered for path 'casatools/grpc-source/third_party/bloaty/third_party/googletest'
30-Sep-2026 19:51:13 Submodule 'third_party/libFuzzer' (https://chromium.googlesource.com/chromium/llvm-project/llvm/lib/Fuzzer) registered for path 'casatools/grpc-source/third_party/bloaty/third_party/libFuzzer'
30-Sep-2026 19:51:13 Submodule 'third_party/re2' (https://github.com/google/re2) registered for path 'casatools/grpc-source/third_party/bloaty/third_party/re2'
30-Sep-2026 19:51:13 Cloning into '/opt/ci_workspace/casa/bamboo/agent6/xml-data/build-dir/CASASPECS-DEVTESTPY312147-TTM228PY312/casatools/grpc-source/third_party/bloaty/third_party/googletest'...
30-Sep-2026 19:51:14 Cloning into '/opt/ci_workspace/casa/bamboo/agent6/xml-data/build-dir/CASASPECS-DEVTESTPY312147-TTM228PY312/casatools/grpc-source/third_party/bloaty/third_party/libFuzzer'...
30-Sep-2026 19:51:15 Cloning into '/opt/ci_workspace/casa/bamboo/agent6/xml-data/build-dir/CASASPECS-DEVTESTPY312147-TTM228PY312/casatools/grpc-source/third_party/bloaty/third_party/re2'...
30-Sep-2026 19:51:15 Submodule path 'casatools/grpc-source/third_party/bloaty/third_party/googletest': checked out 'a2b8a8e07628e5fd60644b6dd99c1b5e7d7f1f47'
30-Sep-2026 19:51:15 Submodule path 'casatools/grpc-source/third_party/bloaty/third_party/libFuzzer': checked out '1b543d6e5073b56be214394890c9193979a3d7e1'
30-Sep-2026 19:51:15 Submodule path 'casatools/grpc-source/third_party/bloaty/third_party/re2': checked out 'c964d9b07816f9b52ca692e23b8b3dba33beec54'
30-Sep-2026 19:51:15 Submodule path 'casatools/grpc-source/third_party/boringssl': checked out 'be2ee342d3781ddb954f91f8a7e660c6f59e87e5'
30-Sep-2026 19:51:16 Submodule path 'casatools/grpc-source/third_party/boringssl-with-bazel': checked out '886e7d75368e3f4fab3f4d0d3584e4abfc557755'
30-Sep-2026 19:51:16 Submodule path 'casatools/grpc-source/third_party/cares/cares': checked out '3be1924221e1326df520f8498d704a5c4c8d0cce'
30-Sep-2026 19:51:16 Submodule path 'casatools/grpc-source/third_party/gflags': checked out '30dbc81fb5ffdc98ea9b14b1918bfe4e8779b26e'
30-Sep-2026 19:51:16 Submodule 'doc' (https://github.com/gflags/gflags.git) registered for path 'casatools/grpc-source/third_party/gflags/doc'
30-Sep-2026 19:51:16 Cloning into '/opt/ci_workspace/casa/bamboo/agent6/xml-data/build-dir/CASASPECS-DEVTESTPY312147-TTM228PY312/casatools/grpc-source/third_party/gflags/doc'...
30-Sep-2026 19:51:16 Submodule path 'casatools/grpc-source/third_party/gflags/doc': checked out '971dd2a4fadac9cdab174c523c22df79efd63aa5'
30-Sep-2026 19:51:16 Submodule path 'casatools/grpc-source/third_party/googletest': checked out 'ec44c6c1675c25b9827aacd08c02433cccde7780'
30-Sep-2026 19:51:16 Submodule path 'casatools/grpc-source/third_party/protobuf': checked out '2761122b810fe8861004ae785cc3ab39f384d342'
30-Sep-2026 19:51:16 Submodule 'third_party/benchmark' (https://github.com/google/benchmark.git) registered for path 'casatools/grpc-source/third_party/protobuf/third_party/benchmark'
30-Sep-2026 19:51:16 Cloning into '/opt/ci_workspace/casa/bamboo/agent6/xml-data/build-dir/CASASPECS-DEVTESTPY312147-TTM228PY312/casatools/grpc-source/third_party/protobuf/third_party/benchmark'...
30-Sep-2026 19:51:17 Submodule path 'casatools/grpc-source/third_party/protobuf/third_party/benchmark': checked out '360e66c1c4777c99402cf8cd535aa510fee16573'
30-Sep-2026 19:51:17 Submodule path 'casatools/grpc-source/third_party/zlib': checked out 'cacf7f1d4e3d44d871b605da3b647f07d718623f'
30-Sep-2026 19:51:17 Updated source code to revision: 0162b0f21d9253a10cd8a3ebc52b074f3465cdd1
30-Sep-2026 19:51:17 Finished task 'Source Code Checkout' with result: Success
30-Sep-2026 19:51:17 Running pre-build action: Build Log Labeller Pre Build Action
30-Sep-2026 19:51:17 Running pre-build action: VCS Version Collector
30-Sep-2026 19:51:17 Build CASASPECS - Dev Test 3.12 - CAS-14849 - Test Tasks Many Linux 2.28 Py3.12 #4 (CASASPECS-DEVTESTPY312147-TTM228PY312-4) started building on agent 'casaci-4.cv.nrao.edu' (Remote agent on host casaci-4.cv.nrao.edu)
30-Sep-2026 19:51:17 Starting task 'Update data' of type 'com.atlassian.bamboo.plugins.scripttask:task.builder.script'
30-Sep-2026 19:51:17
Beginning to execute external process for build 'CASASPECS - Dev Test 3.12 - CAS-14849 - Test Tasks Many Linux 2.28 Py3.12 #4 (CASASPECS-DEVTESTPY312147-TTM228PY312-4)'
... running command line:
/opt/ci_workspace/casa/bamboo/agent6/temp/CASASPECS-DEVTESTPY312147-TTM228PY312-4-ScriptBuildTask-12692724559957989268.sh
... in: /opt/ci_workspace/casa/bamboo/agent6/xml-data/build-dir/CASASPECS-DEVTESTPY312147-TTM228PY312
30-Sep-2026 19:51:18 Already up to date.
30-Sep-2026 19:51:18 /opt/ci_workspace/casa/bamboo/agent6/temp/CASASPECS-DEVTESTPY312147-TTM228PY312-4-ScriptBuildTask-12692724559957989268.sh: line 2: cd: /opt/casa/data/casa-data-req: No such file or directory
30-Sep-2026 19:51:18 Already up to date.
30-Sep-2026 19:51:18 Data update complete
30-Sep-2026 19:51:18 Finished task 'Update data' with result: Success
30-Sep-2026 19:51:18
Substituting variable: ${bamboo.repository.branch.name} with CAS-14849
30-Sep-2026 19:51:18 Starting task 'Create wheeldirectory' of type 'com.atlassian.bamboo.plugins.scripttask:task.builder.script'
30-Sep-2026 19:51:18
Beginning to execute external process for build 'CASASPECS - Dev Test 3.12 - CAS-14849 - Test Tasks Many Linux 2.28 Py3.12 #4 (CASASPECS-DEVTESTPY312147-TTM228PY312-4)'
... running command line:
/opt/ci_workspace/casa/bamboo/agent6/temp/CASASPECS-DEVTESTPY312147-TTM228PY312-4-ScriptBuildTask-10740866196168883025.sh
... in: /opt/ci_workspace/casa/bamboo/agent6/xml-data/build-dir/CASASPECS-DEVTESTPY312147-TTM228PY312
30-Sep-2026 19:51:18 Finished task 'Create wheeldirectory' with result: Success
30-Sep-2026 19:51:18 Starting task 'Get latest wheel' of type 'com.atlassian.bamboo.plugins.bamboo-artifact-downloader-plugin:artifactdownloadertask'
30-Sep-2026 19:51:18 Preparing to download plan result CASASPECS-DBC257-4 artifact: Non required shared artifact Http Compression On : [ManyLinux228 Python 3.12 Casatestutils], patterns: [casatestutils*.whl] anchored at: [source/wheels]
30-Sep-2026 19:51:18 Retrieving artifact ManyLinux228 Python 3.12 Casatestutils for CASASPECS-DBC257-4 using Bamboo server artifact handler
30-Sep-2026 19:51:18 Artifact [ManyLinux228 Python 3.12 Casatestutils] downloaded successfully in 38.20 ms to wheeldirectory/
30-Sep-2026 19:51:18 Preparing to download plan result CASASPECS-DBC257-4 artifact: Non required shared artifact Http Compression On : [ManyLinux228 Python 3.12 Tool wheel], patterns: [casatools*.whl] anchored at: [source/wheels]
30-Sep-2026 19:51:18 Retrieving artifact ManyLinux228 Python 3.12 Tool wheel for CASASPECS-DBC257-4 using Bamboo server artifact handler
30-Sep-2026 19:51:22 Artifact [ManyLinux228 Python 3.12 Tool wheel] downloaded successfully in 3.732 s to wheeldirectory/
30-Sep-2026 19:51:22 Preparing to download plan result CASASPECS-DBC257-4 artifact: Non required shared artifact Http Compression On : [ManyLinux228 Python 3.12 Task wheel], patterns: [casatasks*.whl] anchored at: [source/wheels]
30-Sep-2026 19:51:22 Retrieving artifact ManyLinux228 Python 3.12 Task wheel for CASASPECS-DBC257-4 using Bamboo server artifact handler
30-Sep-2026 19:51:22 Artifact [ManyLinux228 Python 3.12 Task wheel] downloaded successfully in 72.55 ms to wheeldirectory/
30-Sep-2026 19:51:22 Finished task 'Get latest wheel' with result: Success
30-Sep-2026 19:51:22
Substituting variable: ${bamboo.agentId} with 153550854
30-Sep-2026 19:51:22
Substituting variable: ${bamboo.agentId} with 153550854
30-Sep-2026 19:51:22
Substituting variable: ${bamboo.agentId} with 153550854
30-Sep-2026 19:51:22 Starting task 'Stop and remove running wheel-container-test' of type 'com.atlassian.bamboo.plugins.scripttask:task.builder.script'
30-Sep-2026 19:51:22
Beginning to execute external process for build 'CASASPECS - Dev Test 3.12 - CAS-14849 - Test Tasks Many Linux 2.28 Py3.12 #4 (CASASPECS-DEVTESTPY312147-TTM228PY312-4)'
... running command line:
/opt/ci_workspace/casa/bamboo/agent6/temp/CASASPECS-DEVTESTPY312147-TTM228PY312-4-ScriptBuildTask-13114094043787180809.sh
... in: /opt/ci_workspace/casa/bamboo/agent6/xml-data/build-dir/CASASPECS-DEVTESTPY312147-TTM228PY312
30-Sep-2026 19:51:22 Error response from daemon: No such container: wheel-container-test_153550854
30-Sep-2026 19:51:22 Error response from daemon: No such container: wheel-container-test_153550854
30-Sep-2026 19:51:22 Removed wheel-container-test_153550854
30-Sep-2026 19:51:22 Finished task 'Stop and remove running wheel-container-test' with result: Success
30-Sep-2026 19:51:22
Substituting variable: ${bamboo.working.directory} with /opt/ci_workspace/casa/bamboo/agent6/xml-data/build-dir/CASASPECS-DEVTESTPY312147-TTM228PY312
30-Sep-2026 19:51:22
Substituting variable: ${bamboo.agentId} with 153550854
30-Sep-2026 19:51:22 Starting task 'Start container' of type 'com.atlassian.bamboo.plugins.bamboo-docker-plugin:task.docker.cli'
30-Sep-2026 19:51:22 Running image name (casa-docker.nrao.edu:5000/casa-test-rocky-8.10:4)
30-Sep-2026 19:51:22
Beginning to execute external process for build 'CASASPECS - Dev Test 3.12 - CAS-14849 - Test Tasks Many Linux 2.28 Py3.12 #4 (CASASPECS-DEVTESTPY312147-TTM228PY312-4)'
... running command line:
/usr/bin/docker run --volume /opt/ci_workspace/casa/bamboo/agent6/xml-data/build-dir/CASASPECS-DEVTESTPY312147-TTM228PY312/wheeldirectory:/wheeldirectory --volume /opt/casa/data:/opt/casa/data --detach --cpus=8 --memory=64g --name wheel-container-test_153550854 casa-docker.nrao.edu:5000/casa-test-rocky-8.10:4 tail -f /dev/null
... in: /opt/ci_workspace/casa/bamboo/agent6/xml-data/build-dir/CASASPECS-DEVTESTPY312147-TTM228PY312
30-Sep-2026 19:51:23 9e67fd5b2def7b911c2bc8f2b355e7cf17668fefb97f30fb015f6c7ecad78544
30-Sep-2026 19:51:23 Finished task 'Start container' with result: Success
30-Sep-2026 19:51:23
Substituting variable: ${bamboo.agentId} with 153550854
30-Sep-2026 19:51:23
Substituting variable: ${bamboo.planRepository.branchName} with CAS-14849
30-Sep-2026 19:51:23 Starting task 'Test wheel' of type 'com.atlassian.bamboo.plugins.scripttask:task.builder.script'
30-Sep-2026 19:51:23
Beginning to execute external process for build 'CASASPECS - Dev Test 3.12 - CAS-14849 - Test Tasks Many Linux 2.28 Py3.12 #4 (CASASPECS-DEVTESTPY312147-TTM228PY312-4)'
... running command line:
/opt/ci_workspace/casa/bamboo/agent6/temp/CASASPECS-DEVTESTPY312147-TTM228PY312-4-ScriptBuildTask-3523404585898767558.sh
... in: /opt/ci_workspace/casa/bamboo/agent6/xml-data/build-dir/CASASPECS-DEVTESTPY312147-TTM228PY312
30-Sep-2026 19:51:23 branch: CAS-14849
30-Sep-2026 19:51:23 Python version: 3.12
30-Sep-2026 19:51:23   % Total    % Received % Xferd  Average Speed   Time    Time     Time  Current
30-Sep-2026 19:51:23                                  Dload  Upload   Total   Spent    Left  Speed
30-Sep-2026 19:51:23
30-Sep-2026 19:51:23   0     0    0     0    0     0      0      0 --:--:-- --:--:-- --:--:--     0
30-Sep-2026 19:51:23 100 6002k  100 6002k    0     0  59.2M      0 --:--:-- --:--:-- --:--:-- 59.2M
30-Sep-2026 19:51:23 bamboo_jira_components:''
30-Sep-2026 19:51:23 bamboo_testlist:''
30-Sep-2026 19:51:24 Ticket components:  -j "casaconfig"
30-Sep-2026 19:51:24 datapath=[ "/opt/casa/data/master", "/opt/casa/data/casatestdata" ]
30-Sep-2026 19:51:24 measurespath="/opt/casa/data/master"
30-Sep-2026 19:51:24 measures_auto_update=False
30-Sep-2026 19:51:24 data_auto_update=False
30-Sep-2026 19:51:24 Ticket fix version: CASA 6.ACTIVE
30-Sep-2026 19:51:24 No matching version found
30-Sep-2026 19:51:24 datapath=[ "/opt/casa/data/master", "/opt/casa/data/casatestdata" ]
30-Sep-2026 19:51:24 measurespath="/opt/casa/data/master"
30-Sep-2026 19:51:24 measures_auto_update=False
30-Sep-2026 19:51:24 data_auto_update=False
30-Sep-2026 19:52:39 branch 'CAS-14849' set up to track 'origin/CAS-14849'.
30-Sep-2026 19:52:39 Switched to a new branch 'CAS-14849'
30-Sep-2026 19:52:39 Updated 0 paths from fb45b40137
30-Sep-2026 19:52:39 Updated 0 paths from fb45b40137
30-Sep-2026 19:52:39 Updated 0 paths from eb51c69579
30-Sep-2026 19:52:39 Requirement already satisfied: pip in /home/casatest/venv/lib/python3.12/site-packages (24.3.1)
30-Sep-2026 19:52:40 Collecting pip
30-Sep-2026 19:52:40   Downloading pip-26.2.1-py3-none-any.whl.metadata (4.6 kB)
30-Sep-2026 19:52:40 Collecting setuptools
30-Sep-2026 19:52:40   Downloading setuptools-84.0.0-py3-none-any.whl.metadata (6.6 kB)
30-Sep-2026 19:52:40 Collecting wheel
30-Sep-2026 19:52:40   Downloading wheel-0.48.0-py3-none-any.whl.metadata (2.3 kB)
30-Sep-2026 19:52:40 Collecting numpy
30-Sep-2026 19:52:40   Downloading numpy-2.5.3-cp312-cp312-manylinux_2_27_x86_64.manylinux_2_28_x86_64.whl.metadata (6.6 kB)
30-Sep-2026 19:52:40 Collecting packaging>=24.0 (from wheel)
30-Sep-2026 19:52:40   Downloading packaging-26.3-py3-none-any.whl.metadata (3.5 kB)
30-Sep-2026 19:52:40 Downloading pip-26.2.1-py3-none-any.whl (1.8 MB)
30-Sep-2026 19:52:40    ━━━━━━━━━━━━━━━━━━━━━━━━━━━━━━━━━━━━━━━━ 1.8/1.8 MB 123.9 MB/s eta 0:00:00
30-Sep-2026 19:52:40 Downloading setuptools-84.0.0-py3-none-any.whl (818 kB)
30-Sep-2026 19:52:40    ━━━━━━━━━━━━━━━━━━━━━━━━━━━━━━━━━━━━━━━━ 818.2/818.2 kB 85.1 MB/s eta 0:00:00
30-Sep-2026 19:52:40 Downloading wheel-0.48.0-py3-none-any.whl (33 kB)
30-Sep-2026 19:52:40 Downloading numpy-2.5.3-cp312-cp312-manylinux_2_27_x86_64.manylinux_2_28_x86_64.whl (16.7 MB)
30-Sep-2026 19:52:40    ━━━━━━━━━━━━━━━━━━━━━━━━━━━━━━━━━━━━━━━━ 16.7/16.7 MB 243.9 MB/s eta 0:00:00
30-Sep-2026 19:52:40 Downloading packaging-26.3-py3-none-any.whl (129 kB)
30-Sep-2026 19:52:40 Installing collected packages: setuptools, pip, packaging, numpy, wheel
30-Sep-2026 19:52:40   Attempting uninstall: pip
30-Sep-2026 19:52:40     Found existing installation: pip 24.3.1
30-Sep-2026 19:52:40     Uninstalling pip-24.3.1:
30-Sep-2026 19:52:40       Successfully uninstalled pip-24.3.1
30-Sep-2026 19:52:43 Successfully installed numpy-2.5.3 packaging-26.3 pip-26.2.1 setuptools-84.0.0 wheel-0.48.0
30-Sep-2026 19:52:43 Looking in indexes: https://pypi.org/simple, https://test.pypi.org/simple
30-Sep-2026 19:52:43 Collecting casaconfig==1.5.2.dev1
30-Sep-2026 19:52:43   Downloading casaconfig-1.5.2.dev1-py3-none-any.whl.metadata (4.0 kB)
30-Sep-2026 19:52:43 Collecting certifi>=2023.5.7 (from casaconfig==1.5.2.dev1)
30-Sep-2026 19:52:43   Downloading certifi-2026.7.22-py3-none-any.whl.metadata (2.5 kB)
30-Sep-2026 19:52:43 Downloading casaconfig-1.5.2.dev1-py3-none-any.whl (77 kB)
30-Sep-2026 19:52:43 Downloading certifi-2026.7.22-py3-none-any.whl (136 kB)
30-Sep-2026 19:52:43 Installing collected packages: certifi, casaconfig
30-Sep-2026 19:52:43
30-Sep-2026 19:52:43 Successfully installed casaconfig-1.5.2.dev1 certifi-2026.7.22
30-Sep-2026 19:52:44 Processing ./casatestutils-6.7.7.7a14849.dev3-py3-none-any.whl
30-Sep-2026 19:52:44 Collecting pytest>=6.0 (from casatestutils==6.7.7.7a14849.dev3)
30-Sep-2026 19:52:44   Downloading pytest-9.1.1-py3-none-any.whl.metadata (7.6 kB)
30-Sep-2026 19:52:44 Collecting astropy (from casatestutils==6.7.7.7a14849.dev3)
30-Sep-2026 19:52:44   Downloading astropy-8.0.1-cp311-abi3-manylinux2014_x86_64.manylinux_2_17_x86_64.manylinux_2_28_x86_64.whl.metadata (11 kB)
30-Sep-2026 19:52:44 Collecting iniconfig>=1.0.1 (from pytest>=6.0->casatestutils==6.7.7.7a14849.dev3)
30-Sep-2026 19:52:44   Downloading iniconfig-2.3.0-py3-none-any.whl.metadata (2.5 kB)
30-Sep-2026 19:52:44 Requirement already satisfied: packaging>=22 in /home/casatest/venv/lib/python3.12/site-packages (from pytest>=6.0->casatestutils==6.7.7.7a14849.dev3) (26.3)
30-Sep-2026 19:52:44 Collecting pluggy<2,>=1.5 (from pytest>=6.0->casatestutils==6.7.7.7a14849.dev3)
30-Sep-2026 19:52:44   Downloading pluggy-1.6.0-py3-none-any.whl.metadata (4.8 kB)
30-Sep-2026 19:52:44 Collecting pygments>=2.7.2 (from pytest>=6.0->casatestutils==6.7.7.7a14849.dev3)
30-Sep-2026 19:52:44   Downloading pygments-2.21.0-py3-none-any.whl.metadata (2.5 kB)
30-Sep-2026 19:52:44 Collecting astropy-iers-data>=0.2026.6.22.1.23.34 (from astropy->casatestutils==6.7.7.7a14849.dev3)
30-Sep-2026 19:52:44   Downloading astropy_iers_data-0.2026.9.28.0.59.37-py3-none-any.whl.metadata (3.4 kB)
30-Sep-2026 19:52:44 Requirement already satisfied: numpy>=2.0 in /home/casatest/venv/lib/python3.12/site-packages (from astropy->casatestutils==6.7.7.7a14849.dev3) (2.5.3)
30-Sep-2026 19:52:44 Collecting pyerfa>=2.0.1.3 (from astropy->casatestutils==6.7.7.7a14849.dev3)
30-Sep-2026 19:52:44   Downloading pyerfa-2.0.1.5-cp39-abi3-manylinux_2_17_x86_64.manylinux2014_x86_64.whl.metadata (5.7 kB)
30-Sep-2026 19:52:44 Collecting PyYAML>=6.0.0 (from astropy->casatestutils==6.7.7.7a14849.dev3)
30-Sep-2026 19:52:44   Downloading pyyaml-6.0.3-cp312-cp312-manylinux2014_x86_64.manylinux_2_17_x86_64.manylinux_2_28_x86_64.whl.metadata (2.4 kB)
30-Sep-2026 19:52:44 Downloading pytest-9.1.1-py3-none-any.whl (386 kB)
30-Sep-2026 19:52:44 Downloading pluggy-1.6.0-py3-none-any.whl (20 kB)
30-Sep-2026 19:52:44 Downloading iniconfig-2.3.0-py3-none-any.whl (7.5 kB)
30-Sep-2026 19:52:44 Downloading pygments-2.21.0-py3-none-any.whl (1.3 MB)
30-Sep-2026 19:52:44    ━━━━━━━━━━━━━━━━━━━━━━━━━━━━━━━━━━━━━━━━ 1.3/1.3 MB 107.3 MB/s  0:00:00
30-Sep-2026 19:52:44 Downloading astropy-8.0.1-cp311-abi3-manylinux2014_x86_64.manylinux_2_17_x86_64.manylinux_2_28_x86_64.whl (10.5 MB)
30-Sep-2026 19:52:44    ━━━━━━━━━━━━━━━━━━━━━━━━━━━━━━━━━━━━━━━━ 10.5/10.5 MB 105.2 MB/s  0:00:00
30-Sep-2026 19:52:44 Downloading astropy_iers_data-0.2026.9.28.0.59.37-py3-none-any.whl (2.0 MB)
30-Sep-2026 19:52:44    ━━━━━━━━━━━━━━━━━━━━━━━━━━━━━━━━━━━━━━━━ 2.0/2.0 MB 101.9 MB/s  0:00:00
30-Sep-2026 19:52:44 Downloading pyerfa-2.0.1.5-cp39-abi3-manylinux_2_17_x86_64.manylinux2014_x86_64.whl (738 kB)
30-Sep-2026 19:52:44    ━━━━━━━━━━━━━━━━━━━━━━━━━━━━━━━━━━━━━━━━ 738.7/738.7 kB 62.6 MB/s  0:00:00
30-Sep-2026 19:52:44 Downloading pyyaml-6.0.3-cp312-cp312-manylinux2014_x86_64.manylinux_2_17_x86_64.manylinux_2_28_x86_64.whl (807 kB)
30-Sep-2026 19:52:44    ━━━━━━━━━━━━━━━━━━━━━━━━━━━━━━━━━━━━━━━━ 807.9/807.9 kB 86.2 MB/s  0:00:00
30-Sep-2026 19:52:44 Installing collected packages: PyYAML, pygments, pyerfa, pluggy, iniconfig, astropy-iers-data, pytest, astropy, casatestutils
30-Sep-2026 19:52:47
30-Sep-2026 19:52:47 Successfully installed PyYAML-6.0.3 astropy-8.0.1 astropy-iers-data-0.2026.9.28.0.59.37 casatestutils-6.7.7.7a14849.dev3 iniconfig-2.3.0 pluggy-1.6.0 pyerfa-2.0.1.5 pygments-2.21.0 pytest-9.1.1
30-Sep-2026 19:52:48 Processing ./casatools-6.7.7.7a14849.dev3-cp312-cp312-manylinux_2_28_x86_64.whl
30-Sep-2026 19:52:48 Collecting casaconfig @ git+https://github.com/casangi/casaconfig@1.5.2.dev (from casatools==6.7.7.7a14849.dev3)
30-Sep-2026 19:52:48   Cloning https://github.com/casangi/casaconfig (to revision 1.5.2.dev) to /tmp/pip-install-gpcquxp6/casaconfig_009e942a2dec424d932cfc61bcff0073
30-Sep-2026 19:52:48   Running command git clone --filter=blob:none --quiet https://github.com/casangi/casaconfig /tmp/pip-install-gpcquxp6/casaconfig_009e942a2dec424d932cfc61bcff0073
30-Sep-2026 19:52:48   Running command git checkout -b 1.5.2.dev --track origin/1.5.2.dev
30-Sep-2026 19:52:48   Switched to a new branch '1.5.2.dev'
30-Sep-2026 19:52:48   branch '1.5.2.dev' set up to track 'origin/1.5.2.dev'.
30-Sep-2026 19:52:48   Resolved https://github.com/casangi/casaconfig to commit a2e92d41cee0d57a3cc24acb5c71721ec84892cf
30-Sep-2026 19:52:48   Installing build dependencies: started
30-Sep-2026 19:52:48   Installing build dependencies: finished with status 'done'
30-Sep-2026 19:52:48   Getting requirements to build wheel: started
30-Sep-2026 19:52:49   Getting requirements to build wheel: finished with status 'done'
30-Sep-2026 19:52:49   Preparing metadata (pyproject.toml): started
30-Sep-2026 19:52:49   Preparing metadata (pyproject.toml): finished with status 'done'
30-Sep-2026 19:52:49 Requirement already satisfied: certifi>=2023.5.7 in /home/casatest/venv/lib/python3.12/site-packages (from casaconfig @ git+https://github.com/casangi/casaconfig@1.5.2.dev->casatools==6.7.7.7a14849.dev3) (2026.7.22)
30-Sep-2026 19:52:49 Installing collected packages: casatools
30-Sep-2026 19:52:50 Successfully installed casatools-6.7.7.7a14849.dev3
30-Sep-2026 19:52:50 Processing ./casatasks-6.7.7.7a14849.dev3-py3-none-any.whl
30-Sep-2026 19:52:50 Requirement already satisfied: casatools==6.7.7.7a14849.dev3 in /home/casatest/venv/lib/python3.12/site-packages (from casatasks==6.7.7.7a14849.dev3) (6.7.7.7a14849.dev3)
30-Sep-2026 19:52:50 Collecting matplotlib (from casatasks==6.7.7.7a14849.dev3)
30-Sep-2026 19:52:51   Downloading matplotlib-3.11.2-cp312-cp312-manylinux2014_x86_64.manylinux_2_17_x86_64.whl.metadata (80 kB)
30-Sep-2026 19:52:51 Collecting scipy (from casatasks==6.7.7.7a14849.dev3)
30-Sep-2026 19:52:51   Downloading scipy-1.18.1-cp312-cp312-manylinux_2_27_x86_64.manylinux_2_28_x86_64.whl.metadata (62 kB)
30-Sep-2026 19:52:51 Requirement already satisfied: certifi in /home/casatest/venv/lib/python3.12/site-packages (from casatasks==6.7.7.7a14849.dev3) (2026.7.22)
30-Sep-2026 19:52:51 Requirement already satisfied: pyerfa in /home/casatest/venv/lib/python3.12/site-packages (from casatasks==6.7.7.7a14849.dev3) (2.0.1.5)
30-Sep-2026 19:52:51 Collecting casaconfig @ git+https://github.com/casangi/casaconfig@1.5.2.dev (from casatools==6.7.7.7a14849.dev3->casatasks==6.7.7.7a14849.dev3)
30-Sep-2026 19:52:51   Cloning https://github.com/casangi/casaconfig (to revision 1.5.2.dev) to /tmp/pip-install-6lau5bzc/casaconfig_a8422c3e18f74c7bb5f34feedab41a46
30-Sep-2026 19:52:51   Running command git clone --filter=blob:none --quiet https://github.com/casangi/casaconfig /tmp/pip-install-6lau5bzc/casaconfig_a8422c3e18f74c7bb5f34feedab41a46
30-Sep-2026 19:52:51   Running command git checkout -b 1.5.2.dev --track origin/1.5.2.dev
30-Sep-2026 19:52:51   Resolved https://github.com/casangi/casaconfig to commit a2e92d41cee0d57a3cc24acb5c71721ec84892cf
30-Sep-2026 19:52:51   Switched to a new branch '1.5.2.dev'
30-Sep-2026 19:52:51   branch '1.5.2.dev' set up to track 'origin/1.5.2.dev'.
30-Sep-2026 19:52:51   Installing build dependencies: started
30-Sep-2026 19:52:51   Installing build dependencies: finished with status 'done'
30-Sep-2026 19:52:51   Getting requirements to build wheel: started
30-Sep-2026 19:52:52   Getting requirements to build wheel: finished with status 'done'
30-Sep-2026 19:52:52   Preparing metadata (pyproject.toml): started
30-Sep-2026 19:52:52   Preparing metadata (pyproject.toml): finished with status 'done'
30-Sep-2026 19:52:52 Collecting contourpy>=1.0.1 (from matplotlib->casatasks==6.7.7.7a14849.dev3)
30-Sep-2026 19:52:52   Downloading contourpy-1.4.0-cp312-cp312-manylinux_2_27_x86_64.manylinux_2_28_x86_64.whl.metadata (3.8 kB)
30-Sep-2026 19:52:52 Collecting cycler>=0.10 (from matplotlib->casatasks==6.7.7.7a14849.dev3)
30-Sep-2026 19:52:52   Downloading cycler-0.12.1-py3-none-any.whl.metadata (3.8 kB)
30-Sep-2026 19:52:52 Collecting fonttools>=4.28.2 (from matplotlib->casatasks==6.7.7.7a14849.dev3)
30-Sep-2026 19:52:52   Downloading fonttools-4.66.1-cp312-cp312-manylinux2014_x86_64.manylinux_2_17_x86_64.whl.metadata (130 kB)
30-Sep-2026 19:52:52 Collecting kiwisolver>=1.3.1 (from matplotlib->casatasks==6.7.7.7a14849.dev3)
30-Sep-2026 19:52:52   Downloading kiwisolver-1.5.1-cp312-cp312-manylinux2014_x86_64.manylinux_2_17_x86_64.whl.metadata (5.2 kB)
30-Sep-2026 19:52:52 Requirement already satisfied: numpy>=1.25 in /home/casatest/venv/lib/python3.12/site-packages (from matplotlib->casatasks==6.7.7.7a14849.dev3) (2.5.3)
30-Sep-2026 19:52:52 Requirement already satisfied: packaging>=20.0 in /home/casatest/venv/lib/python3.12/site-packages (from matplotlib->casatasks==6.7.7.7a14849.dev3) (26.3)
30-Sep-2026 19:52:52 Collecting pillow>=9 (from matplotlib->casatasks==6.7.7.7a14849.dev3)
30-Sep-2026 19:52:52   Downloading pillow-12.3.0-cp312-cp312-manylinux_2_27_x86_64.manylinux_2_28_x86_64.whl.metadata (9.1 kB)
30-Sep-2026 19:52:52 Collecting pyparsing>=3 (from matplotlib->casatasks==6.7.7.7a14849.dev3)
30-Sep-2026 19:52:52   Downloading pyparsing-3.3.3-py3-none-any.whl.metadata (5.9 kB)
30-Sep-2026 19:52:52 Collecting python-dateutil>=2.7 (from matplotlib->casatasks==6.7.7.7a14849.dev3)
30-Sep-2026 19:52:52   Downloading python_dateutil-2.9.0.post0-py2.py3-none-any.whl.metadata (8.4 kB)
30-Sep-2026 19:52:52 Collecting six>=1.5 (from python-dateutil>=2.7->matplotlib->casatasks==6.7.7.7a14849.dev3)
30-Sep-2026 19:52:52   Downloading six-1.17.0-py2.py3-none-any.whl.metadata (1.7 kB)
30-Sep-2026 19:52:52 Downloading matplotlib-3.11.2-cp312-cp312-manylinux2014_x86_64.manylinux_2_17_x86_64.whl (9.9 MB)
30-Sep-2026 19:52:52    ━━━━━━━━━━━━━━━━━━━━━━━━━━━━━━━━━━━━━━━━ 9.9/9.9 MB 197.7 MB/s  0:00:00
30-Sep-2026 19:52:52 Downloading contourpy-1.4.0-cp312-cp312-manylinux_2_27_x86_64.manylinux_2_28_x86_64.whl (383 kB)
30-Sep-2026 19:52:52 Downloading cycler-0.12.1-py3-none-any.whl (8.3 kB)
30-Sep-2026 19:52:52 Downloading fonttools-4.66.1-cp312-cp312-manylinux2014_x86_64.manylinux_2_17_x86_64.whl (5.4 MB)
30-Sep-2026 19:52:52    ━━━━━━━━━━━━━━━━━━━━━━━━━━━━━━━━━━━━━━━━ 5.4/5.4 MB 209.0 MB/s  0:00:00
30-Sep-2026 19:52:53 Downloading kiwisolver-1.5.1-cp312-cp312-manylinux2014_x86_64.manylinux_2_17_x86_64.whl (1.5 MB)
30-Sep-2026 19:52:53    ━━━━━━━━━━━━━━━━━━━━━━━━━━━━━━━━━━━━━━━━ 1.5/1.5 MB 226.4 MB/s  0:00:00
30-Sep-2026 19:52:53 Downloading pillow-12.3.0-cp312-cp312-manylinux_2_27_x86_64.manylinux_2_28_x86_64.whl (6.9 MB)
30-Sep-2026 19:52:53    ━━━━━━━━━━━━━━━━━━━━━━━━━━━━━━━━━━━━━━━━ 6.9/6.9 MB 283.1 MB/s  0:00:00
30-Sep-2026 19:52:53 Downloading pyparsing-3.3.3-py3-none-any.whl (126 kB)
30-Sep-2026 19:52:53 Downloading python_dateutil-2.9.0.post0-py2.py3-none-any.whl (229 kB)
30-Sep-2026 19:52:53 Downloading six-1.17.0-py2.py3-none-any.whl (11 kB)
30-Sep-2026 19:52:53 Downloading scipy-1.18.1-cp312-cp312-manylinux_2_27_x86_64.manylinux_2_28_x86_64.whl (35.3 MB)
30-Sep-2026 19:52:53    ━━━━━━━━━━━━━━━━━━━━━━━━━━━━━━━━━━━━━━━━ 35.3/35.3 MB 260.5 MB/s  0:00:00
30-Sep-2026 19:52:53 Installing collected packages: six, scipy, pyparsing, pillow, kiwisolver, fonttools, cycler, contourpy, python-dateutil, matplotlib, casatasks
30-Sep-2026 19:52:59
30-Sep-2026 19:52:59 Successfully installed casatasks-6.7.7.7a14849.dev3 contourpy-1.4.0 cycler-0.12.1 fonttools-4.66.1 kiwisolver-1.5.1 matplotlib-3.11.2 pillow-12.3.0 pyparsing-3.3.3 python-dateutil-2.9.0.post0 scipy-1.18.1 six-1.17.0
30-Sep-2026 19:53:03 branch 'CAS-14849' set up to track 'origin/CAS-14849'.
30-Sep-2026 19:53:03 Switched to a new branch 'CAS-14849'
30-Sep-2026 19:53:03 Runtest command: python3.12 runtest.py --ignore_list 'test_casampi,test_task_msview,test_task_imview,test_task_plotms' -t /home/casatest/casaconfig/tests 2>&1 | tee casatasks_test.log
30-Sep-2026 19:53:03 LICENSE
30-Sep-2026 19:53:03 README.md
30-Sep-2026 19:53:03 __init__.py
30-Sep-2026 19:53:03 casatestutils
30-Sep-2026 19:53:03 pyproject.toml
30-Sep-2026 19:53:03 runtest.py
30-Sep-2026 19:53:03 setup.py
30-Sep-2026 19:53:03 testrunner
30-Sep-2026 19:53:03 tests
30-Sep-2026 19:53:03 version
30-Sep-2026 19:53:03 xmlrunner_to_junit.py
30-Sep-2026 19:53:03 ============================= test session starts ==============================
30-Sep-2026 19:53:03 platform linux -- Python 3.12.9, pytest-9.1.1, pluggy-1.6.0 -- /home/casatest/venv/bin/python3.12
30-Sep-2026 19:53:03 cachedir: .pytest_cache
30-Sep-2026 19:53:03 rootdir: /home/casatest/casa6/casatestutils/nosedir/test_casaconfig
30-Sep-2026 19:53:03 configfile: pytest.ini
30-Sep-2026 19:53:03 collecting ... collected 13 items
30-Sep-2026 19:53:03
30-Sep-2026 19:53:03
30-Sep-2026 19:53:12 test_casaconfig.py::casaconfig_test::test_auto_install_data
30-Sep-2026 19:53:12 Test auto install of all data to measurespath on casatools startup
30-Sep-2026 19:53:12 PASSED
30-Sep-2026 19:53:12
30-Sep-2026 19:53:12 test_casaconfig.py::casaconfig_test::test_auto_update_measures
30-Sep-2026 19:53:12 Test Automatic Measures Updates to measurespath
30-Sep-2026 19:53:12 pull_data using version casarundata-2026.02.19-1.tar.gz, acquiring the lock ...
30-Sep-2026 19:53:15 downloading casarundata contents to  /home/casatest/casa6/casatestutils/nosedir/test_casaconfig/testrundata (336M) ... done
30-Sep-2026 19:53:20 casarundata installed casarundata-2026.02.19-1.tar.gz at /home/casatest/casa6/casatestutils/nosedir/test_casaconfig/testrundata
30-Sep-2026 19:53:20 PASSED
30-Sep-2026 19:53:20
30-Sep-2026 19:53:20 test_casaconfig.py::casaconfig_test::test_casaconfig_measures_available
30-Sep-2026 19:53:20 Test That Today or Yesterday measures data is returned
30-Sep-2026 19:53:20 FAILED
30-Sep-2026 19:53:20
30-Sep-2026 19:53:26 test_casaconfig.py::casaconfig_test::test_casaconfig_measures_update
30-Sep-2026 19:53:26 Test downgrade to upgrade measures data to location
30-Sep-2026 19:53:26 measures_update ... acquiring the lock ...
30-Sep-2026 19:53:26 A measures update has been requested by the force argument
30-Sep-2026 19:53:26   ... finding available measures ...
30-Sep-2026 19:53:26   ... downloading ./WSRT_Measures_20260929-160001.ztar from https://iers.astron.nl/ to /home/casatest/casa6/casatestutils/nosedir/test_casaconfig/testmeasures ...
30-Sep-2026 19:53:26   ... measures data updated at /home/casatest/casa6/casatestutils/nosedir/test_casaconfig/testmeasures
30-Sep-2026 19:53:26 measures_update ... acquiring the lock ...
30-Sep-2026 19:53:26   ... finding available measures ...
30-Sep-2026 19:53:26   ... downloading ./WSRT_Measures_20260928-160001.ztar from https://iers.astron.nl/ to /home/casatest/casa6/casatestutils/nosedir/test_casaconfig/testmeasures ...
30-Sep-2026 19:53:26   ... measures data updated at /home/casatest/casa6/casatestutils/nosedir/test_casaconfig/testmeasures
30-Sep-2026 19:53:26 PASSED
30-Sep-2026 19:53:26
30-Sep-2026 19:53:26 test_casaconfig.py::casaconfig_test::test_config_import
30-Sep-2026 19:53:26 Tests of the config import
30-Sep-2026 19:53:26 PASSED
30-Sep-2026 19:53:26
30-Sep-2026 19:53:26 test_casaconfig.py::casaconfig_test::test_daily_update
30-Sep-2026 19:53:26 test that updates do not happen if the installed data is less than 1 day old and do happen when they are older
30-Sep-2026 19:53:26 pull_data using version casarundata-2025.12.12-1.tar.gz, acquiring the lock ...
30-Sep-2026 19:53:30 downloading casarundata contents to  /home/casatest/casa6/casatestutils/nosedir/test_casaconfig/testrundata (336M) ... done
30-Sep-2026 19:53:34 casarundata installed casarundata-2025.12.12-1.tar.gz at /home/casatest/casa6/casatestutils/nosedir/test_casaconfig/testrundata
30-Sep-2026 19:53:34 data_update: version installed or checked less than 1 day(s) ago, nothing updated or checked
30-Sep-2026 19:53:34 measures_update: version installed or checked less than 1 day(s) ago, nothing updated or checked
30-Sep-2026 19:53:34 data_update: version installed or checked less than 1 day(s) ago, nothing updated or checked
30-Sep-2026 19:53:34 measures_update ... acquiring the lock ...
30-Sep-2026 19:53:34   ... finding available measures ...
30-Sep-2026 19:53:34   ... downloading ./WSRT_Measures_20260929-160001.ztar from https://iers.astron.nl/ to /home/casatest/casa6/casatestutils/nosedir/test_casaconfig/testrundata ...
30-Sep-2026 19:53:34   ... measures data updated at /home/casatest/casa6/casatestutils/nosedir/test_casaconfig/testrundata
30-Sep-2026 19:53:34 data_update using version casarundata-2026.02.19-1.tar.gz, acquiring the lock ...
30-Sep-2026 19:53:34 Removing files using manifest from previous install of casarundata-2025.12.12-1.tar.gz on 2026-09-30
30-Sep-2026 19:53:37 downloading casarundata contents to  /home/casatest/casa6/casatestutils/nosedir/test_casaconfig/testrundata (336M) ... done
30-Sep-2026 19:53:42 casarundata installed casarundata-2026.02.19-1.tar.gz at /home/casatest/casa6/casatestutils/nosedir/test_casaconfig/testrundata
30-Sep-2026 19:53:42 measures_update ... acquiring the lock ...
30-Sep-2026 19:53:42   ... finding available measures ...
30-Sep-2026 19:53:42   ... downloading ./WSRT_Measures_20260929-160001.ztar from https://iers.astron.nl/ to /home/casatest/casa6/casatestutils/nosedir/test_casaconfig/testrundata ...
30-Sep-2026 19:53:42   ... measures data updated at /home/casatest/casa6/casatestutils/nosedir/test_casaconfig/testrundata
30-Sep-2026 19:53:42 PASSED
30-Sep-2026 19:53:42
30-Sep-2026 19:53:42 test_casaconfig.py::casaconfig_test::test_exceptions_no_data
30-Sep-2026 19:53:42 test that exceptions that do not require any data happen when expected
30-Sep-2026 19:53:42 PASSED
30-Sep-2026 19:53:42
30-Sep-2026 19:53:42 test_casaconfig.py::casaconfig_test::test_exceptions_with_data
30-Sep-2026 19:53:42 test that exceptions that require data happen when expected
30-Sep-2026 19:53:42 pull_data using version casarundata-2026.02.19-1.tar.gz, acquiring the lock ...
30-Sep-2026 19:53:46 downloading casarundata contents to  /home/casatest/casa6/casatestutils/nosedir/test_casaconfig/testrundata (336M) ... done
30-Sep-2026 19:53:47 lock file is not empty : /home/casatest/casa6/casatestutils/nosedir/test_casaconfig/testrundata/data_update.lock
30-Sep-2026 19:53:47 The lock file at /home/casatest/casa6/casatestutils/nosedir/test_casaconfig/testrundata is not empty.
30-Sep-2026 19:53:47 A previous attempt to update path may have failed or exited prematurely.
30-Sep-2026 19:53:47 Remove the lock file and set force to True with the desired version (default to most recent).
30-Sep-2026 19:53:47 It may be best to completely repopulate path using pull_data and measures_update.
30-Sep-2026 19:53:47 lock file is not empty : /home/casatest/casa6/casatestutils/nosedir/test_casaconfig/testrundata/data_update.lock
30-Sep-2026 19:53:47 data_update: the lock file at /home/casatest/casa6/casatestutils/nosedir/test_casaconfig/testrundata is not empty.
30-Sep-2026 19:53:47 A previous attempt to update path may have failed or exited prematurely.
30-Sep-2026 19:53:47 Remove the lock file and set force to True with the desired version (default to most recent).
30-Sep-2026 19:53:47 It may be best to completely re-populate path using pull_data and measures_update.
30-Sep-2026 19:53:48 casarundata installed casarundata-2026.02.19-1.tar.gz at /home/casatest/casa6/casatestutils/nosedir/test_casaconfig/testrundata
30-Sep-2026 19:53:48 measures_update ... acquiring the lock ...
30-Sep-2026 19:53:48 data_update using version casarundata-2024.02.09-1.tar.gz, acquiring the lock ...
30-Sep-2026 19:53:48 PASSED
30-Sep-2026 19:53:48
30-Sep-2026 19:53:48 test_casaconfig.py::casaconfig_test::test_file_exists
30-Sep-2026 19:53:48 Test Default config.py exists in casaconfig module
30-Sep-2026 19:53:48 PASSED
30-Sep-2026 19:53:48
30-Sep-2026 19:53:48 test_casaconfig.py::casaconfig_test::test_import_casatools_bad_measurespath
30-Sep-2026 19:53:48 Test that import casatools will return ImportError with measurespath set to an empty directory that cannot be written to
30-Sep-2026 19:53:48 PASSED
30-Sep-2026 19:53:48
30-Sep-2026 19:56:01 test_casaconfig.py::casaconfig_test::test_measures_site measures_update can't find specified version ./WSRT_Measures_20260927-160001.ztar at site https://go.nrao.edu/iers/
30-Sep-2026 19:58:27 measures_update can't find specified version NRAO_Measures_20260926-140503.ztar at site https://iers.astron.nl/
30-Sep-2026 19:58:27 Unable to retrieve list of available measures versions, measures_site value may be an empty list or no files were found at measures_site, check and try again.
30-Sep-2026 19:58:27 There was a remote error while attempting to update measures at /home/casatest/casa6/casatestutils/nosedir/test_casaconfig/testmeasures
30-Sep-2026 19:58:27 Check the value of measures_site and try again
30-Sep-2026 19:58:28
30-Sep-2026 19:58:28 tests related to measures site
30-Sep-2026 19:58:28 Warning: the most recent measures tar file at each of the sites was older than config.measures_site_interval
30-Sep-2026 19:58:28 https://iers.astron.nl/ had the most recent measures tar file, returning that list
30-Sep-2026 19:58:28 Warning: the most recent measures tar file at each of the sites was older than config.measures_site_interval
30-Sep-2026 19:58:28 https://go.nrao.edu/iers/ had the most recent measures tar file, returning that list
30-Sep-2026 19:58:28 measures_update ... acquiring the lock ...
30-Sep-2026 19:58:28 A measures update has been requested by the force argument
30-Sep-2026 19:58:28   ... finding available measures ...
30-Sep-2026 19:58:28   ... downloading ./WSRT_Measures_20260929-160001.ztar from https://iers.astron.nl/ to /home/casatest/casa6/casatestutils/nosedir/test_casaconfig/testmeasures ...
30-Sep-2026 19:58:28   ... measures data updated at /home/casatest/casa6/casatestutils/nosedir/test_casaconfig/testmeasures
30-Sep-2026 19:58:28 di : {'site': 'https://iers.astron.nl/', 'version': './WSRT_Measures_20260929-160001.ztar', 'date': '2026-09-30', 'age': 1.510812176598443e-08}
30-Sep-2026 19:58:28 measures_update ... acquiring the lock ...
30-Sep-2026 19:58:28 A measures update has been requested by the force argument
30-Sep-2026 19:58:28   ... finding available measures ...
30-Sep-2026 19:58:28   ... downloading ./WSRT_Measures_20260927-160001.ztar from https://iers.astron.nl/ to /home/casatest/casa6/casatestutils/nosedir/test_casaconfig/testmeasures ...
30-Sep-2026 19:58:28   ... measures data updated at /home/casatest/casa6/casatestutils/nosedir/test_casaconfig/testmeasures
30-Sep-2026 19:58:28 measures_update ... acquiring the lock ...
30-Sep-2026 19:58:28 A measures update has been requested by the force argument
30-Sep-2026 19:58:28   ... finding available measures ...
30-Sep-2026 19:58:28   ... downloading ./WSRT_Measures_20260927-160001.ztar from https://iers.astron.nl/ to /home/casatest/casa6/casatestutils/nosedir/test_casaconfig/testmeasures ...
30-Sep-2026 19:58:28   ... measures data updated at /home/casatest/casa6/casatestutils/nosedir/test_casaconfig/testmeasures
30-Sep-2026 19:58:28 measures_update ... acquiring the lock ...
30-Sep-2026 19:58:28 A measures update has been requested by the force argument
30-Sep-2026 19:58:28   ... finding available measures ...
30-Sep-2026 19:58:28   ... downloading ./WSRT_Measures_20260929-160001.ztar from https://iers.astron.nl/ to /home/casatest/casa6/casatestutils/nosedir/test_casaconfig/testmeasures ...
30-Sep-2026 19:58:28   ... measures data updated at /home/casatest/casa6/casatestutils/nosedir/test_casaconfig/testmeasures
30-Sep-2026 19:58:28 measures_update ... acquiring the lock ...
30-Sep-2026 19:58:28 A measures update has been requested by the force argument
30-Sep-2026 19:58:28   ... finding available measures ...
30-Sep-2026 19:58:28 measures_update ... acquiring the lock ...
30-Sep-2026 19:58:28 A measures update has been requested by the force argument
30-Sep-2026 19:58:28   ... finding available measures ...
30-Sep-2026 19:58:28   ... downloading NRAO_Measures_20260926-140503.ztar from https://go.nrao.edu/iers/ to /home/casatest/casa6/casatestutils/nosedir/test_casaconfig/testmeasures ...
30-Sep-2026 19:58:28   ... measures data updated at /home/casatest/casa6/casatestutils/nosedir/test_casaconfig/testmeasures
30-Sep-2026 19:58:28 measures_update ... acquiring the lock ...
30-Sep-2026 19:58:28 A measures update has been requested by the force argument
30-Sep-2026 19:58:28   ... finding available measures ...
30-Sep-2026 19:58:28   ... downloading NRAO_Measures_20260926-140503.ztar from https://go.nrao.edu/iers/ to /home/casatest/casa6/casatestutils/nosedir/test_casaconfig/testmeasures ...
30-Sep-2026 19:58:28   ... measures data updated at /home/casatest/casa6/casatestutils/nosedir/test_casaconfig/testmeasures
30-Sep-2026 19:58:28 measures_update ... acquiring the lock ...
30-Sep-2026 19:58:28 A measures update has been requested by the force argument
30-Sep-2026 19:58:28   ... finding available measures ...
30-Sep-2026 19:58:28   ... downloading NRAO_Measures_20260929-140558.ztar from https://go.nrao.edu/iers/ to /home/casatest/casa6/casatestutils/nosedir/test_casaconfig/testmeasures ...
30-Sep-2026 19:58:28   ... measures data updated at /home/casatest/casa6/casatestutils/nosedir/test_casaconfig/testmeasures
30-Sep-2026 19:58:28 measures_update ... acquiring the lock ...
30-Sep-2026 19:58:28 A measures update has been requested by the force argument
30-Sep-2026 19:58:28   ... finding available measures ...
30-Sep-2026 19:58:28 measures_update ... acquiring the lock ...
30-Sep-2026 19:58:28 A measures update has been requested by the force argument
30-Sep-2026 19:58:28   ... finding available measures ...
30-Sep-2026 19:58:28 PASSED
30-Sep-2026 19:58:28
30-Sep-2026 19:58:28 test_casaconfig.py::casaconfig_test::test_read_measurespath_from_user_config
30-Sep-2026 19:58:28 Test casaconfig downloads specific measures data to location and casatools reads that data location
30-Sep-2026 19:58:28 pull_data using version casarundata-2026.02.19-1.tar.gz, acquiring the lock ...
30-Sep-2026 19:58:31 downloading casarundata contents to  /home/casatest/casa6/casatestutils/nosedir/test_casaconfig/testrundata (336M) ... done
30-Sep-2026 19:58:36 casarundata installed casarundata-2026.02.19-1.tar.gz at /home/casatest/casa6/casatestutils/nosedir/test_casaconfig/testrundata
30-Sep-2026 19:58:36 PASSED
30-Sep-2026 19:58:36
30-Sep-2026 19:58:36 test_casaconfig.py::casaconfig_test::test_update_interval
30-Sep-2026 19:58:36 tests use of config update_interval values
30-Sep-2026 19:58:36 pull_data using version casarundata-2026.02.19-1.tar.gz, acquiring the lock ...
30-Sep-2026 19:58:39 downloading casarundata contents to  /home/casatest/casa6/casatestutils/nosedir/test_casaconfig/testrundata (336M) ... done
30-Sep-2026 19:58:41 casarundata installed casarundata-2026.02.19-1.tar.gz at /home/casatest/casa6/casatestutils/nosedir/test_casaconfig/testrundata
30-Sep-2026 19:58:41 data_update using version casarundata-2025.12.12-1.tar.gz, acquiring the lock ...
30-Sep-2026 19:58:41 Removing files using manifest from previous install of casarundata-2026.02.19-1.tar.gz on 2026-09-30
30-Sep-2026 19:58:44 downloading casarundata contents to  /home/casatest/casa6/casatestutils/nosedir/test_casaconfig/testrundata (336M) ... done
30-Sep-2026 19:58:45 casarundata installed casarundata-2025.12.12-1.tar.gz at /home/casatest/casa6/casatestutils/nosedir/test_casaconfig/testrundata
30-Sep-2026 19:58:45 data_update: version installed or checked less than 1 day(s) ago, nothing updated or checked
30-Sep-2026 19:58:45 data_update using version casarundata-2026.02.19-1.tar.gz, acquiring the lock ...
30-Sep-2026 19:58:45 Removing files using manifest from previous install of casarundata-2025.12.12-1.tar.gz on 2026-09-30
30-Sep-2026 19:58:49 downloading casarundata contents to  /home/casatest/casa6/casatestutils/nosedir/test_casaconfig/testrundata (336M) ... done
30-Sep-2026 19:58:55 casarundata installed casarundata-2026.02.19-1.tar.gz at /home/casatest/casa6/casatestutils/nosedir/test_casaconfig/testrundata
30-Sep-2026 19:58:55 measures_update ... acquiring the lock ...
30-Sep-2026 19:58:55 A measures update has been requested by the force argument
30-Sep-2026 19:58:55   ... finding available measures ...
30-Sep-2026 19:58:55   ... downloading ./WSRT_Measures_20260928-160001.ztar from https://iers.astron.nl/ to /home/casatest/casa6/casatestutils/nosedir/test_casaconfig/testrundata ...
30-Sep-2026 19:58:55   ... measures data updated at /home/casatest/casa6/casatestutils/nosedir/test_casaconfig/testrundata
30-Sep-2026 19:58:55 measures_update: version installed or checked less than 1 day(s) ago, nothing updated or checked
30-Sep-2026 19:58:55 measures_update ... acquiring the lock ...
30-Sep-2026 19:58:55   ... finding available measures ...
30-Sep-2026 19:58:55   ... downloading ./WSRT_Measures_20260929-160001.ztar from https://iers.astron.nl/ to /home/casatest/casa6/casatestutils/nosedir/test_casaconfig/testrundata ...
30-Sep-2026 19:58:55   ... measures data updated at /home/casatest/casa6/casatestutils/nosedir/test_casaconfig/testrundata
30-Sep-2026 19:58:55 PASSED
30-Sep-2026 19:58:55
30-Sep-2026 19:58:55 =================================== FAILURES ===================================
30-Sep-2026 19:58:55 ______________ casaconfig_test.test_casaconfig_measures_available ______________
30-Sep-2026 19:58:55 test_casaconfig.py:176: in test_casaconfig_measures_available
30-Sep-2026 19:58:55     self.assertTrue(any(elem in self.get_meas_avail() for elem in [measuresdata_today, measuresdata_yesterday]))
30-Sep-2026 19:58:55 E   AssertionError: False is not true
30-Sep-2026 19:58:55 - generated xml file: /home/casatest/casa6/casatestutils/nosedir/xml/test_casaconfig/nose.xml -
30-Sep-2026 19:58:55 =========================== short test summary info ============================
30-Sep-2026 19:58:55 FAILED test_casaconfig.py::casaconfig_test::test_casaconfig_measures_available
30-Sep-2026 19:58:55 ============= 1 failed, 12 passed, 1 warning in 352.33s (0:05:52) ==============
30-Sep-2026 19:58:55 Namespace(list=False, verbose=False, dry_run=False, classes=None, file=None, mapfile=None, branch=None, merge_target=None, pkg=None, work_dir=None, ncores=2, test_paths='/home/casatest/casaconfig/tests', test_list=None, test_config=None, test_group=None, pmode=None, bamboo=False, cachedir=None, ignore_list='test_casampi,test_task_msview,test_task_imview,test_task_plotms', run_skipped=False, only_skipped=False)
30-Sep-2026 19:58:55
30-Sep-2026 19:58:55 Operating system: Linux
30-Sep-2026 19:58:55
30-Sep-2026 19:58:55 Arguments Sent Direct To Pytest :  []
30-Sep-2026 19:58:55
30-Sep-2026 19:58:55 Tests to Ignore:  ['test_casampi', 'test_task_msview', 'test_task_imview', 'test_task_plotms']
30-Sep-2026 19:58:55 Running 1 Test(s)
30-Sep-2026 19:58:55 Cleaning: /home/casatest/casa6/casatestutils/nosedir/
30-Sep-2026 19:58:55 Tests: ['/home/casatest/casaconfig/tests/test_casaconfig.py']
30-Sep-2026 19:58:55
30-Sep-2026 19:58:55 Setting Working Directory: /home/casatest/casa6/casatestutils/nosedir/test_casaconfig/
30-Sep-2026 19:58:55 Test Directory: /home/casatest/casa6/casatestutils/nosedir/test_casaconfig
30-Sep-2026 19:58:55
30-Sep-2026 19:58:55 Running Command: pytest --junitxml=/home/casatest/casa6/casatestutils/nosedir/xml/test_casaconfig/nose.xml -s --disable-pytest-warnings --verbose -ra --tb=short /home/casatest/casa6/casatestutils/nosedir/test_casaconfig/
30-Sep-2026 19:58:56 total 79564
30-Sep-2026 19:58:56 -rw-r--r-- 1 casaci 15001  1934136 Sep 30 23:51 casatasks-6.7.7.7a14849.dev3-py3-none-any.whl
30-Sep-2026 19:58:56 -rw-r--r-- 1 casaci root     14991 Sep 30 23:58 casatasks_test.log
30-Sep-2026 19:58:56 -rw-r--r-- 1 casaci 15001   161131 Sep 30 23:51 casatestutils-6.7.7.7a14849.dev3-py3-none-any.whl
30-Sep-2026 19:58:56 -rw-r--r-- 1 casaci 15001 79346793 Sep 30 23:51 casatools-6.7.7.7a14849.dev3-cp312-cp312-manylinux_2_28_x86_64.whl
30-Sep-2026 19:58:56 -rw-r--r-- 1 casaci root       912 Sep 30 23:58 requirements.txt
30-Sep-2026 19:58:56 -rw-r--r-- 1 casaci root      1878 Sep 30 23:58 test_casaconfig.xml
30-Sep-2026 19:58:56 Finished task 'Test wheel' with result: Success
30-Sep-2026 19:58:56 Starting task 'Inject is_641' of type 'com.atlassian.bamboo.plugins.bamboo-variable-inject-plugin:inject'
30-Sep-2026 19:58:56 Injected variable bamboo.inject.is_641=False in LOCAL scope
30-Sep-2026 19:58:56 Finished task 'Inject is_641' with result: Success
30-Sep-2026 19:58:56
Substituting variable: ${bamboo.agentId} with 153550854
30-Sep-2026 19:58:56
Substituting variable: ${bamboo.agentId} with 153550854
30-Sep-2026 19:58:56
Substituting variable: ${bamboo.agentId} with 153550854
30-Sep-2026 19:58:56
Substituting variable: ${bamboo.agentId} with 153550854
30-Sep-2026 19:58:56 Starting task 'Tar work directory' of type 'com.atlassian.bamboo.plugins.scripttask:task.builder.script'
30-Sep-2026 19:58:56
Beginning to execute external process for build 'CASASPECS - Dev Test 3.12 - CAS-14849 - Test Tasks Many Linux 2.28 Py3.12 #4 (CASASPECS-DEVTESTPY312147-TTM228PY312-4)'
... running command line:
/opt/ci_workspace/casa/bamboo/agent6/temp/CASASPECS-DEVTESTPY312147-TTM228PY312-4-ScriptBuildTask-3013707216933759499.sh
... in: /opt/ci_workspace/casa/bamboo/agent6/xml-data/build-dir/CASASPECS-DEVTESTPY312147-TTM228PY312
30-Sep-2026 19:58:56 Package working directory
30-Sep-2026 19:58:56 nosedir/
30-Sep-2026 19:58:56 nosedir/test_casaconfig/
30-Sep-2026 19:58:56 nosedir/test_casaconfig/test_casaconfig.py
30-Sep-2026 19:58:56 nosedir/test_casaconfig/conftest.py
30-Sep-2026 19:58:56 nosedir/test_casaconfig/casa-20260930-235303.log
30-Sep-2026 19:58:56 nosedir/test_casaconfig/short_summary.log
30-Sep-2026 19:58:56 nosedir/test_casaconfig/casa-20260930-235317.log
30-Sep-2026 19:58:56 nosedir/test_casaconfig/casa-20260930-235348.log
30-Sep-2026 19:58:56 nosedir/test_casaconfig/casa-20260930-235833.log
30-Sep-2026 19:58:56 nosedir/xml/
30-Sep-2026 19:58:56 nosedir/xml/test_casaconfig/
30-Sep-2026 19:58:56 nosedir/xml/test_casaconfig/nose.xml
30-Sep-2026 19:58:56 nosedir/summary_of_failed.log
30-Sep-2026 19:58:56 nosedir/requirements.txt
30-Sep-2026 19:58:56 total 79580
30-Sep-2026 19:58:56 -rw-r--r-- 1 casaci 15001  1934136 Sep 30 23:51 casatasks-6.7.7.7a14849.dev3-py3-none-any.whl
30-Sep-2026 19:58:56 -rw-r--r-- 1 casaci root     14991 Sep 30 23:58 casatasks_test.log
30-Sep-2026 19:58:56 -rw-r--r-- 1 casaci 15001   161131 Sep 30 23:51 casatestutils-6.7.7.7a14849.dev3-py3-none-any.whl
30-Sep-2026 19:58:56 -rw-r--r-- 1 casaci 15001 79346793 Sep 30 23:51 casatools-6.7.7.7a14849.dev3-cp312-cp312-manylinux_2_28_x86_64.whl
30-Sep-2026 19:58:56 -rw-r--r-- 1 casaci root       912 Sep 30 23:58 requirements.txt
30-Sep-2026 19:58:56 -rw-r--r-- 1 casaci root      1878 Sep 30 23:58 test_casaconfig.xml
30-Sep-2026 19:58:56 -rw-r--r-- 1 casaci root     12696 Sep 30 23:58 work-manylinux_228_casatasks-3.12.tar.gz
30-Sep-2026 19:58:56 Done packaging working directory
30-Sep-2026 19:58:56 Finished task 'Tar work directory' with result: Success
30-Sep-2026 19:58:56 Starting task 'Parse tests' of type 'com.atlassian.bamboo.plugins.testresultparser:task.testresultparser.junit'
30-Sep-2026 19:58:56 Parsing test results under /opt/ci_workspace/casa/bamboo/agent6/xml-data/build-dir/CASASPECS-DEVTESTPY312147-TTM228PY312...
30-Sep-2026 19:58:56 Failing task since 1 failing test cases were found.
30-Sep-2026 19:58:56 Finished task 'Parse tests' with result: Failed
30-Sep-2026 19:58:56 Running post build plugin 'Docker Container Cleanup'
30-Sep-2026 19:58:56
Beginning to execute external process for build 'CASASPECS - Dev Test 3.12 - CAS-14849 - Test Tasks Many Linux 2.28 Py3.12 #4 (CASASPECS-DEVTESTPY312147-TTM228PY312-4)'
... running command line:
/usr/bin/docker rm -f wheel-container-test_153550854
... in: /opt/ci_workspace/casa/bamboo/agent6/xml-data/build-dir/CASASPECS-DEVTESTPY312147-TTM228PY312
30-Sep-2026 19:58:58 wheel-container-test_153550854
30-Sep-2026 19:58:58 Running post build plugin 'NCover Results Collector'
30-Sep-2026 19:58:58 Running post build plugin 'Build Results Label Collector'
30-Sep-2026 19:58:58 Running post build plugin 'Clover Results Collector'
30-Sep-2026 19:58:58 Running post build plugin 'npm Cache Cleanup'
30-Sep-2026 19:58:58 Running post build plugin 'Artifact Copier'
30-Sep-2026 19:58:58 Publishing an artifact: Workdir
30-Sep-2026 19:58:58 Finished publishing of artifact Non required job artifact Http Compression On : [Workdir], patterns: [work*.tar.gz] anchored at: [wheeldirectory/] in 46.19 ms
30-Sep-2026 19:58:58 Publishing an artifact: XML Directories
30-Sep-2026 19:58:58 Finished publishing of artifact Non required job artifact Http Compression On : [XML Directories], patterns: [**/*.xml] anchored at: [wheeldirectory/] in 21.13 ms
30-Sep-2026 19:58:58 Publishing an artifact: casatasks_test.log
30-Sep-2026 19:58:58 Finished publishing of artifact Non required job artifact Http Compression On : [casatasks_test.log], patterns: [casatasks_test.log] anchored at: [wheeldirectory/] in 10.54 ms
30-Sep-2026 19:58:58 Publishing an artifact: requirements.txt
30-Sep-2026 19:58:58 Finished publishing of artifact Non required job artifact Http Compression On : [requirements.txt], patterns: [requirements.txt] anchored at: [wheeldirectory/] in 15.20 ms
30-Sep-2026 19:58:58 Finalising the build...
30-Sep-2026 19:58:58 Stopping timer.
30-Sep-2026 19:58:58 Build CASASPECS-DEVTESTPY312147-TTM228PY312-4 completed.
30-Sep-2026 19:58:58 Running on server: post build plugin 'Build Hanging Detection Configuration'
30-Sep-2026 19:58:58 Running on server: post build plugin 'NCover Results Collector'
30-Sep-2026 19:58:58 Running on server: post build plugin 'Build Labeller'
30-Sep-2026 19:58:58 Running on server: post build plugin 'Clover Delta Calculator'
30-Sep-2026 19:58:58 Running on server: post build plugin 'Maven Dependencies Postprocessor'
30-Sep-2026 19:58:58 All post build plugins have finished
30-Sep-2026 19:58:58 Generating build results summary...
30-Sep-2026 19:58:58 Saving build results to disk...
30-Sep-2026 19:58:58 Store variable context...
30-Sep-2026 19:58:58 Finished building CASASPECS-DEVTESTPY312147-TTM228PY312-4.