Build: #4 failed
Job: Test Tasks macOS 15 Py3.12 failed
Build log
The build generated 528 lines of output. Download or view full build log.
| 30-Sep-2026 19:50:14 | Build CASASPECS - Dev Test 3.12 - CAS-14849 - Test Tasks macOS 15 Py3.12 #4 (CASASPECS-DEVTESTPY312147-TTARM15PY312-4) is being prepared for building on agent cbt-macos15-test-4, bamboo version: 9.6.26 |
| 30-Sep-2026 19:50:14 | Remote agent on host cbt-macos15-test-4 |
| 30-Sep-2026 19:50:14 | Build working directory is /Users/casaci/bamboohome/xml-data/build-dir/CASASPECS-DEVTESTPY312147-TTARM15PY312 |
| 30-Sep-2026 19:50:14 | Executing build CASASPECS - Dev Test 3.12 - CAS-14849 - Test Tasks macOS 15 Py3.12 #4 (CASASPECS-DEVTESTPY312147-TTARM15PY312-4) |
| 30-Sep-2026 19:50:14 | Starting task 'Source Code Checkout' of type 'com.atlassian.bamboo.plugins.vcs:task.vcs.checkout' |
| 30-Sep-2026 19:50:14 | Build always requires a clean checkout |
| 30-Sep-2026 19:50:14 | Cleaning build directory '/Users/casaci/bamboohome/xml-data/build-dir/CASASPECS-DEVTESTPY312147-TTARM15PY312' |
| 30-Sep-2026 19:50:20 | Checking out into /Users/casaci/bamboohome/xml-data/build-dir/CASASPECS-DEVTESTPY312147-TTARM15PY312 |
| 30-Sep-2026 19:50:20 | Updating source code to revision: 0162b0f21d9253a10cd8a3ebc52b074f3465cdd1 |
| 30-Sep-2026 19:50:20 | Fetching 'refs/heads/CAS-14849' from 'ssh://git@open-bitbucket.nrao.edu:7999/casa/casa6.git'. |
| 30-Sep-2026 19:50:20 | Warning: Permanently added '[127.0.0.1]:49161' (RSA) to the list of known hosts. |
| 30-Sep-2026 19:50:22 | Checking out revision 0162b0f21d9253a10cd8a3ebc52b074f3465cdd1. |
| 30-Sep-2026 19:50:22 | Creating local git repository in '/Users/casaci/bamboohome/xml-data/build-dir/CASASPECS-DEVTESTPY312147-TTARM15PY312/.git'. |
| 30-Sep-2026 19:50:22 | Cloning into '/Users/casaci/bamboohome/xml-data/build-dir/CASASPECS-DEVTESTPY312147-TTARM15PY312'... |
| 30-Sep-2026 19:50:22 | done. |
| 30-Sep-2026 19:50:24 | Switched to a new branch 'CAS-14849' |
| 30-Sep-2026 19:50:24 | branch 'CAS-14849' set up to track 'origin/CAS-14849'. |
| 30-Sep-2026 19:50:24 | Submodule 'casatools/casacore' (https://github.com/casacore/casacore.git) registered for path 'casatools/casacore' |
| 30-Sep-2026 19:50:24 | Submodule 'casatools/grpc-source' (https://github.com/grpc/grpc) registered for path 'casatools/grpc-source' |
| 30-Sep-2026 19:50:24 | Cloning into '/Users/casaci/bamboohome/xml-data/build-dir/CASASPECS-DEVTESTPY312147-TTARM15PY312/casatools/casacore'... |
| 30-Sep-2026 19:50:30 | Cloning into '/Users/casaci/bamboohome/xml-data/build-dir/CASASPECS-DEVTESTPY312147-TTARM15PY312/casatools/grpc-source'... |
| 30-Sep-2026 19:50:52 | Submodule path 'casatools/casacore': checked out 'aaf72eb7edd5a5fecefa78ca04713233b7b6ffd6' |
| 30-Sep-2026 19:50:53 | Submodule path 'casatools/grpc-source': checked out 'cca868ac8f3641df4003a82b7fc54c921e14f765' |
| 30-Sep-2026 19:50:53 | Submodule 'third_party/abseil-cpp' (https://github.com/abseil/abseil-cpp) registered for path 'casatools/grpc-source/third_party/abseil-cpp' |
| 30-Sep-2026 19:50:53 | Submodule 'third_party/benchmark' (https://github.com/google/benchmark) registered for path 'casatools/grpc-source/third_party/benchmark' |
| 30-Sep-2026 19:50:53 | Submodule 'third_party/bloaty' (https://github.com/google/bloaty.git) registered for path 'casatools/grpc-source/third_party/bloaty' |
| 30-Sep-2026 19:50:53 | Submodule 'third_party/boringssl' (https://github.com/google/boringssl.git) registered for path 'casatools/grpc-source/third_party/boringssl' |
| 30-Sep-2026 19:50:53 | Submodule 'third_party/boringssl-with-bazel' (https://github.com/google/boringssl.git) registered for path 'casatools/grpc-source/third_party/boringssl-with-bazel' |
| 30-Sep-2026 19:50:53 | Submodule 'third_party/cares/cares' (https://github.com/c-ares/c-ares.git) registered for path 'casatools/grpc-source/third_party/cares/cares' |
| 30-Sep-2026 19:50:53 | Submodule 'third_party/gflags' (https://github.com/gflags/gflags.git) registered for path 'casatools/grpc-source/third_party/gflags' |
| 30-Sep-2026 19:50:53 | Submodule 'third_party/googletest' (https://github.com/google/googletest.git) registered for path 'casatools/grpc-source/third_party/googletest' |
| 30-Sep-2026 19:50:53 | Submodule 'third_party/protobuf' (https://github.com/google/protobuf.git) registered for path 'casatools/grpc-source/third_party/protobuf' |
| 30-Sep-2026 19:50:53 | Submodule 'third_party/zlib' (https://github.com/madler/zlib) registered for path 'casatools/grpc-source/third_party/zlib' |
| 30-Sep-2026 19:50:53 | Cloning into '/Users/casaci/bamboohome/xml-data/build-dir/CASASPECS-DEVTESTPY312147-TTARM15PY312/casatools/grpc-source/third_party/abseil-cpp'... |
| 30-Sep-2026 19:50:54 | Cloning into '/Users/casaci/bamboohome/xml-data/build-dir/CASASPECS-DEVTESTPY312147-TTARM15PY312/casatools/grpc-source/third_party/benchmark'... |
| 30-Sep-2026 19:50:55 | Cloning into '/Users/casaci/bamboohome/xml-data/build-dir/CASASPECS-DEVTESTPY312147-TTARM15PY312/casatools/grpc-source/third_party/bloaty'... |
| 30-Sep-2026 19:50:55 | Cloning into '/Users/casaci/bamboohome/xml-data/build-dir/CASASPECS-DEVTESTPY312147-TTARM15PY312/casatools/grpc-source/third_party/boringssl'... |
| 30-Sep-2026 19:51:04 | Cloning into '/Users/casaci/bamboohome/xml-data/build-dir/CASASPECS-DEVTESTPY312147-TTARM15PY312/casatools/grpc-source/third_party/boringssl-with-bazel'... |
| 30-Sep-2026 19:51:14 | Cloning into '/Users/casaci/bamboohome/xml-data/build-dir/CASASPECS-DEVTESTPY312147-TTARM15PY312/casatools/grpc-source/third_party/cares/cares'... |
| 30-Sep-2026 19:51:15 | Cloning into '/Users/casaci/bamboohome/xml-data/build-dir/CASASPECS-DEVTESTPY312147-TTARM15PY312/casatools/grpc-source/third_party/gflags'... |
| 30-Sep-2026 19:51:15 | Cloning into '/Users/casaci/bamboohome/xml-data/build-dir/CASASPECS-DEVTESTPY312147-TTARM15PY312/casatools/grpc-source/third_party/googletest'... |
| 30-Sep-2026 19:51:16 | Cloning into '/Users/casaci/bamboohome/xml-data/build-dir/CASASPECS-DEVTESTPY312147-TTARM15PY312/casatools/grpc-source/third_party/protobuf'... |
| 30-Sep-2026 19:51:31 | Cloning into '/Users/casaci/bamboohome/xml-data/build-dir/CASASPECS-DEVTESTPY312147-TTARM15PY312/casatools/grpc-source/third_party/zlib'... |
| 30-Sep-2026 19:51:31 | Submodule path 'casatools/grpc-source/third_party/abseil-cpp': checked out 'cc4bed2d74f7c8717e31f9579214ab52a9c9c610' |
| 30-Sep-2026 19:51:31 | Submodule path 'casatools/grpc-source/third_party/benchmark': checked out '5b7683f49e1e9223cf9927b24f6fd3d6bd82e3f8' |
| 30-Sep-2026 19:51:31 | Submodule path 'casatools/grpc-source/third_party/bloaty': checked out '73594cde8c9a52a102c4341c244c833aa61b9c06' |
| 30-Sep-2026 19:51:31 | Submodule 'third_party/googletest' (https://github.com/google/googletest.git) registered for path 'casatools/grpc-source/third_party/bloaty/third_party/googletest' |
| 30-Sep-2026 19:51:31 | Submodule 'third_party/libFuzzer' (https://chromium.googlesource.com/chromium/llvm-project/llvm/lib/Fuzzer) registered for path 'casatools/grpc-source/third_party/bloaty/third_party/libFuzzer' |
| 30-Sep-2026 19:51:31 | Submodule 'third_party/re2' (https://github.com/google/re2) registered for path 'casatools/grpc-source/third_party/bloaty/third_party/re2' |
| 30-Sep-2026 19:51:31 | Cloning into '/Users/casaci/bamboohome/xml-data/build-dir/CASASPECS-DEVTESTPY312147-TTARM15PY312/casatools/grpc-source/third_party/bloaty/third_party/googletest'... |
| 30-Sep-2026 19:51:32 | Cloning into '/Users/casaci/bamboohome/xml-data/build-dir/CASASPECS-DEVTESTPY312147-TTARM15PY312/casatools/grpc-source/third_party/bloaty/third_party/libFuzzer'... |
| 30-Sep-2026 19:51:33 | Cloning into '/Users/casaci/bamboohome/xml-data/build-dir/CASASPECS-DEVTESTPY312147-TTARM15PY312/casatools/grpc-source/third_party/bloaty/third_party/re2'... |
| 30-Sep-2026 19:51:33 | Submodule path 'casatools/grpc-source/third_party/bloaty/third_party/googletest': checked out 'a2b8a8e07628e5fd60644b6dd99c1b5e7d7f1f47' |
| 30-Sep-2026 19:51:33 | Submodule path 'casatools/grpc-source/third_party/bloaty/third_party/libFuzzer': checked out '1b543d6e5073b56be214394890c9193979a3d7e1' |
| 30-Sep-2026 19:51:33 | Submodule path 'casatools/grpc-source/third_party/bloaty/third_party/re2': checked out 'c964d9b07816f9b52ca692e23b8b3dba33beec54' |
| 30-Sep-2026 19:51:34 | Submodule path 'casatools/grpc-source/third_party/boringssl': checked out 'be2ee342d3781ddb954f91f8a7e660c6f59e87e5' |
| 30-Sep-2026 19:51:34 | Submodule path 'casatools/grpc-source/third_party/boringssl-with-bazel': checked out '886e7d75368e3f4fab3f4d0d3584e4abfc557755' |
| 30-Sep-2026 19:51:34 | Submodule path 'casatools/grpc-source/third_party/cares/cares': checked out '3be1924221e1326df520f8498d704a5c4c8d0cce' |
| 30-Sep-2026 19:51:34 | Submodule path 'casatools/grpc-source/third_party/gflags': checked out '30dbc81fb5ffdc98ea9b14b1918bfe4e8779b26e' |
| 30-Sep-2026 19:51:34 | Submodule 'doc' (https://github.com/gflags/gflags.git) registered for path 'casatools/grpc-source/third_party/gflags/doc' |
| 30-Sep-2026 19:51:34 | Cloning into '/Users/casaci/bamboohome/xml-data/build-dir/CASASPECS-DEVTESTPY312147-TTARM15PY312/casatools/grpc-source/third_party/gflags/doc'... |
| 30-Sep-2026 19:51:35 | Submodule path 'casatools/grpc-source/third_party/gflags/doc': checked out '971dd2a4fadac9cdab174c523c22df79efd63aa5' |
| 30-Sep-2026 19:51:35 | Submodule path 'casatools/grpc-source/third_party/googletest': checked out 'ec44c6c1675c25b9827aacd08c02433cccde7780' |
| 30-Sep-2026 19:51:35 | Submodule path 'casatools/grpc-source/third_party/protobuf': checked out '2761122b810fe8861004ae785cc3ab39f384d342' |
| 30-Sep-2026 19:51:35 | Submodule 'third_party/benchmark' (https://github.com/google/benchmark.git) registered for path 'casatools/grpc-source/third_party/protobuf/third_party/benchmark' |
| 30-Sep-2026 19:51:35 | Cloning into '/Users/casaci/bamboohome/xml-data/build-dir/CASASPECS-DEVTESTPY312147-TTARM15PY312/casatools/grpc-source/third_party/protobuf/third_party/benchmark'... |
| 30-Sep-2026 19:51:36 | Submodule path 'casatools/grpc-source/third_party/protobuf/third_party/benchmark': checked out '360e66c1c4777c99402cf8cd535aa510fee16573' |
| 30-Sep-2026 19:51:36 | Submodule path 'casatools/grpc-source/third_party/zlib': checked out 'cacf7f1d4e3d44d871b605da3b647f07d718623f' |
| 30-Sep-2026 19:51:36 | Updated source code to revision: 0162b0f21d9253a10cd8a3ebc52b074f3465cdd1 |
| 30-Sep-2026 19:51:36 | Finished task 'Source Code Checkout' with result: Success |
| 30-Sep-2026 19:51:36 | Running pre-build action: Build Log Labeller Pre Build Action |
| 30-Sep-2026 19:51:36 | Running pre-build action: VCS Version Collector |
| 30-Sep-2026 19:51:36 | Build CASASPECS - Dev Test 3.12 - CAS-14849 - Test Tasks macOS 15 Py3.12 #4 (CASASPECS-DEVTESTPY312147-TTARM15PY312-4) started building on agent 'cbt-macos15-test-4' (Remote agent on host cbt-macos15-test-4) |
| 30-Sep-2026 19:51:36 | Starting task 'Update data' of type 'com.atlassian.bamboo.plugins.scripttask:task.builder.script' |
| 30-Sep-2026 19:51:36 | Beginning to execute external process for build 'CASASPECS - Dev Test 3.12 - CAS-14849 - Test Tasks macOS 15 Py3.12 #4 (CASASPECS-DEVTESTPY312147-TTARM15PY312-4)' ... running command line: /Users/casaci/bamboohome/temp/CASASPECS-DEVTESTPY312147-TTARM15PY312-4-ScriptBuildTask-7727328249365521216.sh ... in: /Users/casaci/bamboohome/xml-data/build-dir/CASASPECS-DEVTESTPY312147-TTARM15PY312 |
| 30-Sep-2026 19:51:36 | Already up to date. |
| 30-Sep-2026 19:51:36 | Updating ce38223d..486e9fb7 |
| 30-Sep-2026 19:51:37 | error: Your local changes to the following files would be overwritten by merge: |
| 30-Sep-2026 19:51:37 | nrao/VLA/CalModels/3C138_K.im/table.dat |
| 30-Sep-2026 19:51:37 | nrao/VLA/CalModels/3C138_K.im/table.lock |
| 30-Sep-2026 19:51:37 | Please commit your changes or stash them before you merge. |
| 30-Sep-2026 19:51:37 | Aborting |
| 30-Sep-2026 19:51:37 | Done |
| 30-Sep-2026 19:51:37 | Finished task 'Update data' with result: Success |
| 30-Sep-2026 19:51:37 | Starting task 'Create wheel directory' of type 'com.atlassian.bamboo.plugins.scripttask:task.builder.script' |
| 30-Sep-2026 19:51:37 | Beginning to execute external process for build 'CASASPECS - Dev Test 3.12 - CAS-14849 - Test Tasks macOS 15 Py3.12 #4 (CASASPECS-DEVTESTPY312147-TTARM15PY312-4)' ... running command line: /Users/casaci/bamboohome/temp/CASASPECS-DEVTESTPY312147-TTARM15PY312-4-ScriptBuildTask-5964063679335786894.sh ... in: /Users/casaci/bamboohome/xml-data/build-dir/CASASPECS-DEVTESTPY312147-TTARM15PY312 |
| 30-Sep-2026 19:51:37 | Finished task 'Create wheel directory' with result: Success |
| 30-Sep-2026 19:51:37 | Starting task 'Get macOS 15 wheels' of type 'com.atlassian.bamboo.plugins.bamboo-artifact-downloader-plugin:artifactdownloadertask' |
| 30-Sep-2026 19:51:37 | Preparing to download plan result CASASPECS-DBC257-4 artifact: Non required shared artifact Http Compression On : [macOS 15 py3.12 tasks wheel], patterns: [casatasks*.whl] anchored at: [wheels] |
| 30-Sep-2026 19:51:37 | Retrieving artifact macOS 15 py3.12 tasks wheel for CASASPECS-DBC257-4 using Bamboo server artifact handler |
| 30-Sep-2026 19:51:37 | Artifact [macOS 15 py3.12 tasks wheel] downloaded successfully in 144.6 ms to wheeldirectory/ |
| 30-Sep-2026 19:51:37 | Preparing to download plan result CASASPECS-DBC257-4 artifact: Non required shared artifact Http Compression On : [macOS 15 casatestutils 3.12], patterns: [casatestutils*.whl] anchored at: [wheels] |
| 30-Sep-2026 19:51:37 | Retrieving artifact macOS 15 casatestutils 3.12 for CASASPECS-DBC257-4 using Bamboo server artifact handler |
| 30-Sep-2026 19:51:37 | Artifact [macOS 15 casatestutils 3.12] downloaded successfully in 29.33 ms to wheeldirectory/ |
| 30-Sep-2026 19:51:37 | Preparing to download plan result CASASPECS-DBC257-4 artifact: Non required shared artifact Http Compression On : [macOS 15 py3.12 tools wheel], patterns: [casatools*.whl] anchored at: [wheels] |
| 30-Sep-2026 19:51:37 | Retrieving artifact macOS 15 py3.12 tools wheel for CASASPECS-DBC257-4 using Bamboo server artifact handler |
| 30-Sep-2026 19:51:40 | Artifact [macOS 15 py3.12 tools wheel] downloaded successfully in 3.137 s to wheeldirectory/ |
| 30-Sep-2026 19:51:40 | Finished task 'Get macOS 15 wheels' with result: Success |
| 30-Sep-2026 19:51:40 | Substituting variable: ${bamboo.repository.branch.name} with CAS-14849 |
| 30-Sep-2026 19:51:40 | Substituting variable: ${bamboo.planRepository.branchName} with CAS-14849 |
| 30-Sep-2026 19:51:40 | Starting task 'Test wheel' of type 'com.atlassian.bamboo.plugins.scripttask:task.builder.script' |
| 30-Sep-2026 19:51:40 | Beginning to execute external process for build 'CASASPECS - Dev Test 3.12 - CAS-14849 - Test Tasks macOS 15 Py3.12 #4 (CASASPECS-DEVTESTPY312147-TTARM15PY312-4)' ... running command line: /Users/casaci/bamboohome/temp/CASASPECS-DEVTESTPY312147-TTARM15PY312-4-ScriptBuildTask-8972991529077473534.sh ... in: /Users/casaci/bamboohome/xml-data/build-dir/CASASPECS-DEVTESTPY312147-TTARM15PY312 |
| 30-Sep-2026 19:51:40 | branch: CAS-14849 |
| 30-Sep-2026 19:51:40 | branch: CAS-14849 |
| 30-Sep-2026 19:51:40 | Testing wheel |
| 30-Sep-2026 19:51:40 | % Total % Received % Xferd Average Speed Time Time Time Current |
| 30-Sep-2026 19:51:40 | Dload Upload Total Spent Left Speed |
| 30-Sep-2026 19:51:40 | |
| 30-Sep-2026 19:51:40 | 0 0 0 0 0 0 0 0 --:--:-- --:--:-- --:--:-- 0 |
| 30-Sep-2026 19:51:40 | 100 9419k 100 9419k 0 0 78.1M 0 --:--:-- --:--:-- --:--:-- 78.6M |
| 30-Sep-2026 19:51:44 | Ticket fix version: CASA 6.ACTIVE |
| 30-Sep-2026 19:51:44 | No matching version found |
| 30-Sep-2026 19:51:44 | % Total % Received % Xferd Average Speed Time Time Time Current |
| 30-Sep-2026 19:51:44 | Dload Upload Total Spent Left Speed |
| 30-Sep-2026 19:51:44 | |
| 30-Sep-2026 19:51:44 | 0 0 0 0 0 0 0 0 --:--:-- --:--:-- --:--:-- 0 |
| 30-Sep-2026 19:51:44 | 100 201 100 201 0 0 6423 0 --:--:-- --:--:-- --:--:-- 6483 |
| 30-Sep-2026 19:51:44 | % Total % Received % Xferd Average Speed Time Time Time Current |
| 30-Sep-2026 19:51:44 | Dload Upload Total Spent Left Speed |
| 30-Sep-2026 19:51:44 | |
| 30-Sep-2026 19:51:44 | 0 0 0 0 0 0 0 0 --:--:-- --:--:-- --:--:-- 0 |
| 30-Sep-2026 19:51:44 | 100 511 100 511 0 0 17018 0 --:--:-- --:--:-- --:--:-- 17620 |
| 30-Sep-2026 19:51:44 | bamboo_jira_components:'' |
| 30-Sep-2026 19:51:44 | bamboo_testlist:'' |
| 30-Sep-2026 19:51:48 | atlutil components: casaconfig |
| 30-Sep-2026 19:51:48 | Ticket components: casaconfig |
| 30-Sep-2026 19:53:41 | Switched to a new branch 'CAS-14849' |
| 30-Sep-2026 19:53:41 | branch 'CAS-14849' set up to track 'origin/CAS-14849'. |
| 30-Sep-2026 19:53:41 | Updated 0 paths from fb45b40137 |
| 30-Sep-2026 19:53:41 | Updated 0 paths from eb51c69579 |
| 30-Sep-2026 19:53:42 | Requirement already satisfied: pip in /Users/casaci/bamboohome/xml-data/build-dir/CASASPECS-DEVTESTPY312147-TTARM15PY312/casa6testenv/lib/python3.12/site-packages (24.3.1) |
| 30-Sep-2026 19:53:42 | Collecting pip |
| 30-Sep-2026 19:53:42 | Downloading pip-26.2.1-py3-none-any.whl.metadata (4.6 kB) |
| 30-Sep-2026 19:53:42 | Collecting setuptools |
| 30-Sep-2026 19:53:42 | Downloading setuptools-84.0.0-py3-none-any.whl.metadata (6.6 kB) |
| 30-Sep-2026 19:53:42 | Collecting wheel |
| 30-Sep-2026 19:53:42 | Downloading wheel-0.48.0-py3-none-any.whl.metadata (2.3 kB) |
| 30-Sep-2026 19:53:42 | Collecting packaging>=24.0 (from wheel) |
| 30-Sep-2026 19:53:42 | Downloading packaging-26.3-py3-none-any.whl.metadata (3.5 kB) |
| 30-Sep-2026 19:53:42 | Downloading pip-26.2.1-py3-none-any.whl (1.8 MB) |
| 30-Sep-2026 19:53:42 | ━━━━━━━━━━━━━━━━━━━━━━━━━━━━━━━━━━━━━━━━ 1.8/1.8 MB 106.2 MB/s eta 0:00:00 |
| 30-Sep-2026 19:53:42 | Downloading setuptools-84.0.0-py3-none-any.whl (818 kB) |
| 30-Sep-2026 19:53:42 | ━━━━━━━━━━━━━━━━━━━━━━━━━━━━━━━━━━━━━━━ 818.2/818.2 kB 121.6 MB/s eta 0:00:00 |
| 30-Sep-2026 19:53:42 | Downloading wheel-0.48.0-py3-none-any.whl (33 kB) |
| 30-Sep-2026 19:53:42 | Downloading packaging-26.3-py3-none-any.whl (129 kB) |
| 30-Sep-2026 19:53:42 | Installing collected packages: setuptools, pip, packaging, wheel |
| 30-Sep-2026 19:53:42 | Attempting uninstall: pip |
| 30-Sep-2026 19:53:42 | Found existing installation: pip 24.3.1 |
| 30-Sep-2026 19:53:42 | Uninstalling pip-24.3.1: |
| 30-Sep-2026 19:53:42 | Successfully uninstalled pip-24.3.1 |
| 30-Sep-2026 19:53:43 | Successfully installed packaging-26.3 pip-26.2.1 setuptools-84.0.0 wheel-0.48.0 |
| 30-Sep-2026 19:53:43 | Looking in indexes: https://pypi.org/simple, https://test.pypi.org/simple |
| 30-Sep-2026 19:53:43 | Collecting casaconfig==1.5.2.dev1 |
| 30-Sep-2026 19:53:43 | Downloading casaconfig-1.5.2.dev1-py3-none-any.whl.metadata (4.0 kB) |
| 30-Sep-2026 19:53:43 | Collecting certifi>=2023.5.7 (from casaconfig==1.5.2.dev1) |
| 30-Sep-2026 19:53:43 | Using cached certifi-2026.7.22-py3-none-any.whl.metadata (2.5 kB) |
| 30-Sep-2026 19:53:43 | Downloading casaconfig-1.5.2.dev1-py3-none-any.whl (77 kB) |
| 30-Sep-2026 19:53:43 | Using cached certifi-2026.7.22-py3-none-any.whl (136 kB) |
| 30-Sep-2026 19:53:43 | Installing collected packages: certifi, casaconfig |
| 30-Sep-2026 19:53:43 | |
| 30-Sep-2026 19:53:43 | Successfully installed casaconfig-1.5.2.dev1 certifi-2026.7.22 |
| 30-Sep-2026 19:53:44 | Collecting scipy |
| 30-Sep-2026 19:53:44 | Downloading scipy-1.18.1-cp312-cp312-macosx_14_0_arm64.whl.metadata (62 kB) |
| 30-Sep-2026 19:53:44 | Collecting numpy |
| 30-Sep-2026 19:53:44 | Downloading numpy-2.5.3-cp312-cp312-macosx_14_0_arm64.whl.metadata (6.6 kB) |
| 30-Sep-2026 19:53:44 | Downloading scipy-1.18.1-cp312-cp312-macosx_14_0_arm64.whl (20.5 MB) |
| 30-Sep-2026 19:53:44 | ━━━━━━━━━━━━━━━━━━━━━━━━━━━━━━━━━━━━━━━━ 20.5/20.5 MB 99.9 MB/s 0:00:00 |
| 30-Sep-2026 19:53:44 | Downloading numpy-2.5.3-cp312-cp312-macosx_14_0_arm64.whl (5.4 MB) |
| 30-Sep-2026 19:53:44 | ━━━━━━━━━━━━━━━━━━━━━━━━━━━━━━━━━━━━━━━━ 5.4/5.4 MB 86.5 MB/s 0:00:00 |
| 30-Sep-2026 19:53:44 | Installing collected packages: numpy, scipy |
| 30-Sep-2026 19:53:48 | |
| 30-Sep-2026 19:53:48 | Successfully installed numpy-2.5.3 scipy-1.18.1 |
| 30-Sep-2026 19:53:48 | Processing ./casatools-6.7.7.7a14849.dev3-cp312-cp312-macosx_15_0_arm64.whl |
| 30-Sep-2026 19:53:48 | Collecting casaconfig @ git+https://github.com/casangi/casaconfig@1.5.2.dev (from casatools==6.7.7.7a14849.dev3) |
| 30-Sep-2026 19:53:48 | Cloning https://github.com/casangi/casaconfig (to revision 1.5.2.dev) to /private/var/folders/sg/pzxqyflj45l8489gtcfll1v80000gn/T/pip-install-htrtcofj/casaconfig_27352d8d696c442ead896b04142367cd |
| 30-Sep-2026 19:53:48 | Running command git clone --filter=blob:none --quiet https://github.com/casangi/casaconfig /private/var/folders/sg/pzxqyflj45l8489gtcfll1v80000gn/T/pip-install-htrtcofj/casaconfig_27352d8d696c442ead896b04142367cd |
| 30-Sep-2026 19:53:49 | Running command git checkout -b 1.5.2.dev --track origin/1.5.2.dev |
| 30-Sep-2026 19:53:49 | Switched to a new branch '1.5.2.dev' |
| 30-Sep-2026 19:53:49 | branch '1.5.2.dev' set up to track 'origin/1.5.2.dev'. |
| 30-Sep-2026 19:53:49 | Resolved https://github.com/casangi/casaconfig to commit a2e92d41cee0d57a3cc24acb5c71721ec84892cf |
| 30-Sep-2026 19:53:49 | Installing build dependencies: started |
| 30-Sep-2026 19:53:49 | Installing build dependencies: finished with status 'done' |
| 30-Sep-2026 19:53:49 | Getting requirements to build wheel: started |
| 30-Sep-2026 19:53:49 | Getting requirements to build wheel: finished with status 'done' |
| 30-Sep-2026 19:53:49 | Preparing metadata (pyproject.toml): started |
| 30-Sep-2026 19:53:50 | Preparing metadata (pyproject.toml): finished with status 'done' |
| 30-Sep-2026 19:53:50 | Requirement already satisfied: certifi>=2023.5.7 in /Users/casaci/bamboohome/xml-data/build-dir/CASASPECS-DEVTESTPY312147-TTARM15PY312/casa6testenv/lib/python3.12/site-packages (from casaconfig @ git+https://github.com/casangi/casaconfig@1.5.2.dev->casatools==6.7.7.7a14849.dev3) (2026.7.22) |
| 30-Sep-2026 19:53:50 | Installing collected packages: casatools |
| 30-Sep-2026 19:53:50 | Successfully installed casatools-6.7.7.7a14849.dev3 |
| 30-Sep-2026 19:53:51 | Processing ./casatasks-6.7.7.7a14849.dev3-py3-none-any.whl |
| 30-Sep-2026 19:53:51 | Requirement already satisfied: casatools==6.7.7.7a14849.dev3 in /Users/casaci/bamboohome/xml-data/build-dir/CASASPECS-DEVTESTPY312147-TTARM15PY312/casa6testenv/lib/python3.12/site-packages (from casatasks==6.7.7.7a14849.dev3) (6.7.7.7a14849.dev3) |
| 30-Sep-2026 19:53:51 | Collecting matplotlib (from casatasks==6.7.7.7a14849.dev3) |
| 30-Sep-2026 19:53:51 | Using cached matplotlib-3.11.2-cp312-cp312-macosx_11_0_arm64.whl.metadata (80 kB) |
| 30-Sep-2026 19:53:51 | Requirement already satisfied: scipy in /Users/casaci/bamboohome/xml-data/build-dir/CASASPECS-DEVTESTPY312147-TTARM15PY312/casa6testenv/lib/python3.12/site-packages (from casatasks==6.7.7.7a14849.dev3) (1.18.1) |
| 30-Sep-2026 19:53:51 | Requirement already satisfied: certifi in /Users/casaci/bamboohome/xml-data/build-dir/CASASPECS-DEVTESTPY312147-TTARM15PY312/casa6testenv/lib/python3.12/site-packages (from casatasks==6.7.7.7a14849.dev3) (2026.7.22) |
| 30-Sep-2026 19:53:51 | Collecting pyerfa (from casatasks==6.7.7.7a14849.dev3) |
| 30-Sep-2026 19:53:51 | Using cached pyerfa-2.0.1.5-cp39-abi3-macosx_11_0_arm64.whl.metadata (5.7 kB) |
| 30-Sep-2026 19:53:51 | Collecting casaconfig @ git+https://github.com/casangi/casaconfig@1.5.2.dev (from casatools==6.7.7.7a14849.dev3->casatasks==6.7.7.7a14849.dev3) |
| 30-Sep-2026 19:53:51 | Cloning https://github.com/casangi/casaconfig (to revision 1.5.2.dev) to /private/var/folders/sg/pzxqyflj45l8489gtcfll1v80000gn/T/pip-install-978ih27q/casaconfig_886a9ac0d85647bbaddc02c9cbe91da9 |
| 30-Sep-2026 19:53:51 | Running command git clone --filter=blob:none --quiet https://github.com/casangi/casaconfig /private/var/folders/sg/pzxqyflj45l8489gtcfll1v80000gn/T/pip-install-978ih27q/casaconfig_886a9ac0d85647bbaddc02c9cbe91da9 |
| 30-Sep-2026 19:53:51 | Running command git checkout -b 1.5.2.dev --track origin/1.5.2.dev |
| 30-Sep-2026 19:53:51 | Switched to a new branch '1.5.2.dev' |
| 30-Sep-2026 19:53:51 | branch '1.5.2.dev' set up to track 'origin/1.5.2.dev'. |
| 30-Sep-2026 19:53:51 | Resolved https://github.com/casangi/casaconfig to commit a2e92d41cee0d57a3cc24acb5c71721ec84892cf |
| 30-Sep-2026 19:53:51 | Installing build dependencies: started |
| 30-Sep-2026 19:53:52 | Installing build dependencies: finished with status 'done' |
| 30-Sep-2026 19:53:52 | Getting requirements to build wheel: started |
| 30-Sep-2026 19:53:52 | Getting requirements to build wheel: finished with status 'done' |
| 30-Sep-2026 19:53:52 | Preparing metadata (pyproject.toml): started |
| 30-Sep-2026 19:53:52 | Preparing metadata (pyproject.toml): finished with status 'done' |
| 30-Sep-2026 19:53:52 | Collecting contourpy>=1.0.1 (from matplotlib->casatasks==6.7.7.7a14849.dev3) |
| 30-Sep-2026 19:53:52 | Using cached contourpy-1.4.0-cp312-cp312-macosx_11_0_arm64.whl.metadata (3.8 kB) |
| 30-Sep-2026 19:53:52 | Collecting cycler>=0.10 (from matplotlib->casatasks==6.7.7.7a14849.dev3) |
| 30-Sep-2026 19:53:52 | Using cached cycler-0.12.1-py3-none-any.whl.metadata (3.8 kB) |
| 30-Sep-2026 19:53:52 | Collecting fonttools>=4.28.2 (from matplotlib->casatasks==6.7.7.7a14849.dev3) |
| 30-Sep-2026 19:53:52 | Using cached fonttools-4.66.1-cp312-cp312-macosx_10_13_universal2.whl.metadata (130 kB) |
| 30-Sep-2026 19:53:52 | Collecting kiwisolver>=1.3.1 (from matplotlib->casatasks==6.7.7.7a14849.dev3) |
| 30-Sep-2026 19:53:52 | Using cached kiwisolver-1.5.1-cp312-cp312-macosx_11_0_arm64.whl.metadata (5.2 kB) |
| 30-Sep-2026 19:53:52 | Requirement already satisfied: numpy>=1.25 in /Users/casaci/bamboohome/xml-data/build-dir/CASASPECS-DEVTESTPY312147-TTARM15PY312/casa6testenv/lib/python3.12/site-packages (from matplotlib->casatasks==6.7.7.7a14849.dev3) (2.5.3) |
| 30-Sep-2026 19:53:52 | Requirement already satisfied: packaging>=20.0 in /Users/casaci/bamboohome/xml-data/build-dir/CASASPECS-DEVTESTPY312147-TTARM15PY312/casa6testenv/lib/python3.12/site-packages (from matplotlib->casatasks==6.7.7.7a14849.dev3) (26.3) |
| 30-Sep-2026 19:53:52 | Collecting pillow>=9 (from matplotlib->casatasks==6.7.7.7a14849.dev3) |
| 30-Sep-2026 19:53:52 | Using cached pillow-12.3.0-cp312-cp312-macosx_11_0_arm64.whl.metadata (9.1 kB) |
| 30-Sep-2026 19:53:52 | Collecting pyparsing>=3 (from matplotlib->casatasks==6.7.7.7a14849.dev3) |
| 30-Sep-2026 19:53:52 | Using cached pyparsing-3.3.3-py3-none-any.whl.metadata (5.9 kB) |
| 30-Sep-2026 19:53:52 | Collecting python-dateutil>=2.7 (from matplotlib->casatasks==6.7.7.7a14849.dev3) |
| 30-Sep-2026 19:53:52 | Using cached python_dateutil-2.9.0.post0-py2.py3-none-any.whl.metadata (8.4 kB) |
| 30-Sep-2026 19:53:52 | Collecting six>=1.5 (from python-dateutil>=2.7->matplotlib->casatasks==6.7.7.7a14849.dev3) |
| 30-Sep-2026 19:53:52 | Using cached six-1.17.0-py2.py3-none-any.whl.metadata (1.7 kB) |
| 30-Sep-2026 19:53:52 | Using cached matplotlib-3.11.2-cp312-cp312-macosx_11_0_arm64.whl (9.3 MB) |
| 30-Sep-2026 19:53:52 | Using cached contourpy-1.4.0-cp312-cp312-macosx_11_0_arm64.whl (284 kB) |
| 30-Sep-2026 19:53:52 | Using cached cycler-0.12.1-py3-none-any.whl (8.3 kB) |
| 30-Sep-2026 19:53:52 | Using cached fonttools-4.66.1-cp312-cp312-macosx_10_13_universal2.whl (3.1 MB) |
| 30-Sep-2026 19:53:52 | Using cached kiwisolver-1.5.1-cp312-cp312-macosx_11_0_arm64.whl (64 kB) |
| 30-Sep-2026 19:53:52 | Using cached pillow-12.3.0-cp312-cp312-macosx_11_0_arm64.whl (4.8 MB) |
| 30-Sep-2026 19:53:52 | Using cached pyparsing-3.3.3-py3-none-any.whl (126 kB) |
| 30-Sep-2026 19:53:52 | Using cached python_dateutil-2.9.0.post0-py2.py3-none-any.whl (229 kB) |
| 30-Sep-2026 19:53:52 | Using cached six-1.17.0-py2.py3-none-any.whl (11 kB) |
| 30-Sep-2026 19:53:52 | Using cached pyerfa-2.0.1.5-cp39-abi3-macosx_11_0_arm64.whl (329 kB) |
| 30-Sep-2026 19:53:52 | Installing collected packages: six, pyparsing, pyerfa, pillow, kiwisolver, fonttools, cycler, contourpy, python-dateutil, matplotlib, casatasks |
| 30-Sep-2026 19:53:55 | |
| 30-Sep-2026 19:53:55 | Successfully installed casatasks-6.7.7.7a14849.dev3 contourpy-1.4.0 cycler-0.12.1 fonttools-4.66.1 kiwisolver-1.5.1 matplotlib-3.11.2 pillow-12.3.0 pyerfa-2.0.1.5 pyparsing-3.3.3 python-dateutil-2.9.0.post0 six-1.17.0 |
| 30-Sep-2026 19:53:55 | Processing ./casatestutils-6.7.7.7a14849.dev3-py3-none-any.whl |
| 30-Sep-2026 19:53:55 | Collecting pytest>=6.0 (from casatestutils==6.7.7.7a14849.dev3) |
| 30-Sep-2026 19:53:55 | Using cached pytest-9.1.1-py3-none-any.whl.metadata (7.6 kB) |
| 30-Sep-2026 19:53:55 | Collecting astropy (from casatestutils==6.7.7.7a14849.dev3) |
| 30-Sep-2026 19:53:55 | Using cached astropy-8.0.1-cp311-abi3-macosx_11_0_arm64.whl.metadata (11 kB) |
| 30-Sep-2026 19:53:55 | Collecting iniconfig>=1.0.1 (from pytest>=6.0->casatestutils==6.7.7.7a14849.dev3) |
| 30-Sep-2026 19:53:55 | Using cached iniconfig-2.3.0-py3-none-any.whl.metadata (2.5 kB) |
| 30-Sep-2026 19:53:55 | Requirement already satisfied: packaging>=22 in /Users/casaci/bamboohome/xml-data/build-dir/CASASPECS-DEVTESTPY312147-TTARM15PY312/casa6testenv/lib/python3.12/site-packages (from pytest>=6.0->casatestutils==6.7.7.7a14849.dev3) (26.3) |
| 30-Sep-2026 19:53:55 | Collecting pluggy<2,>=1.5 (from pytest>=6.0->casatestutils==6.7.7.7a14849.dev3) |
| 30-Sep-2026 19:53:55 | Using cached pluggy-1.6.0-py3-none-any.whl.metadata (4.8 kB) |
| 30-Sep-2026 19:53:55 | Collecting pygments>=2.7.2 (from pytest>=6.0->casatestutils==6.7.7.7a14849.dev3) |
| 30-Sep-2026 19:53:55 | Using cached pygments-2.21.0-py3-none-any.whl.metadata (2.5 kB) |
| 30-Sep-2026 19:53:55 | Collecting astropy-iers-data>=0.2026.6.22.1.23.34 (from astropy->casatestutils==6.7.7.7a14849.dev3) |
| 30-Sep-2026 19:53:55 | Using cached astropy_iers_data-0.2026.9.28.0.59.37-py3-none-any.whl.metadata (3.4 kB) |
| 30-Sep-2026 19:53:55 | Requirement already satisfied: numpy>=2.0 in /Users/casaci/bamboohome/xml-data/build-dir/CASASPECS-DEVTESTPY312147-TTARM15PY312/casa6testenv/lib/python3.12/site-packages (from astropy->casatestutils==6.7.7.7a14849.dev3) (2.5.3) |
| 30-Sep-2026 19:53:55 | Requirement already satisfied: pyerfa>=2.0.1.3 in /Users/casaci/bamboohome/xml-data/build-dir/CASASPECS-DEVTESTPY312147-TTARM15PY312/casa6testenv/lib/python3.12/site-packages (from astropy->casatestutils==6.7.7.7a14849.dev3) (2.0.1.5) |
| 30-Sep-2026 19:53:55 | Collecting PyYAML>=6.0.0 (from astropy->casatestutils==6.7.7.7a14849.dev3) |
| 30-Sep-2026 19:53:55 | Using cached pyyaml-6.0.3-cp312-cp312-macosx_11_0_arm64.whl.metadata (2.4 kB) |
| 30-Sep-2026 19:53:55 | Using cached pytest-9.1.1-py3-none-any.whl (386 kB) |
| 30-Sep-2026 19:53:55 | Using cached pluggy-1.6.0-py3-none-any.whl (20 kB) |
| 30-Sep-2026 19:53:55 | Using cached iniconfig-2.3.0-py3-none-any.whl (7.5 kB) |
| 30-Sep-2026 19:53:55 | Using cached pygments-2.21.0-py3-none-any.whl (1.3 MB) |
| 30-Sep-2026 19:53:55 | Using cached astropy-8.0.1-cp311-abi3-macosx_11_0_arm64.whl (6.6 MB) |
| 30-Sep-2026 19:53:55 | Using cached astropy_iers_data-0.2026.9.28.0.59.37-py3-none-any.whl (2.0 MB) |
| 30-Sep-2026 19:53:55 | Using cached pyyaml-6.0.3-cp312-cp312-macosx_11_0_arm64.whl (173 kB) |
| 30-Sep-2026 19:53:55 | Installing collected packages: PyYAML, pygments, pluggy, iniconfig, astropy-iers-data, pytest, astropy, casatestutils |
| 30-Sep-2026 19:53:58 | |
| 30-Sep-2026 19:53:58 | Successfully installed PyYAML-6.0.3 astropy-8.0.1 astropy-iers-data-0.2026.9.28.0.59.37 casatestutils-6.7.7.7a14849.dev3 iniconfig-2.3.0 pluggy-1.6.0 pygments-2.21.0 pytest-9.1.1 |
| 30-Sep-2026 19:53:58 | Config: |
| 30-Sep-2026 19:53:58 | datapath=["/opt/casa/data/casa-data", "/opt/casa/data/casatestdata"] |
| 30-Sep-2026 19:53:58 | rundata="/opt/casa/data/casa-data" |
| 30-Sep-2026 19:53:58 | measurespath="/opt/casa/data/casa-data" |
| 30-Sep-2026 19:53:58 | data_auto_update=False |
| 30-Sep-2026 19:53:58 | measures_auto_update=False |
| 30-Sep-2026 19:54:02 | Switched to a new branch 'CAS-14849' |
| 30-Sep-2026 19:54:02 | branch 'CAS-14849' set up to track 'origin/CAS-14849'. |
| 30-Sep-2026 19:54:02 | python runtest.py --ignore_list 'test_casampi,test_task_msview,test_task_imview,test_task_plotms' -t ./casaconfig/tests |
| 30-Sep-2026 19:54:02 | ============================= test session starts ============================== |
| 30-Sep-2026 19:54:02 | platform darwin -- Python 3.12.8, pytest-9.1.1, pluggy-1.6.0 -- /Users/casaci/bamboohome/xml-data/build-dir/CASASPECS-DEVTESTPY312147-TTARM15PY312/casa6testenv/bin/python |
| 30-Sep-2026 19:54:02 | cachedir: .pytest_cache |
| 30-Sep-2026 19:54:02 | rootdir: /Users/casaci/bamboohome/xml-data/build-dir/CASASPECS-DEVTESTPY312147-TTARM15PY312/casa6/casatestutils/nosedir/test_casaconfig |
| 30-Sep-2026 19:54:02 | configfile: pytest.ini |
| 30-Sep-2026 19:54:02 | collecting ... collected 13 items |
| 30-Sep-2026 19:54:02 | |
| 30-Sep-2026 19:54:02 | |
| 30-Sep-2026 19:54:41 | test_casaconfig.py::casaconfig_test::test_auto_install_data |
| 30-Sep-2026 19:54:41 | Test auto install of all data to measurespath on casatools startup |
| 30-Sep-2026 19:54:41 | PASSED |
| 30-Sep-2026 19:54:41 | |
| 30-Sep-2026 19:54:42 | test_casaconfig.py::casaconfig_test::test_auto_update_measures |
| 30-Sep-2026 19:54:42 | Test Automatic Measures Updates to measurespath |
| 30-Sep-2026 19:54:42 | pull_data using version casarundata-2026.02.19-1.tar.gz, acquiring the lock ... |
| 30-Sep-2026 19:54:48 | downloading casarundata contents to /Users/casaci/bamboohome/xml-data/build-dir/CASASPECS-DEVTESTPY312147-TTARM15PY312/casa6/casatestutils/nosedir/test_casaconfig/testrundata (336M) ... done |
| 30-Sep-2026 19:54:57 | casarundata installed casarundata-2026.02.19-1.tar.gz at /Users/casaci/bamboohome/xml-data/build-dir/CASASPECS-DEVTESTPY312147-TTARM15PY312/casa6/casatestutils/nosedir/test_casaconfig/testrundata |
| 30-Sep-2026 19:54:57 | PASSED |
| 30-Sep-2026 19:54:57 | |
| 30-Sep-2026 19:54:57 | test_casaconfig.py::casaconfig_test::test_casaconfig_measures_available |
| 30-Sep-2026 19:54:57 | Test That Today or Yesterday measures data is returned |
| 30-Sep-2026 19:54:57 | FAILED |
| 30-Sep-2026 19:54:57 | |
| 30-Sep-2026 19:55:05 | test_casaconfig.py::casaconfig_test::test_casaconfig_measures_update |
| 30-Sep-2026 19:55:05 | Test downgrade to upgrade measures data to location |
| 30-Sep-2026 19:55:05 | measures_update ... acquiring the lock ... |
| 30-Sep-2026 19:55:05 | A measures update has been requested by the force argument |
| 30-Sep-2026 19:55:05 | ... finding available measures ... |
| 30-Sep-2026 19:55:05 | ... downloading ./WSRT_Measures_20260929-160001.ztar from https://iers.astron.nl/ to /Users/casaci/bamboohome/xml-data/build-dir/CASASPECS-DEVTESTPY312147-TTARM15PY312/casa6/casatestutils/nosedir/test_casaconfig/testmeasures ... |
| 30-Sep-2026 19:55:05 | ... measures data updated at /Users/casaci/bamboohome/xml-data/build-dir/CASASPECS-DEVTESTPY312147-TTARM15PY312/casa6/casatestutils/nosedir/test_casaconfig/testmeasures |
| 30-Sep-2026 19:55:05 | measures_update ... acquiring the lock ... |
| 30-Sep-2026 19:55:05 | ... finding available measures ... |
| 30-Sep-2026 19:55:05 | ... downloading ./WSRT_Measures_20260928-160001.ztar from https://iers.astron.nl/ to /Users/casaci/bamboohome/xml-data/build-dir/CASASPECS-DEVTESTPY312147-TTARM15PY312/casa6/casatestutils/nosedir/test_casaconfig/testmeasures ... |
| 30-Sep-2026 19:55:05 | ... measures data updated at /Users/casaci/bamboohome/xml-data/build-dir/CASASPECS-DEVTESTPY312147-TTARM15PY312/casa6/casatestutils/nosedir/test_casaconfig/testmeasures |
| 30-Sep-2026 19:55:05 | PASSED |
| 30-Sep-2026 19:55:05 | |
| 30-Sep-2026 19:55:05 | test_casaconfig.py::casaconfig_test::test_config_import |
| 30-Sep-2026 19:55:05 | Tests of the config import |
| 30-Sep-2026 19:55:05 | PASSED |
| 30-Sep-2026 19:55:05 | |
| 30-Sep-2026 19:55:06 | test_casaconfig.py::casaconfig_test::test_daily_update |
| 30-Sep-2026 19:55:06 | test that updates do not happen if the installed data is less than 1 day old and do happen when they are older |
| 30-Sep-2026 19:55:06 | pull_data using version casarundata-2025.12.12-1.tar.gz, acquiring the lock ... |
| 30-Sep-2026 19:55:12 | downloading casarundata contents to /Users/casaci/bamboohome/xml-data/build-dir/CASASPECS-DEVTESTPY312147-TTARM15PY312/casa6/casatestutils/nosedir/test_casaconfig/testrundata (336M) ... done |
| 30-Sep-2026 19:55:18 | casarundata installed casarundata-2025.12.12-1.tar.gz at /Users/casaci/bamboohome/xml-data/build-dir/CASASPECS-DEVTESTPY312147-TTARM15PY312/casa6/casatestutils/nosedir/test_casaconfig/testrundata |
| 30-Sep-2026 19:55:18 | data_update: version installed or checked less than 1 day(s) ago, nothing updated or checked |
| 30-Sep-2026 19:55:18 | measures_update: version installed or checked less than 1 day(s) ago, nothing updated or checked |
| 30-Sep-2026 19:55:18 | data_update: version installed or checked less than 1 day(s) ago, nothing updated or checked |
| 30-Sep-2026 19:55:18 | measures_update ... acquiring the lock ... |
| 30-Sep-2026 19:55:18 | ... finding available measures ... |
| 30-Sep-2026 19:55:18 | ... downloading ./WSRT_Measures_20260929-160001.ztar from https://iers.astron.nl/ to /Users/casaci/bamboohome/xml-data/build-dir/CASASPECS-DEVTESTPY312147-TTARM15PY312/casa6/casatestutils/nosedir/test_casaconfig/testrundata ... |
| 30-Sep-2026 19:55:18 | ... measures data updated at /Users/casaci/bamboohome/xml-data/build-dir/CASASPECS-DEVTESTPY312147-TTARM15PY312/casa6/casatestutils/nosedir/test_casaconfig/testrundata |
| 30-Sep-2026 19:55:18 | data_update using version casarundata-2026.02.19-1.tar.gz, acquiring the lock ... |
| 30-Sep-2026 19:55:18 | Removing files using manifest from previous install of casarundata-2025.12.12-1.tar.gz on 2026-09-30 |
| 30-Sep-2026 19:55:25 | downloading casarundata contents to /Users/casaci/bamboohome/xml-data/build-dir/CASASPECS-DEVTESTPY312147-TTARM15PY312/casa6/casatestutils/nosedir/test_casaconfig/testrundata (336M) ... done |
| 30-Sep-2026 19:55:32 | casarundata installed casarundata-2026.02.19-1.tar.gz at /Users/casaci/bamboohome/xml-data/build-dir/CASASPECS-DEVTESTPY312147-TTARM15PY312/casa6/casatestutils/nosedir/test_casaconfig/testrundata |
| 30-Sep-2026 19:55:32 | measures_update ... acquiring the lock ... |
| 30-Sep-2026 19:55:32 | ... finding available measures ... |
| 30-Sep-2026 19:55:32 | ... downloading ./WSRT_Measures_20260929-160001.ztar from https://iers.astron.nl/ to /Users/casaci/bamboohome/xml-data/build-dir/CASASPECS-DEVTESTPY312147-TTARM15PY312/casa6/casatestutils/nosedir/test_casaconfig/testrundata ... |
| 30-Sep-2026 19:55:32 | ... measures data updated at /Users/casaci/bamboohome/xml-data/build-dir/CASASPECS-DEVTESTPY312147-TTARM15PY312/casa6/casatestutils/nosedir/test_casaconfig/testrundata |
| 30-Sep-2026 19:55:32 | PASSED |
| 30-Sep-2026 19:55:32 | |
| 30-Sep-2026 19:55:32 | test_casaconfig.py::casaconfig_test::test_exceptions_no_data |
| 30-Sep-2026 19:55:32 | test that exceptions that do not require any data happen when expected |
| 30-Sep-2026 19:55:32 | PASSED |
| 30-Sep-2026 19:55:32 | |
| 30-Sep-2026 19:55:33 | test_casaconfig.py::casaconfig_test::test_exceptions_with_data |
| 30-Sep-2026 19:55:33 | test that exceptions that require data happen when expected |
| 30-Sep-2026 19:55:33 | pull_data using version casarundata-2026.02.19-1.tar.gz, acquiring the lock ... |
| 30-Sep-2026 19:55:39 | downloading casarundata contents to /Users/casaci/bamboohome/xml-data/build-dir/CASASPECS-DEVTESTPY312147-TTARM15PY312/casa6/casatestutils/nosedir/test_casaconfig/testrundata (336M) ... done |
| 30-Sep-2026 19:55:41 | lock file is not empty : /Users/casaci/bamboohome/xml-data/build-dir/CASASPECS-DEVTESTPY312147-TTARM15PY312/casa6/casatestutils/nosedir/test_casaconfig/testrundata/data_update.lock |
| 30-Sep-2026 19:55:41 | The lock file at /Users/casaci/bamboohome/xml-data/build-dir/CASASPECS-DEVTESTPY312147-TTARM15PY312/casa6/casatestutils/nosedir/test_casaconfig/testrundata is not empty. |
| 30-Sep-2026 19:55:41 | A previous attempt to update path may have failed or exited prematurely. |
| 30-Sep-2026 19:55:41 | Remove the lock file and set force to True with the desired version (default to most recent). |
| 30-Sep-2026 19:55:41 | It may be best to completely repopulate path using pull_data and measures_update. |
| 30-Sep-2026 19:55:41 | lock file is not empty : /Users/casaci/bamboohome/xml-data/build-dir/CASASPECS-DEVTESTPY312147-TTARM15PY312/casa6/casatestutils/nosedir/test_casaconfig/testrundata/data_update.lock |
| 30-Sep-2026 19:55:41 | data_update: the lock file at /Users/casaci/bamboohome/xml-data/build-dir/CASASPECS-DEVTESTPY312147-TTARM15PY312/casa6/casatestutils/nosedir/test_casaconfig/testrundata is not empty. |
| 30-Sep-2026 19:55:41 | A previous attempt to update path may have failed or exited prematurely. |
| 30-Sep-2026 19:55:41 | Remove the lock file and set force to True with the desired version (default to most recent). |
| 30-Sep-2026 19:55:41 | It may be best to completely re-populate path using pull_data and measures_update. |
| 30-Sep-2026 19:55:41 | casarundata installed casarundata-2026.02.19-1.tar.gz at /Users/casaci/bamboohome/xml-data/build-dir/CASASPECS-DEVTESTPY312147-TTARM15PY312/casa6/casatestutils/nosedir/test_casaconfig/testrundata |
| 30-Sep-2026 19:55:41 | measures_update ... acquiring the lock ... |
| 30-Sep-2026 19:55:41 | data_update using version casarundata-2024.02.09-1.tar.gz, acquiring the lock ... |
| 30-Sep-2026 19:55:41 | PASSED |
| 30-Sep-2026 19:55:41 | |
| 30-Sep-2026 19:55:41 | test_casaconfig.py::casaconfig_test::test_file_exists |
| 30-Sep-2026 19:55:41 | Test Default config.py exists in casaconfig module |
| 30-Sep-2026 19:55:41 | PASSED |
| 30-Sep-2026 19:55:41 | |
| 30-Sep-2026 19:55:44 | test_casaconfig.py::casaconfig_test::test_import_casatools_bad_measurespath |
| 30-Sep-2026 19:55:44 | Test that import casatools will return ImportError with measurespath set to an empty directory that cannot be written to |
| 30-Sep-2026 19:55:44 | PASSED |
| 30-Sep-2026 19:55:44 | |
| 30-Sep-2026 19:58:01 | measures_update can't find specified version ./WSRT_Measures_20260927-160001.ztar at site https://go.nrao.edu/iers/ |
| 30-Sep-2026 20:00:28 | measures_update can't find specified version NRAO_Measures_20260926-140503.ztar at site https://iers.astron.nl/ |
| 30-Sep-2026 20:00:28 | Unable to retrieve list of available measures versions, measures_site value may be an empty list or no files were found at measures_site, check and try again. |
| 30-Sep-2026 20:00:28 | There was a remote error while attempting to update measures at /Users/casaci/bamboohome/xml-data/build-dir/CASASPECS-DEVTESTPY312147-TTARM15PY312/casa6/casatestutils/nosedir/test_casaconfig/testmeasures |
| 30-Sep-2026 20:00:28 | Check the value of measures_site and try again |
| 30-Sep-2026 20:00:29 | test_casaconfig.py::casaconfig_test::test_measures_site |
| 30-Sep-2026 20:00:29 | tests related to measures site |
| 30-Sep-2026 20:00:29 | Warning: the most recent measures tar file at each of the sites was older than config.measures_site_interval |
| 30-Sep-2026 20:00:29 | https://iers.astron.nl/ had the most recent measures tar file, returning that list |
| 30-Sep-2026 20:00:29 | Warning: the most recent measures tar file at each of the sites was older than config.measures_site_interval |
| 30-Sep-2026 20:00:29 | https://go.nrao.edu/iers/ had the most recent measures tar file, returning that list |
| 30-Sep-2026 20:00:29 | measures_update ... acquiring the lock ... |
| 30-Sep-2026 20:00:29 | A measures update has been requested by the force argument |
| 30-Sep-2026 20:00:29 | ... finding available measures ... |
| 30-Sep-2026 20:00:29 | ... downloading ./WSRT_Measures_20260929-160001.ztar from https://iers.astron.nl/ to /Users/casaci/bamboohome/xml-data/build-dir/CASASPECS-DEVTESTPY312147-TTARM15PY312/casa6/casatestutils/nosedir/test_casaconfig/testmeasures ... |
| 30-Sep-2026 20:00:29 | ... measures data updated at /Users/casaci/bamboohome/xml-data/build-dir/CASASPECS-DEVTESTPY312147-TTARM15PY312/casa6/casatestutils/nosedir/test_casaconfig/testmeasures |
| 30-Sep-2026 20:00:29 | di : {'site': 'https://iers.astron.nl/', 'version': './WSRT_Measures_20260929-160001.ztar', 'date': '2026-09-30', 'age': 2.064086772777416e-09} |
| 30-Sep-2026 20:00:29 | measures_update ... acquiring the lock ... |
| 30-Sep-2026 20:00:29 | A measures update has been requested by the force argument |
| 30-Sep-2026 20:00:29 | ... finding available measures ... |
| 30-Sep-2026 20:00:29 | ... downloading ./WSRT_Measures_20260927-160001.ztar from https://iers.astron.nl/ to /Users/casaci/bamboohome/xml-data/build-dir/CASASPECS-DEVTESTPY312147-TTARM15PY312/casa6/casatestutils/nosedir/test_casaconfig/testmeasures ... |
| 30-Sep-2026 20:00:29 | ... measures data updated at /Users/casaci/bamboohome/xml-data/build-dir/CASASPECS-DEVTESTPY312147-TTARM15PY312/casa6/casatestutils/nosedir/test_casaconfig/testmeasures |
| 30-Sep-2026 20:00:29 | measures_update ... acquiring the lock ... |
| 30-Sep-2026 20:00:29 | A measures update has been requested by the force argument |
| 30-Sep-2026 20:00:29 | ... finding available measures ... |
| 30-Sep-2026 20:00:29 | ... downloading ./WSRT_Measures_20260927-160001.ztar from https://iers.astron.nl/ to /Users/casaci/bamboohome/xml-data/build-dir/CASASPECS-DEVTESTPY312147-TTARM15PY312/casa6/casatestutils/nosedir/test_casaconfig/testmeasures ... |
| 30-Sep-2026 20:00:29 | ... measures data updated at /Users/casaci/bamboohome/xml-data/build-dir/CASASPECS-DEVTESTPY312147-TTARM15PY312/casa6/casatestutils/nosedir/test_casaconfig/testmeasures |
| 30-Sep-2026 20:00:29 | measures_update ... acquiring the lock ... |
| 30-Sep-2026 20:00:29 | A measures update has been requested by the force argument |
| 30-Sep-2026 20:00:29 | ... finding available measures ... |
| 30-Sep-2026 20:00:29 | ... downloading ./WSRT_Measures_20260929-160001.ztar from https://iers.astron.nl/ to /Users/casaci/bamboohome/xml-data/build-dir/CASASPECS-DEVTESTPY312147-TTARM15PY312/casa6/casatestutils/nosedir/test_casaconfig/testmeasures ... |
| 30-Sep-2026 20:00:29 | ... measures data updated at /Users/casaci/bamboohome/xml-data/build-dir/CASASPECS-DEVTESTPY312147-TTARM15PY312/casa6/casatestutils/nosedir/test_casaconfig/testmeasures |
| 30-Sep-2026 20:00:29 | measures_update ... acquiring the lock ... |
| 30-Sep-2026 20:00:29 | A measures update has been requested by the force argument |
| 30-Sep-2026 20:00:29 | ... finding available measures ... |
| 30-Sep-2026 20:00:29 | measures_update ... acquiring the lock ... |
| 30-Sep-2026 20:00:29 | A measures update has been requested by the force argument |
| 30-Sep-2026 20:00:29 | ... finding available measures ... |
| 30-Sep-2026 20:00:29 | ... downloading NRAO_Measures_20260926-140503.ztar from https://go.nrao.edu/iers/ to /Users/casaci/bamboohome/xml-data/build-dir/CASASPECS-DEVTESTPY312147-TTARM15PY312/casa6/casatestutils/nosedir/test_casaconfig/testmeasures ... |
| 30-Sep-2026 20:00:29 | ... measures data updated at /Users/casaci/bamboohome/xml-data/build-dir/CASASPECS-DEVTESTPY312147-TTARM15PY312/casa6/casatestutils/nosedir/test_casaconfig/testmeasures |
| 30-Sep-2026 20:00:29 | measures_update ... acquiring the lock ... |
| 30-Sep-2026 20:00:29 | A measures update has been requested by the force argument |
| 30-Sep-2026 20:00:29 | ... finding available measures ... |
| 30-Sep-2026 20:00:29 | ... downloading NRAO_Measures_20260926-140503.ztar from https://go.nrao.edu/iers/ to /Users/casaci/bamboohome/xml-data/build-dir/CASASPECS-DEVTESTPY312147-TTARM15PY312/casa6/casatestutils/nosedir/test_casaconfig/testmeasures ... |
| 30-Sep-2026 20:00:29 | ... measures data updated at /Users/casaci/bamboohome/xml-data/build-dir/CASASPECS-DEVTESTPY312147-TTARM15PY312/casa6/casatestutils/nosedir/test_casaconfig/testmeasures |
| 30-Sep-2026 20:00:29 | measures_update ... acquiring the lock ... |
| 30-Sep-2026 20:00:29 | A measures update has been requested by the force argument |
| 30-Sep-2026 20:00:29 | ... finding available measures ... |
| 30-Sep-2026 20:00:29 | ... downloading NRAO_Measures_20260929-140558.ztar from https://go.nrao.edu/iers/ to /Users/casaci/bamboohome/xml-data/build-dir/CASASPECS-DEVTESTPY312147-TTARM15PY312/casa6/casatestutils/nosedir/test_casaconfig/testmeasures ... |
| 30-Sep-2026 20:00:29 | ... measures data updated at /Users/casaci/bamboohome/xml-data/build-dir/CASASPECS-DEVTESTPY312147-TTARM15PY312/casa6/casatestutils/nosedir/test_casaconfig/testmeasures |
| 30-Sep-2026 20:00:29 | measures_update ... acquiring the lock ... |
| 30-Sep-2026 20:00:29 | A measures update has been requested by the force argument |
| 30-Sep-2026 20:00:29 | ... finding available measures ... |
| 30-Sep-2026 20:00:29 | measures_update ... acquiring the lock ... |
| 30-Sep-2026 20:00:29 | A measures update has been requested by the force argument |
| 30-Sep-2026 20:00:29 | ... finding available measures ... |
| 30-Sep-2026 20:00:29 | PASSED |
| 30-Sep-2026 20:00:29 | |
| 30-Sep-2026 20:00:29 | test_casaconfig.py::casaconfig_test::test_read_measurespath_from_user_config |
| 30-Sep-2026 20:00:29 | Test casaconfig downloads specific measures data to location and casatools reads that data location |
| 30-Sep-2026 20:00:29 | pull_data using version casarundata-2026.02.19-1.tar.gz, acquiring the lock ... |
| 30-Sep-2026 20:00:36 | downloading casarundata contents to /Users/casaci/bamboohome/xml-data/build-dir/CASASPECS-DEVTESTPY312147-TTARM15PY312/casa6/casatestutils/nosedir/test_casaconfig/testrundata (336M) ... done |
| 30-Sep-2026 20:00:44 | casarundata installed casarundata-2026.02.19-1.tar.gz at /Users/casaci/bamboohome/xml-data/build-dir/CASASPECS-DEVTESTPY312147-TTARM15PY312/casa6/casatestutils/nosedir/test_casaconfig/testrundata |
| 30-Sep-2026 20:00:44 | PASSED |
| 30-Sep-2026 20:00:44 | |
| 30-Sep-2026 20:00:44 | test_casaconfig.py::casaconfig_test::test_update_interval |
| 30-Sep-2026 20:00:44 | tests use of config update_interval values |
| 30-Sep-2026 20:00:44 | pull_data using version casarundata-2026.02.19-1.tar.gz, acquiring the lock ... |
| 30-Sep-2026 20:00:51 | downloading casarundata contents to /Users/casaci/bamboohome/xml-data/build-dir/CASASPECS-DEVTESTPY312147-TTARM15PY312/casa6/casatestutils/nosedir/test_casaconfig/testrundata (336M) ... done |
| 30-Sep-2026 20:00:53 | casarundata installed casarundata-2026.02.19-1.tar.gz at /Users/casaci/bamboohome/xml-data/build-dir/CASASPECS-DEVTESTPY312147-TTARM15PY312/casa6/casatestutils/nosedir/test_casaconfig/testrundata |
| 30-Sep-2026 20:00:53 | data_update using version casarundata-2025.12.12-1.tar.gz, acquiring the lock ... |
| 30-Sep-2026 20:00:53 | Removing files using manifest from previous install of casarundata-2026.02.19-1.tar.gz on 2026-09-30 |
| 30-Sep-2026 20:00:59 | downloading casarundata contents to /Users/casaci/bamboohome/xml-data/build-dir/CASASPECS-DEVTESTPY312147-TTARM15PY312/casa6/casatestutils/nosedir/test_casaconfig/testrundata (336M) ... done |
| 30-Sep-2026 20:01:01 | casarundata installed casarundata-2025.12.12-1.tar.gz at /Users/casaci/bamboohome/xml-data/build-dir/CASASPECS-DEVTESTPY312147-TTARM15PY312/casa6/casatestutils/nosedir/test_casaconfig/testrundata |
| 30-Sep-2026 20:01:01 | data_update: version installed or checked less than 1 day(s) ago, nothing updated or checked |
| 30-Sep-2026 20:01:01 | data_update using version casarundata-2026.02.19-1.tar.gz, acquiring the lock ... |
| 30-Sep-2026 20:01:01 | Removing files using manifest from previous install of casarundata-2025.12.12-1.tar.gz on 2026-09-30 |
| 30-Sep-2026 20:01:07 | downloading casarundata contents to /Users/casaci/bamboohome/xml-data/build-dir/CASASPECS-DEVTESTPY312147-TTARM15PY312/casa6/casatestutils/nosedir/test_casaconfig/testrundata (336M) ... done |
| 30-Sep-2026 20:01:18 | casarundata installed casarundata-2026.02.19-1.tar.gz at /Users/casaci/bamboohome/xml-data/build-dir/CASASPECS-DEVTESTPY312147-TTARM15PY312/casa6/casatestutils/nosedir/test_casaconfig/testrundata |
| 30-Sep-2026 20:01:18 | measures_update ... acquiring the lock ... |
| 30-Sep-2026 20:01:18 | A measures update has been requested by the force argument |
| 30-Sep-2026 20:01:18 | ... finding available measures ... |
| 30-Sep-2026 20:01:18 | ... downloading ./WSRT_Measures_20260928-160001.ztar from https://iers.astron.nl/ to /Users/casaci/bamboohome/xml-data/build-dir/CASASPECS-DEVTESTPY312147-TTARM15PY312/casa6/casatestutils/nosedir/test_casaconfig/testrundata ... |
| 30-Sep-2026 20:01:18 | ... measures data updated at /Users/casaci/bamboohome/xml-data/build-dir/CASASPECS-DEVTESTPY312147-TTARM15PY312/casa6/casatestutils/nosedir/test_casaconfig/testrundata |
| 30-Sep-2026 20:01:18 | measures_update: version installed or checked less than 1 day(s) ago, nothing updated or checked |
| 30-Sep-2026 20:01:18 | measures_update ... acquiring the lock ... |
| 30-Sep-2026 20:01:18 | ... finding available measures ... |
| 30-Sep-2026 20:01:18 | ... downloading ./WSRT_Measures_20260929-160001.ztar from https://iers.astron.nl/ to /Users/casaci/bamboohome/xml-data/build-dir/CASASPECS-DEVTESTPY312147-TTARM15PY312/casa6/casatestutils/nosedir/test_casaconfig/testrundata ... |
| 30-Sep-2026 20:01:18 | ... measures data updated at /Users/casaci/bamboohome/xml-data/build-dir/CASASPECS-DEVTESTPY312147-TTARM15PY312/casa6/casatestutils/nosedir/test_casaconfig/testrundata |
| 30-Sep-2026 20:01:18 | PASSED |
| 30-Sep-2026 20:01:18 | |
| 30-Sep-2026 20:01:18 | =================================== FAILURES =================================== |
| 30-Sep-2026 20:01:18 | ______________ casaconfig_test.test_casaconfig_measures_available ______________ |
| 30-Sep-2026 20:01:18 | test_casaconfig.py:176: in test_casaconfig_measures_available |
| 30-Sep-2026 20:01:18 | self.assertTrue(any(elem in self.get_meas_avail() for elem in [measuresdata_today, measuresdata_yesterday])) |
| 30-Sep-2026 20:01:18 | E AssertionError: False is not true |
| 30-Sep-2026 20:01:18 | - generated xml file: /Users/casaci/bamboohome/xml-data/build-dir/CASASPECS-DEVTESTPY312147-TTARM15PY312/casa6/casatestutils/nosedir/xml/test_casaconfig/nose.xml - |
| 30-Sep-2026 20:01:18 | =========================== short test summary info ============================ |
| 30-Sep-2026 20:01:18 | FAILED test_casaconfig.py::casaconfig_test::test_casaconfig_measures_available |
| 30-Sep-2026 20:01:18 | ============= 1 failed, 12 passed, 1 warning in 435.43s (0:07:15) ============== |
| 30-Sep-2026 20:01:18 | Namespace(list=False, verbose=False, dry_run=False, classes=None, file=None, mapfile=None, branch=None, merge_target=None, pkg=None, work_dir=None, ncores=2, test_paths='./casaconfig/tests', test_list=None, test_config=None, test_group=None, pmode=None, bamboo=False, cachedir=None, ignore_list='test_casampi,test_task_msview,test_task_imview,test_task_plotms', run_skipped=False, only_skipped=False) |
| 30-Sep-2026 20:01:18 | |
| 30-Sep-2026 20:01:18 | Operating system: Darwin |
| 30-Sep-2026 20:01:18 | |
| 30-Sep-2026 20:01:18 | Arguments Sent Direct To Pytest : [] |
| 30-Sep-2026 20:01:18 | |
| 30-Sep-2026 20:01:18 | Tests to Ignore: ['test_casampi', 'test_task_msview', 'test_task_imview', 'test_task_plotms'] |
| 30-Sep-2026 20:01:18 | Running 1 Test(s) |
| 30-Sep-2026 20:01:18 | Cleaning: /Users/casaci/bamboohome/xml-data/build-dir/CASASPECS-DEVTESTPY312147-TTARM15PY312/casa6/casatestutils/nosedir/ |
| 30-Sep-2026 20:01:18 | Tests: ['/Users/casaci/bamboohome/xml-data/build-dir/CASASPECS-DEVTESTPY312147-TTARM15PY312/casa6/casatestutils/casaconfig/tests/test_casaconfig.py'] |
| 30-Sep-2026 20:01:18 | |
| 30-Sep-2026 20:01:18 | Setting Working Directory: /Users/casaci/bamboohome/xml-data/build-dir/CASASPECS-DEVTESTPY312147-TTARM15PY312/casa6/casatestutils/nosedir/test_casaconfig/ |
| 30-Sep-2026 20:01:18 | Test Directory: /Users/casaci/bamboohome/xml-data/build-dir/CASASPECS-DEVTESTPY312147-TTARM15PY312/casa6/casatestutils/nosedir/test_casaconfig |
| 30-Sep-2026 20:01:18 | |
| 30-Sep-2026 20:01:18 | Running Command: pytest --junitxml=/Users/casaci/bamboohome/xml-data/build-dir/CASASPECS-DEVTESTPY312147-TTARM15PY312/casa6/casatestutils/nosedir/xml/test_casaconfig/nose.xml -s --disable-pytest-warnings --verbose -ra --tb=short /Users/casaci/bamboohome/xml-data/build-dir/CASASPECS-DEVTESTPY312147-TTARM15PY312/casa6/casatestutils/nosedir/test_casaconfig/ |
| 30-Sep-2026 20:01:18 | a nosedir |
| 30-Sep-2026 20:01:18 | a nosedir/summary_of_failed.log |
| 30-Sep-2026 20:01:18 | a nosedir/xml |
| 30-Sep-2026 20:01:18 | a nosedir/test_casaconfig |
| 30-Sep-2026 20:01:18 | a nosedir/test_casaconfig/test_casaconfig.py |
| 30-Sep-2026 20:01:18 | a nosedir/test_casaconfig/conftest.py |
| 30-Sep-2026 20:01:18 | a nosedir/test_casaconfig/casa-20260930-235428.log |
| 30-Sep-2026 20:01:18 | a nosedir/test_casaconfig/casa-20260930-235426.log |
| 30-Sep-2026 20:01:18 | a nosedir/test_casaconfig/casa-20260930-235543.log |
| 30-Sep-2026 20:01:18 | a nosedir/test_casaconfig/short_summary.log |
| 30-Sep-2026 20:01:18 | a nosedir/test_casaconfig/casa-20260930-235452.log |
| 30-Sep-2026 20:01:18 | a nosedir/test_casaconfig/casa-20261001-000038.log |
| 30-Sep-2026 20:01:18 | a nosedir/xml/test_casaconfig |
| 30-Sep-2026 20:01:18 | a nosedir/xml/test_casaconfig/nose.xml |
| 30-Sep-2026 20:01:18 | Finished task 'Test wheel' with result: Success |
| 30-Sep-2026 20:01:18 | Starting task 'Parse tests' of type 'com.atlassian.bamboo.plugins.testresultparser:task.testresultparser.junit' |
| 30-Sep-2026 20:01:18 | Parsing test results under /Users/casaci/bamboohome/xml-data/build-dir/CASASPECS-DEVTESTPY312147-TTARM15PY312... |
| 30-Sep-2026 20:01:18 | Failing task since 1 failing test cases were found. |
| 30-Sep-2026 20:01:18 | Finished task 'Parse tests' with result: Failed |
| 30-Sep-2026 20:01:18 | Running post build plugin 'Docker Container Cleanup' |
| 30-Sep-2026 20:01:18 | Running post build plugin 'NCover Results Collector' |
| 30-Sep-2026 20:01:18 | Running post build plugin 'Build Results Label Collector' |
| 30-Sep-2026 20:01:18 | Running post build plugin 'Clover Results Collector' |
| 30-Sep-2026 20:01:18 | Running post build plugin 'npm Cache Cleanup' |
| 30-Sep-2026 20:01:18 | Running post build plugin 'Artifact Copier' |
| 30-Sep-2026 20:01:18 | Publishing an artifact: requirements.txt |
| 30-Sep-2026 20:01:18 | Finished publishing of artifact Non required job artifact Http Compression On : [requirements.txt], patterns: [requirements.txt] anchored at: [wheeldirectory/] in 55.59 ms |
| 30-Sep-2026 20:01:18 | Publishing an artifact: Workdir |
| 30-Sep-2026 20:01:18 | Finished publishing of artifact Non required job artifact Http Compression On : [Workdir], patterns: [work*.tar.gz] anchored at: [wheeldirectory/] in 15.03 ms |
| 30-Sep-2026 20:01:18 | Finalising the build... |
| 30-Sep-2026 20:01:18 | Stopping timer. |
| 30-Sep-2026 20:01:18 | Build CASASPECS-DEVTESTPY312147-TTARM15PY312-4 completed. |
| 30-Sep-2026 20:01:18 | Running on server: post build plugin 'Build Hanging Detection Configuration' |
| 30-Sep-2026 20:01:18 | Running on server: post build plugin 'NCover Results Collector' |
| 30-Sep-2026 20:01:18 | Running on server: post build plugin 'Build Labeller' |
| 30-Sep-2026 20:01:18 | Running on server: post build plugin 'Clover Delta Calculator' |
| 30-Sep-2026 20:01:18 | Running on server: post build plugin 'Maven Dependencies Postprocessor' |
| 30-Sep-2026 20:01:18 | All post build plugins have finished |
| 30-Sep-2026 20:01:18 | Generating build results summary... |
| 30-Sep-2026 20:01:18 | Saving build results to disk... |
| 30-Sep-2026 20:01:18 | Store variable context... |
| 30-Sep-2026 20:01:18 | Finished building CASASPECS-DEVTESTPY312147-TTARM15PY312-4. |