Build: #4 failed Manual run by CASA adm account

Build result summary

Details

Completed
Queue duration
1 second
Duration
14 minutes
Labels
None
Revisions
CASA6
0162b0f21d9253a10cd8a3ebc52b074f3465cdd1
OPEN-CASA-PKG
e5285e68467f01199807a1f1a978aec8a4781be7
Total tests
1424
Failing since
#3 (Manual run by CASA adm account – )

Responsible

  • Bob Garwood Bob Garwood Automatically assigned

Code commits

CASA6
Author Commit Message Commit date
Bob Garwood Bob Garwood 0162b0f21d9253a10cd8a3ebc52b074f3465cdd1 casaconfig to 1.5.2.dev to address issues with failing tests

Tests

Existing test failures 2
Status Test Failing since View job Duration
AssertionError: False is not true
test_casaconfig.py:176: in test_casaconfig_measures_available
    self.assertTrue(any(elem in self.get_meas_avail() for elem in [measuresdata_today, measuresdata_yesterday]))
E   AssertionError: False is not true
AssertionError: False is not true
test_casaconfig.py:176: in test_casaconfig_measures_available
    self.assertTrue(any(elem in self.get_meas_avail() for elem in [measuresdata_today, measuresdata_yesterday]))
E   AssertionError: False is not true
Fixed tests 2
Status Test Failing since View job Duration
Successful test_casaconfig casaconfig_test.test_casaconfig_measures_update
Failing since build #3 (Manual run by CASA adm account) Test Tasks Many Linux 2.28 Py3.12 5 secs
Successful test_casaconfig casaconfig_test.test_casaconfig_measures_update
Failing since build #3 (Manual run by CASA adm account) Test Tasks macOS 15 Py3.12 7 secs