Build: #3 failed Manual run by CASA adm account
Test results
- 1,424 tests in total
- 4 tests failed
- 4 failures are new
- 10 tests were quarantined / skipped
- 66 minutes taken in total.
| Status | Test | View job | Duration | |
|---|---|---|---|---|
| Collapse |
test_casaconfig
casaconfig_test.test_casaconfig_measures_available
|
Test Tasks Many Linux 2.28 Py3.12 | 23 secs | |
AssertionError: False is not true
test_casaconfig.py:176: in test_casaconfig_measures_available
self.assertTrue(any(elem in self.get_meas_avail() for elem in [measuresdata_today, measuresdata_yesterday]))
E AssertionError: False is not true
|
||||
| Collapse |
test_casaconfig
casaconfig_test.test_casaconfig_measures_update
|
Test Tasks Many Linux 2.28 Py3.12 | 1 min | |
AssertionError: False is not true
test_casaconfig.py:197: in test_casaconfig_measures_update
self.assertTrue(newVers == vers)
E AssertionError: False is not true
|
||||
| Collapse |
test_casaconfig
casaconfig_test.test_casaconfig_measures_available
|
Test Tasks macOS 15 Py3.12 | 23 secs | |
AssertionError: False is not true
test_casaconfig.py:176: in test_casaconfig_measures_available
self.assertTrue(any(elem in self.get_meas_avail() for elem in [measuresdata_today, measuresdata_yesterday]))
E AssertionError: False is not true
|
||||
| Collapse |
test_casaconfig
casaconfig_test.test_casaconfig_measures_update
|
Test Tasks macOS 15 Py3.12 | 1 min | |
AssertionError: False is not true
test_casaconfig.py:197: in test_casaconfig_measures_update
self.assertTrue(newVers == vers)
E AssertionError: False is not true
|
||||
| Status | Test | Failing since | View job |
|---|---|---|---|
|
test_tool_sdm
SdmFrommsTest.test12
|
Test Tools Many Linux 2.28 Py3.12 | ||
|
test_tool_sdm
SdmFrommsTest.test10
|
Test Tools Many Linux 2.28 Py3.12 | ||
|
test_tool_sdm
SdmFrommsTest.test12
|
Test Tools macOS 15 Py3.12 | ||
|
test_tool_sdm
SdmFrommsTest.test10
|
Test Tools macOS 15 Py3.12 | ||
|
test_tool_sdm_toms
asdm_import7.test7_lazy3
|
Test Tools Many Linux 2.28 Py3.12 | ||
|
test_tool_sdm_toms
asdm_import7.test7_skiprows1
|
Test Tools Many Linux 2.28 Py3.12 | ||
|
test_tool_sdm_toms
asdm_import7.test7_skiprows1
|
Test Tools macOS 15 Py3.12 | ||
|
test_tool_sdm_toms
asdm_import7.test7_lazy3
|
Test Tools macOS 15 Py3.12 | ||
|
test_tool_simulator
sm_settrop_test.test_smsettrop
|
Test Tools Many Linux 2.28 Py3.12 | ||
|
test_tool_simulator
sm_settrop_test.test_smsettrop
|
Test Tools macOS 15 Py3.12 |