Build: #8 failed Manual run by Akeem Wells
Test results
- 341 tests in total
- 1 test failed
- 17 tests were quarantined / skipped
- 145 minutes taken in total.
| Status | Test | Failing since | View job | Duration | |
|---|---|---|---|---|---|
|
test_widefield
test_widefield_mvc_squint_awp2
|
Failing since build #7 (Manual run by Akeem Wells) | Test Tasks Many Linux 2.28 Remove Casatasks import | 23 mins | ||
AssertionError: False is not true
Traceback (most recent call last):
File "/home/casatest/casa6/casatasks/tests/casashell_tests/test_task_tclean_casashell.py", line 4339, in test_widefield_mvc_squint_awp2
self.assertTrue(self.check_final(report))
AssertionError: False is not true
|
|||||