Build: #8 failed

Job: Test Tasks Many Linux 2.28 Remove Casatasks import failed

widefield mvc squint awp2: Test case result

The below summarizes the result of the test " widefield mvc squint awp2" in build 8 of CASA - Release Engineering Dev Test Full XML 3.12 - CAS-14882 - Test Tasks Many Linux 2.28 Remove Casatasks import.
Description
widefield mvc squint awp2
Test class
test_widefield
Method
test_widefield_mvc_squint_awp2
Duration
23 mins
Status
Failed (Existing Failure)

Error Log

AssertionError: False is not true
Traceback (most recent call last):
  File "/home/casatest/casa6/casatasks/tests/casashell_tests/test_task_tclean_casashell.py", line 4339, in test_widefield_mvc_squint_awp2
    self.assertTrue(self.check_final(report))
AssertionError: False is not true