Build: #8 failed Manual run by Akeem Wells

Build result summary

Details

Completed
Queue duration
1 second
Duration
150 minutes
Labels
None
Revisions
CASA6
2d7c2aeedb405c4621983a18d494e753d8000bc5
OPEN-CASA-PKG
e5285e68467f01199807a1f1a978aec8a4781be7
Total tests
341
Failing since
#7 (Manual run by Akeem Wells – )

Tests

Responsible

This build has been failing since #7
No one has taken responsibility

Configuration changes

Plan configuration has changed since the last successful build. See the plan audit log for more details.

Tests

Existing test failures 1
Status Test Failing since View job Duration
AssertionError: False is not true
Traceback (most recent call last):
  File "/home/casatest/casa6/casatasks/tests/casashell_tests/test_task_tclean_casashell.py", line 4339, in test_widefield_mvc_squint_awp2
    self.assertTrue(self.check_final(report))
AssertionError: False is not true