Build: #8 failed

Job: Test Tasks Many Linux 2.28 Remove Casatasks import failed

Test results

  • 341 tests in total
  • 1 test failed
  • 17 tests were quarantined / skipped
  • 145 minutes taken in total.

Build 8 has the following 1 errors:There were no new test failures since the previous build.

Existing test failures 1
Status Test Failing since Duration
AssertionError: False is not true
Traceback (most recent call last):
  File "/home/casatest/casa6/casatasks/tests/casashell_tests/test_task_tclean_casashell.py", line 4339, in test_widefield_mvc_squint_awp2
    self.assertTrue(self.check_final(report))
AssertionError: False is not true