Build: #8 failed Manual run by Akeem Wells

Logs

The following logs have been generated by the jobs in this branch.
  • Expand all
  • Collapse all
Job Logs
Collapse Test Tasks Many Linux 2.28 Remove Casatasks import Test Tasks Stage Download or View
25-Sep-2026 14:54:55 ----------------------------------------------------------------------
25-Sep-2026 14:54:55 Traceback (most recent call last):
25-Sep-2026 14:54:55   File "/home/casatest/casa6/casatasks/tests/casashell_tests/test_task_tclean_casashell.py", line 4339, in test_widefield_mvc_squint_awp2
25-Sep-2026 14:54:55     self.assertTrue(self.check_final(report))
25-Sep-2026 14:54:55 AssertionError: False is not true
25-Sep-2026 14:54:55
25-Sep-2026 14:54:55 ----------------------------------------------------------------------
25-Sep-2026 14:54:55 Ran 341 tests in 8735.723s
25-Sep-2026 14:54:55
25-Sep-2026 14:54:55 FAILED (failures=1, skipped=17)
25-Sep-2026 14:54:55
25-Sep-2026 14:54:55 Generating XML reports...
25-Sep-2026 14:54:58 CASA exits with a non-zero status : system exit called
25-Sep-2026 14:55:01 total 779068
25-Sep-2026 14:55:01 drwxr-xr-x 5 casaci casaci      4096 Sep 14 02:07 casa-CAS-14882-1-py3.12.el8
25-Sep-2026 14:55:01 -rw-r--r-- 1 casaci  15001 797748744 Sep 25 16:25 casa-CAS-14882-1-py3.12.el8.tar.xz
25-Sep-2026 14:55:01 drwxr-xr-x 2 casaci root        4096 Sep 25 18:55 logs
25-Sep-2026 14:55:01 drwxr-xr-x 2 casaci root        4096 Sep 25 18:55 xml
25-Sep-2026 14:55:02 total 7060
25-Sep-2026 14:55:02 -rw-r--r-- 1 root root 7228026 Sep 25 18:55 test_task_tclean_casashell_out.log
25-Sep-2026 14:55:02 total 136
25-Sep-2026 14:55:02 -rw-r--r-- 1 root root 136414 Sep 25 18:55 test_task_tclean_casashell.py.xml
25-Sep-2026 14:55:07 wheel-container-test
25-Sep-2026 14:55:08 Failing as no matching files has been found and empty artifacts are not allowed.
25-Sep-2026 14:55:08 Unable to publish artifact [Workdir]:
Collapse Test Tasks Many Linux 2.28 Replace Casatasks import with casashell Test Tasks Stage Download or View
25-Sep-2026 12:33:05   File "<frozen runpy>", line 88, in _run_code
25-Sep-2026 12:33:05   File "/home/casatest/casa6/casatasks/tests/casashell_tests/test_task_tclean_casashell.py", line 125, in <module>
25-Sep-2026 12:33:05     from casashell import casalog, delmod, imsubimage, tclean, uvsub, imhead, imsmooth, immath, widebandpbcor, impbcor, flagdata, makemask
25-Sep-2026 12:33:05 ImportError: cannot import name 'casalog' from 'casashell' (/wheeldirectory/casa-CAS-14882-1-py3.12.el8/lib/py/lib/python3.12/site-packages/casashell/__init__.py)
25-Sep-2026 12:33:05
25-Sep-2026 12:33:05 Using user configuration file /home/casatest/.casa/config.py
25-Sep-2026 12:33:05
25-Sep-2026 12:33:05 No event loop hook running.
25-Sep-2026 12:33:05 Using matplotlib backend: agg
25-Sep-2026 12:33:05 CASA 6.7.7.7a14882.dev1 -- Common Astronomy Software Applications [6.7.7.7a14882.dev1]
25-Sep-2026 12:33:05 CASA exits with a non-zero status : exception: <class 'ImportError'>
25-Sep-2026 12:33:06 cp: cannot stat '/home/casatest/casa6/casatasks/tests/casashell_tests/work/*/*.xml': No such file or directory
25-Sep-2026 12:33:13 total 779068
25-Sep-2026 12:33:13 drwxr-xr-x 5 casaci casaci      4096 Sep 14 02:07 casa-CAS-14882-1-py3.12.el8
25-Sep-2026 12:33:13 -rw-r--r-- 1 casaci  15001 797748744 Sep 25 16:25 casa-CAS-14882-1-py3.12.el8.tar.xz
25-Sep-2026 12:33:13 drwxr-xr-x 2 casaci root        4096 Sep 25 16:33 logs
25-Sep-2026 12:33:13 drwxr-xr-x 2 casaci root        4096 Sep 25 16:27 xml
25-Sep-2026 12:33:13 total 8
25-Sep-2026 12:33:13 -rw-r--r-- 1 root root 4110 Sep 25 16:33 test_task_tclean_casashell_out.log
25-Sep-2026 12:33:13 total 0
25-Sep-2026 12:33:28 wheel-container-test
25-Sep-2026 12:33:29 Failing as no matching files has been found and empty artifacts are not allowed.
25-Sep-2026 12:33:29 Unable to publish artifact [XML Files]:
25-Sep-2026 12:33:29 Failing as no matching files has been found and empty artifacts are not allowed.
25-Sep-2026 12:33:29 Unable to publish artifact [Workdir]: