Build: #7 failed Manual run by Akeem Wells

Build result summary

Details

Completed
Queue duration
1 second
Duration
402 minutes
Labels
None
Revisions
CASA6
2d7c2aeedb405c4621983a18d494e753d8000bc5
OPEN-CASA-PKG
e5285e68467f01199807a1f1a978aec8a4781be7
Total tests
4666

Tests

Responsible

No one has taken responsibility for this failure

Configuration changes

Plan configuration has changed since the last successful build. See the plan audit log for more details.

Tests

New test failures 2
Status Test View job Duration
Collapse Failed plotbandpass_private_test test_sloppyUnique
Test Tasks Many Linux 2.28 Replace Casatasks import with casashell < 1 sec
ModuleNotFoundError: No module named 'casashell.private.task_plotbandpass'
Traceback (most recent call last):
  File "/home/casatest/casa6/casatasks/tests/casashell_tests/test_task_plotbandpass_casashell.py", line 1489, in test_sloppyUnique
    import casashell.private.task_plotbandpass as _plotbandpass
ModuleNotFoundError: No module named 'casashell.private.task_plotbandpass'
Collapse Failed test_widefield test_widefield_mvc_squint_awp2
Test Tasks Many Linux 2.28 Remove Casatasks import 21 mins
AssertionError: False is not true
Traceback (most recent call last):
  File "/home/casatest/casa6/casatasks/tests/casashell_tests/test_task_tclean_casashell.py", line 4339, in test_widefield_mvc_squint_awp2
    self.assertTrue(self.check_final(report))
AssertionError: False is not true