Test Tools and Tasks using measures at go (dot) nrao (dot) edu (slash)iers

Build: #10 failed

Job: Test Tools Many Linux 2.28 Rocky 8.10 Py3.12 failed

Test results

  • 35 tests in total
  • 21 tests failed
  • 21 failures are new
  • 8 seconds taken in total.

Build 10 has the following 21 errors: 21 new failure(s) occurred since the previous build.

New test failures 21
Status Test Duration
Collapse Failed test_tool_calibrater calibrater_test.test_activityRecord
< 1 sec
RuntimeError: Error in Calibrater::initialize()
test_tool_calibrater.py:111: in test_activityRecord
    cb.open(self._vis)
../../../../venv/lib/python3.12/site-packages/casatools/calibrater.py:30: in open
    return self._swigobj.open(filename, compress, addcorr, addmodel)
           ^^^^^^^^^^^^^^^^^^^^^^^^^^^^^^^^^^^^^^^^^^^^^^^^^^^^^^^^^
../../../../venv/lib/python3.12/site-packages/casatools/__casac__/calibrater.py:143: in open
    return _calibrater.calibrater_open(self, *args, **kwargs)
(2 more lines...)
Collapse Failed test_tool_calibrater calibrater_test.test_corruptCal
< 1 sec
RuntimeError: Error in Calibrater::corrupt2.
test_tool_calibrater.py:631: in test_corruptCal
    cb.corrupt()
../../../../venv/lib/python3.12/site-packages/casatools/calibrater.py:501: in corrupt
    return self._swigobj.corrupt()
           ^^^^^^^^^^^^^^^^^^^^^^^
../../../../venv/lib/python3.12/site-packages/casatools/__casac__/calibrater.py:1200: in corrupt
    return _calibrater.calibrater_corrupt(self)
(2 more lines...)
Collapse Failed test_tool_calibrater calibrater_test.test_done
< 1 sec
AssertionError: False is not true : The cache is not empty to begin with
test_tool_calibrater.py:165: in test_done
    self.assertTrue(len(tb.showcache()) == 0, msg="The cache is not empty to begin with")
E   AssertionError: False is not true : The cache is not empty to begin with
Collapse Failed test_tool_calibrater calibrater_test.test_reinitModel
< 1 sec
RuntimeError: Error in Calibrater::initialize()
test_tool_calibrater.py:178: in test_reinitModel
    cb.open(self._vis)
../../../../venv/lib/python3.12/site-packages/casatools/calibrater.py:30: in open
    return self._swigobj.open(filename, compress, addcorr, addmodel)
           ^^^^^^^^^^^^^^^^^^^^^^^^^^^^^^^^^^^^^^^^^^^^^^^^^^^^^^^^^
../../../../venv/lib/python3.12/site-packages/casatools/__casac__/calibrater.py:143: in open
    return _calibrater.calibrater_open(self, *args, **kwargs)
(2 more lines...)
Collapse Failed test_tool_calibrater calibrater_test.test_returnDict
< 1 sec
RuntimeError: Measures directory specified which does not contain the IERS data: /home/casatest/data/measures
test_tool_calibrater.py:654: in test_returnDict
    res = cb.returndict()
          ^^^^^^^^^^^^^^^
../../../../venv/lib/python3.12/site-packages/casatools/calibrater.py:431: in returndict
    return self._swigobj.returndict()
           ^^^^^^^^^^^^^^^^^^^^^^^^^^
../../../../venv/lib/python3.12/site-packages/casatools/__casac__/calibrater.py:937: in returndict
(3 more lines...)
Collapse Failed test_tool_calibrater calibrater_test.test_selectVisBaseline
< 1 sec
RuntimeError: Error in Calibrater::correct.
test_tool_calibrater.py:508: in test_selectVisBaseline
    cb.correct()
../../../../venv/lib/python3.12/site-packages/casatools/calibrater.py:493: in correct
    return self._swigobj.correct(applymode)
           ^^^^^^^^^^^^^^^^^^^^^^^^^^^^^^^^
../../../../venv/lib/python3.12/site-packages/casatools/__casac__/calibrater.py:1168: in correct
    return _calibrater.calibrater_correct(self, *args, **kwargs)
(2 more lines...)
Collapse Failed test_tool_calibrater calibrater_test.test_selectVisField
< 1 sec
RuntimeError: Error in Calibrater::correct.
test_tool_calibrater.py:361: in test_selectVisField
    cb.correct()
../../../../venv/lib/python3.12/site-packages/casatools/calibrater.py:493: in correct
    return self._swigobj.correct(applymode)
           ^^^^^^^^^^^^^^^^^^^^^^^^^^^^^^^^
../../../../venv/lib/python3.12/site-packages/casatools/__casac__/calibrater.py:1168: in correct
    return _calibrater.calibrater_correct(self, *args, **kwargs)
(2 more lines...)
Collapse Failed test_tool_calibrater calibrater_test.test_selectVisIntent
< 1 sec
RuntimeError: Error in Calibrater::correct.
test_tool_calibrater.py:410: in test_selectVisIntent
    cb.correct()
../../../../venv/lib/python3.12/site-packages/casatools/calibrater.py:493: in correct
    return self._swigobj.correct(applymode)
           ^^^^^^^^^^^^^^^^^^^^^^^^^^^^^^^^
../../../../venv/lib/python3.12/site-packages/casatools/__casac__/calibrater.py:1168: in correct
    return _calibrater.calibrater_correct(self, *args, **kwargs)
(2 more lines...)
Collapse Failed test_tool_calibrater calibrater_test.test_selectVisObs
< 1 sec
RuntimeError: Error in Calibrater::correct.
test_tool_calibrater.py:447: in test_selectVisObs
    cb.correct()
../../../../venv/lib/python3.12/site-packages/casatools/calibrater.py:493: in correct
    return self._swigobj.correct(applymode)
           ^^^^^^^^^^^^^^^^^^^^^^^^^^^^^^^^
../../../../venv/lib/python3.12/site-packages/casatools/__casac__/calibrater.py:1168: in correct
    return _calibrater.calibrater_correct(self, *args, **kwargs)
(2 more lines...)
Collapse Failed test_tool_calibrater calibrater_test.test_selectVisScan
< 1 sec
RuntimeError: Error in Calibrater::correct.
test_tool_calibrater.py:317: in test_selectVisScan
    cb.correct()
../../../../venv/lib/python3.12/site-packages/casatools/calibrater.py:493: in correct
    return self._swigobj.correct(applymode)
           ^^^^^^^^^^^^^^^^^^^^^^^^^^^^^^^^
../../../../venv/lib/python3.12/site-packages/casatools/__casac__/calibrater.py:1168: in correct
    return _calibrater.calibrater_correct(self, *args, **kwargs)
(2 more lines...)
Collapse Failed test_tool_calibrater calibrater_test.test_selectVisSpw
< 1 sec
RuntimeError: Error in Calibrater::correct.
test_tool_calibrater.py:249: in test_selectVisSpw
    cb.correct()
../../../../venv/lib/python3.12/site-packages/casatools/calibrater.py:493: in correct
    return self._swigobj.correct(applymode)
           ^^^^^^^^^^^^^^^^^^^^^^^^^^^^^^^^
../../../../venv/lib/python3.12/site-packages/casatools/__casac__/calibrater.py:1168: in correct
    return _calibrater.calibrater_correct(self, *args, **kwargs)
(2 more lines...)
Collapse Failed test_tool_calibrater calibrater_test.test_selectVisTime
< 1 sec
RuntimeError: Error in Calibrater::correct.
test_tool_calibrater.py:285: in test_selectVisTime
    cb.correct()
../../../../venv/lib/python3.12/site-packages/casatools/calibrater.py:493: in correct
    return self._swigobj.correct(applymode)
           ^^^^^^^^^^^^^^^^^^^^^^^^^^^^^^^^
../../../../venv/lib/python3.12/site-packages/casatools/__casac__/calibrater.py:1168: in correct
    return _calibrater.calibrater_correct(self, *args, **kwargs)
(2 more lines...)
Collapse Failed test_tool_calibrater calibrater_test.test_selectVisUVrange
< 1 sec
RuntimeError: Error in Calibrater::correct.
test_tool_calibrater.py:468: in test_selectVisUVrange
    cb.correct()
../../../../venv/lib/python3.12/site-packages/casatools/calibrater.py:493: in correct
    return self._swigobj.correct(applymode)
           ^^^^^^^^^^^^^^^^^^^^^^^^^^^^^^^^
../../../../venv/lib/python3.12/site-packages/casatools/__casac__/calibrater.py:1168: in correct
    return _calibrater.calibrater_correct(self, *args, **kwargs)
(2 more lines...)
Collapse Failed test_tool_calibrater calibrater_test.test_setCalLib
< 1 sec
RuntimeError: Error in Calibrater::corrupt2.
test_tool_calibrater.py:542: in test_setCalLib
    cb.corrupt()
../../../../venv/lib/python3.12/site-packages/casatools/calibrater.py:501: in corrupt
    return self._swigobj.corrupt()
           ^^^^^^^^^^^^^^^^^^^^^^^
../../../../venv/lib/python3.12/site-packages/casatools/__casac__/calibrater.py:1200: in corrupt
    return _calibrater.calibrater_corrupt(self)
(2 more lines...)
Collapse Failed test_tool_calibrater calibrater_test.test_smoothedCalTables
< 1 sec
RuntimeError: Error in Calibrater::initialize()
test_tool_calibrater.py:596: in test_smoothedCalTables
    cb.open(self._bandvis)
../../../../venv/lib/python3.12/site-packages/casatools/calibrater.py:30: in open
    return self._swigobj.open(filename, compress, addcorr, addmodel)
           ^^^^^^^^^^^^^^^^^^^^^^^^^^^^^^^^^^^^^^^^^^^^^^^^^^^^^^^^^
../../../../venv/lib/python3.12/site-packages/casatools/__casac__/calibrater.py:143: in open
    return _calibrater.calibrater_open(self, *args, **kwargs)
(2 more lines...)
Collapse Failed test_tool_calibrater calibrater_test.test_solveBandpass
< 1 sec
RuntimeError: Error in Calibrater::initialize()
test_tool_calibrater.py:566: in test_solveBandpass
    cb.open(self._bandvis)
../../../../venv/lib/python3.12/site-packages/casatools/calibrater.py:30: in open
    return self._swigobj.open(filename, compress, addcorr, addmodel)
           ^^^^^^^^^^^^^^^^^^^^^^^^^^^^^^^^^^^^^^^^^^^^^^^^^^^^^^^^^
../../../../venv/lib/python3.12/site-packages/casatools/__casac__/calibrater.py:143: in open
    return _calibrater.calibrater_open(self, *args, **kwargs)
(2 more lines...)
Collapse Failed test_tool_calibrater calibrater_test.test_solveGainspline
< 1 sec
RuntimeError: Error in Calibrater::initialize()
test_tool_calibrater.py:577: in test_solveGainspline
    cb.open(self._bandvis)
../../../../venv/lib/python3.12/site-packages/casatools/calibrater.py:30: in open
    return self._swigobj.open(filename, compress, addcorr, addmodel)
           ^^^^^^^^^^^^^^^^^^^^^^^^^^^^^^^^^^^^^^^^^^^^^^^^^^^^^^^^^
../../../../venv/lib/python3.12/site-packages/casatools/__casac__/calibrater.py:143: in open
    return _calibrater.calibrater_open(self, *args, **kwargs)
(2 more lines...)
Collapse Failed test_tool_calibrater calibrater_test.test_standardPath
< 1 sec
RuntimeError: Error in Calibrater::initialize()
test_tool_calibrater.py:122: in test_standardPath
    cb.open(self._vis)
../../../../venv/lib/python3.12/site-packages/casatools/calibrater.py:30: in open
    return self._swigobj.open(filename, compress, addcorr, addmodel)
           ^^^^^^^^^^^^^^^^^^^^^^^^^^^^^^^^^^^^^^^^^^^^^^^^^^^^^^^^^
../../../../venv/lib/python3.12/site-packages/casatools/__casac__/calibrater.py:143: in open
    return _calibrater.calibrater_open(self, *args, **kwargs)
(2 more lines...)
Collapse Failed test_tool_calibrater calibrater_test.test_takesMs
< 1 sec
AssertionError: False is not true
test_tool_calibrater.py:105: in test_takesMs
    self.assertTrue(len(cache) == 0)
E   AssertionError: False is not true
Collapse Failed test_tool_calibrater calibrater_test.test_writeToCorrected
< 1 sec
AssertionError: True is not false
test_tool_calibrater.py:147: in test_writeToCorrected
    self.assertFalse('CORRECTED_DATA' in columns)
E   AssertionError: True is not false
Collapse Failed unnamed test suite test_tool_vpmanager
< 1 sec
collection failure
test_tool_vpmanager.py:42: in <module>
    _vp = vptool( )
          ^^^^^^^^^
../../../../venv/lib/python3.12/site-packages/casatools/vpmanager.py:21: in __init__
    self._swigobj = _vpmanager()
                    ^^^^^^^^^^^^
../../../../venv/lib/python3.12/site-packages/casatools/__casac__/vpmanager.py:109: in __init__
(3 more lines...)