Build: #2 failed

Job: Test Tasks Many Linux 2.28 Rocky 8.10 Py3.12 failed

Job result summary

Completed
Duration
341 minutes
Agent
cvpost134.cv.nrao.edu
Revision
953895485181be3732caafc394733c8a6c95fa8d
Total tests
3714

Tests

  • 3,714 tests in total
  • 2 tests failed
  • 2 failures are new
  • 138 tests were quarantined / skipped
  • 332 minutes taken in total.
New test failures 2
Status Test Duration
Collapse Failed test_task_tclean test_widefield.test_widefield_awphpg_mtmfs_via_cube
23 secs
AssertionError: False is not true
test_task_tclean.py:4514: in test_widefield_awphpg_mtmfs_via_cube
    self.assertTrue(self.check_final(report))
E   AssertionError: False is not true
Collapse Failed test_task_tclean test_wproject.test_wterm_awphpg
39 secs
AssertionError: False is not true
test_task_tclean.py:4254: in test_wterm_awphpg
    self.assertTrue(self.check_final(report))
E   AssertionError: False is not true

Error summary

The build generated some errors. See the full build log for more details.

/export/cvpost134-nvme/casa/bamboohome/temp/CASASPECS-RELEASE677TESTGPUPY312-TTM228PY312-2-ScriptBuildTask-15597655940508653099.sh: line 1: cd: /opt/casa/data/master: No such file or directory
/export/cvpost134-nvme/casa/bamboohome/temp/CASASPECS-RELEASE677TESTGPUPY312-TTM228PY312-2-ScriptBuildTask-15597655940508653099.sh: line 2: cd: /opt/casa/data/casa-data-req: No such file or directory
/export/cvpost134-nvme/casa/bamboohome/temp/CASASPECS-RELEASE677TESTGPUPY312-TTM228PY312-2-ScriptBuildTask-15597655940508653099.sh: line 3: cd: /opt/casa/data/casatestdata: No such file or directory
Error response from daemon: No such container: wheel-container-test
Error response from daemon: No such container: wheel-container-test
  % Total    % Received % Xferd  Average Speed   Time    Time     Time  Current
                                 Dload  Upload   Total   Spent    Left  Speed

  0     0    0     0    0     0      0      0 --:--:-- --:--:-- --:--:--     0
100 6002k  100 6002k    0     0  64.4M      0 --:--:-- --:--:-- --:--:-- 64.4M
[2113686] Failed to execute script 'atlutil' due to unhandled exception!
Traceback (most recent call last):
  File "atlutil.py", line 194, in <module>
  File "atlutil.py", line 112, in get_ticket_components
KeyError: 'fields'
[2113756] Failed to execute script 'atlutil' due to unhandled exception!
Traceback (most recent call last):
  File "atlutil.py", line 200, in <module>
  File "atlutil.py", line 165, in has_fix_version
  File "json/__init__.py", line 354, in loads
  File "json/decoder.py", line 339, in decode
  File "json/decoder.py", line 357, in raw_decode
json.decoder.JSONDecodeError: Expecting value: line 1 column 1 (char 0)
Switched to a new branch 'release/6.7.7'
tar: work: Cannot stat: No such file or directory
tar: Exiting with failure status due to previous errors