Build: #2 failed Child of CASASPECS-RELEASE677BUILDCASALITHGPU-3
Build result summary
Details
- Completed
- Queue duration
- 2 seconds
- Duration
- 341 minutes
- Labels
- None
- Revisions
-
- CASA6
-
953895485181be3732caafc394733c8a6c95fa8d
- OPEN-CASA-PKG
-
e5285e68467f01199807a1f1a978aec8a4781be7
- Total tests
- 4415
Tests
- 2 New failures
- 0 Existing failures
- 0 Fixed
- 143 Quarantined / skipped
Responsible
No one has taken responsibility for this failure
Tests
| Status | Test | View job | Duration | |
|---|---|---|---|---|
| Collapse |
test_task_tclean
test_wproject.test_wterm_awphpg
|
Test Tasks Many Linux 2.28 Rocky 8.10 Py3.12 | 39 secs | |
AssertionError: False is not true
test_task_tclean.py:4254: in test_wterm_awphpg
self.assertTrue(self.check_final(report))
E AssertionError: False is not true
|
||||
| Collapse |
test_task_tclean
test_widefield.test_widefield_awphpg_mtmfs_via_cube
|
Test Tasks Many Linux 2.28 Rocky 8.10 Py3.12 | 23 secs | |
AssertionError: False is not true
test_task_tclean.py:4514: in test_widefield_awphpg_mtmfs_via_cube
self.assertTrue(self.check_final(report))
E AssertionError: False is not true
|
||||