Build: #2 failed
Job: Test Casalith Many Linux 2.28 Py3.12 was successful
Job result summary
- Completed
- Duration
- 19 minutes
- Agent
- cvpost135.cv.nrao.edu
- Revision
-
953895485181be3732caafc394733c8a6c95fa8d
- Total tests
- 4
Tests
- 4 tests in total
- 16 minutes taken in total.
Error summary
The build generated some errors. See the full build log for more details.
% Total % Received % Xferd Average Speed Time Time Time Current
Dload Upload Total Spent Left Speed
0 0 0 0 0 0 0 0 --:--:-- --:--:-- --:--:-- 0
100 6002k 100 6002k 0 0 65.8M 0 --:--:-- --:--:-- --:--:-- 65.8M
[3016209] Failed to execute script 'atlutil' due to unhandled exception!
Traceback (most recent call last):
File "atlutil.py", line 200, in <module>
File "atlutil.py", line 165, in has_fix_version
File "json/__init__.py", line 354, in loads
File "json/decoder.py", line 339, in decode
File "json/decoder.py", line 357, in raw_decode
json.decoder.JSONDecodeError: Expecting value: line 1 column 1 (char 0)
% Total % Received % Xferd Average Speed Time Time Time Current
Dload Upload Total Spent Left Speed
0 0 0 0 0 0 0 0 --:--:-- --:--:-- --:--:-- 0
100 6002k 100 6002k 0 0 62.3M 0 --:--:-- --:--:-- --:--:-- 62.3M
[3016515] Failed to execute script 'atlutil' due to unhandled exception!
Traceback (most recent call last):
File "atlutil.py", line 194, in <module>
File "atlutil.py", line 112, in get_ticket_components
KeyError: 'fields'
Cloning into 'casa6'...
Updating files: 47% (3099/6546)
Updating files: 48% (3143/6546)
Updating files: 49% (3208/6546)
Updating files: 50% (3273/6546)
Updating files: 51% (3339/6546)
Updating files: 52% (3404/6546)
Updating files: 53% (3470/6546)
Updating files: 54% (3535/6546)
Updating files: 55% (3601/6546)
Updating files: 56% (3666/6546)
Updating files: 57% (3732/6546)
Updating files: 58% (3797/6546)
Updating files: 59% (3863/6546)
Updating files: 60% (3928/6546)
Updating files: 61% (3994/6546)
Updating files: 62% (4059/6546)
Updating files: 63% (4124/6546)
Updating files: 64% (4190/6546)
Updating files: 65% (4255/6546)
Updating files: 66% (4321/6546)
Updating files: 67% (4386/6546)
Updating files: 68% (4452/6546)
Updating files: 69% (4517/6546)
Updating files: 70% (4583/6546)
Updating files: 71% (4648/6546)
Updating files: 72% (4714/6546)
Updating files: 73% (4779/6546)
Updating files: 74% (4845/6546)
Updating files: 75% (4910/6546)
Updating files: 76% (4975/6546)
Updating files: 77% (5041/6546)
Updating files: 78% (5106/6546)
Updating files: 79% (5172/6546)
Updating files: 80% (5237/6546)
Updating files: 81% (5303/6546)
Updating files: 82% (5368/6546)
Updating files: 83% (5434/6546)
Updating files: 84% (5499/6546)
Updating files: 85% (5565/6546)
Updating files: 86% (5630/6546)
Updating files: 87% (5696/6546)
Updating files: 88% (5761/6546)
Updating files: 89% (5826/6546)
Updating files: 89% (5840/6546)
Updating files: 90% (5892/6546)
Updating files: 91% (5957/6546)
Updating files: 92% (6023/6546)
Updating files: 93% (6088/6546)
Updating files: 94% (6154/6546)
Updating files: 95% (6219/6546)
Updating files: 96% (6285/6546)
Updating files: 97% (6350/6546)
Updating files: 98% (6416/6546)
Updating files: 99% (6481/6546)
Updating files: 100% (6546/6546)
Updating files: 100% (6546/6546), done.
Switched to a new branch 'release/6.7.7'
% Total % Received % Xferd Average Speed Time Time Time Current
Dload Upload Total Spent Left Speed
0 0 0 0 0 0 0 0 --:--:-- --:--:-- --:--:-- 0
100 669 0 669 0 0 41812 0 --:--:-- --:--:-- --:--:-- 41812
find: './proc/113/task/113/net': Invalid argument
find: './proc/113/net': Invalid argument
find: './proc/248/task/248/net': Invalid argument
find: './proc/248/net': Invalid argument
find: './proc/302/task/302/net': Invalid argument
find: './proc/302/net': Invalid argument
find: './proc/303/task/303/net': Invalid argument
find: './proc/303/net': Invalid argument
find: './proc/304/task/304/net': Invalid argument
find: './proc/304/net': Invalid argument
find: './proc/705/task/705/net': Invalid argument
find: './proc/705/net': Invalid argument
find: './proc/709/task/709/net': Invalid argument
find: './proc/709/net': Invalid argument
find: './proc/838/task/838/net': Invalid argument
find: './proc/838/net': Invalid argument
find: './proc/842/task/842/net': Invalid argument
find: './proc/842/net': Invalid argument
find: './proc/975/task/975/net': Invalid argument
find: './proc/975/net': Invalid argument
Dload Upload Total Spent Left Speed
0 0 0 0 0 0 0 0 --:--:-- --:--:-- --:--:-- 0
100 6002k 100 6002k 0 0 65.8M 0 --:--:-- --:--:-- --:--:-- 65.8M
[3016209] Failed to execute script 'atlutil' due to unhandled exception!
Traceback (most recent call last):
File "atlutil.py", line 200, in <module>
File "atlutil.py", line 165, in has_fix_version
File "json/__init__.py", line 354, in loads
File "json/decoder.py", line 339, in decode
File "json/decoder.py", line 357, in raw_decode
json.decoder.JSONDecodeError: Expecting value: line 1 column 1 (char 0)
% Total % Received % Xferd Average Speed Time Time Time Current
Dload Upload Total Spent Left Speed
0 0 0 0 0 0 0 0 --:--:-- --:--:-- --:--:-- 0
100 6002k 100 6002k 0 0 62.3M 0 --:--:-- --:--:-- --:--:-- 62.3M
[3016515] Failed to execute script 'atlutil' due to unhandled exception!
Traceback (most recent call last):
File "atlutil.py", line 194, in <module>
File "atlutil.py", line 112, in get_ticket_components
KeyError: 'fields'
Cloning into 'casa6'...
Updating files: 47% (3099/6546)
Updating files: 48% (3143/6546)
Updating files: 49% (3208/6546)
Updating files: 50% (3273/6546)
Updating files: 51% (3339/6546)
Updating files: 52% (3404/6546)
Updating files: 53% (3470/6546)
Updating files: 54% (3535/6546)
Updating files: 55% (3601/6546)
Updating files: 56% (3666/6546)
Updating files: 57% (3732/6546)
Updating files: 58% (3797/6546)
Updating files: 59% (3863/6546)
Updating files: 60% (3928/6546)
Updating files: 61% (3994/6546)
Updating files: 62% (4059/6546)
Updating files: 63% (4124/6546)
Updating files: 64% (4190/6546)
Updating files: 65% (4255/6546)
Updating files: 66% (4321/6546)
Updating files: 67% (4386/6546)
Updating files: 68% (4452/6546)
Updating files: 69% (4517/6546)
Updating files: 70% (4583/6546)
Updating files: 71% (4648/6546)
Updating files: 72% (4714/6546)
Updating files: 73% (4779/6546)
Updating files: 74% (4845/6546)
Updating files: 75% (4910/6546)
Updating files: 76% (4975/6546)
Updating files: 77% (5041/6546)
Updating files: 78% (5106/6546)
Updating files: 79% (5172/6546)
Updating files: 80% (5237/6546)
Updating files: 81% (5303/6546)
Updating files: 82% (5368/6546)
Updating files: 83% (5434/6546)
Updating files: 84% (5499/6546)
Updating files: 85% (5565/6546)
Updating files: 86% (5630/6546)
Updating files: 87% (5696/6546)
Updating files: 88% (5761/6546)
Updating files: 89% (5826/6546)
Updating files: 89% (5840/6546)
Updating files: 90% (5892/6546)
Updating files: 91% (5957/6546)
Updating files: 92% (6023/6546)
Updating files: 93% (6088/6546)
Updating files: 94% (6154/6546)
Updating files: 95% (6219/6546)
Updating files: 96% (6285/6546)
Updating files: 97% (6350/6546)
Updating files: 98% (6416/6546)
Updating files: 99% (6481/6546)
Updating files: 100% (6546/6546)
Updating files: 100% (6546/6546), done.
Switched to a new branch 'release/6.7.7'
% Total % Received % Xferd Average Speed Time Time Time Current
Dload Upload Total Spent Left Speed
0 0 0 0 0 0 0 0 --:--:-- --:--:-- --:--:-- 0
100 669 0 669 0 0 41812 0 --:--:-- --:--:-- --:--:-- 41812
find: './proc/113/task/113/net': Invalid argument
find: './proc/113/net': Invalid argument
find: './proc/248/task/248/net': Invalid argument
find: './proc/248/net': Invalid argument
find: './proc/302/task/302/net': Invalid argument
find: './proc/302/net': Invalid argument
find: './proc/303/task/303/net': Invalid argument
find: './proc/303/net': Invalid argument
find: './proc/304/task/304/net': Invalid argument
find: './proc/304/net': Invalid argument
find: './proc/705/task/705/net': Invalid argument
find: './proc/705/net': Invalid argument
find: './proc/709/task/709/net': Invalid argument
find: './proc/709/net': Invalid argument
find: './proc/838/task/838/net': Invalid argument
find: './proc/838/net': Invalid argument
find: './proc/842/task/842/net': Invalid argument
find: './proc/842/net': Invalid argument
find: './proc/975/task/975/net': Invalid argument
find: './proc/975/net': Invalid argument