Test Tools and Tasks using measures at go (dot) nrao (dot) edu (slash)iers
Build: #4 failed
Job: Test Tasks Many Linux 2.28 Rocky 8.10 Py3.12 failed
Test results
- 3,794 tests in total
- 4 tests failed
- 4 failures are new
- 143 tests were quarantined / skipped
- 190 minutes taken in total.
Build 4 has the following 4 errors: 4 new failure(s) occurred since the previous build.
| Status | Test | Duration | |
|---|---|---|---|
| Collapse |
test_task_gencal
gencal_eoptest.test_eop
|
< 1 sec | |
AssertionError: False is not true
test_task_gencal.py:911: in test_eop
self.assertTrue(th.compTables(caltab, reference, ['WEIGHT'], [0.001, 1e-14], mode="both"))
E AssertionError: False is not true
|
|||
| Collapse |
test_task_importasdm
asdm_import3.test_evlatest1
|
< 1 sec | |
AssertionError: False is not true
test_task_importasdm.py:893: in test_evlatest1
self.assertTrue(retValue['success'])
E AssertionError: False is not true
|
|||
| Collapse |
test_task_polcal
polcal_test.test_posAngLin
|
< 1 sec | |
AssertionError: np.False_ is not true
test_task_polcal.py:412: in test_posAngLin
self.assertTrue(np.all(np.isclose(calresult, 0)))
E AssertionError: np.False_ is not true
|
|||
| Collapse |
test_task_polcal
polcal_test.test_sourceInstPolDllsLin
|
< 1 sec | |
AssertionError: np.False_ is not true
test_task_polcal.py:281: in test_sourceInstPolDllsLin
self.assertTrue(np.all(np.isclose(calresult, refresult)))
E AssertionError: np.False_ is not true
|
|||