Test Tools and Tasks using measures at go (dot) nrao (dot) edu (slash)iers

Build: #4 failed Manual run by Akeem Wells

Build result summary

Details

Completed
Queue duration
1 second
Duration
197 minutes
Labels
None
Revisions
CASA6
eecf2cd47aa4916b96e68a0a1c3ec863a5561490
OPEN-CASA-PKG
e5285e68467f01199807a1f1a978aec8a4781be7
Total tests
4491

Tests

Responsible

No one has taken responsibility for this failure

Tests

New test failures 5
Status Test View job Duration
Collapse Failed test_task_gencal gencal_eoptest.test_eop
Test Tasks Many Linux 2.28 Rocky 8.10 Py3.12 < 1 sec
AssertionError: False is not true
test_task_gencal.py:911: in test_eop
    self.assertTrue(th.compTables(caltab, reference, ['WEIGHT'], [0.001, 1e-14], mode="both"))
E   AssertionError: False is not true
Collapse Failed test_task_importasdm asdm_import3.test_evlatest1
Test Tasks Many Linux 2.28 Rocky 8.10 Py3.12 < 1 sec
AssertionError: False is not true
test_task_importasdm.py:893: in test_evlatest1
    self.assertTrue(retValue['success'])
E   AssertionError: False is not true
Collapse Failed test_task_polcal polcal_test.test_posAngLin
Test Tasks Many Linux 2.28 Rocky 8.10 Py3.12 < 1 sec
AssertionError: np.False_ is not true
test_task_polcal.py:412: in test_posAngLin
    self.assertTrue(np.all(np.isclose(calresult, 0)))
E   AssertionError: np.False_ is not true
Collapse Failed test_task_polcal polcal_test.test_sourceInstPolDllsLin
Test Tasks Many Linux 2.28 Rocky 8.10 Py3.12 < 1 sec
AssertionError: np.False_ is not true
test_task_polcal.py:281: in test_sourceInstPolDllsLin
    self.assertTrue(np.all(np.isclose(calresult, refresult)))
E   AssertionError: np.False_ is not true
Collapse Failed test_tool_synthesisutils advisechansel_test.test_su_advisechansel_getfreqrange_ephem
Test Tools Many Linux 2.28 Rocky 8.10 Py3.12 < 1 sec
AssertionError: 220295510184.34296 != 220295510184.3427
test_tool_synthesisutils.py:478: in test_su_advisechansel_getfreqrange_ephem
    self.assertEqual(res['freqstart']['value'], refdict['freqstart']['value'])
E   AssertionError: 220295510184.34296 != 220295510184.3427