Test Tools and Tasks using measures at go (dot) nrao (dot) edu (slash)iers

Build: #4 failed

Job: Test Tasks Many Linux 2.28 Rocky 8.10 Py3.12 failed

Job result summary

Completed
Duration
197 minutes
Agent
casaci-4.cv.nrao.edu test agent2
Revision
eecf2cd47aa4916b96e68a0a1c3ec863a5561490
Total tests
3794

Tests

  • 3,794 tests in total
  • 4 tests failed
  • 4 failures are new
  • 143 tests were quarantined / skipped
  • 190 minutes taken in total.
New test failures 4
Status Test Duration
Collapse Failed test_task_gencal gencal_eoptest.test_eop
< 1 sec
AssertionError: False is not true
test_task_gencal.py:911: in test_eop
    self.assertTrue(th.compTables(caltab, reference, ['WEIGHT'], [0.001, 1e-14], mode="both"))
E   AssertionError: False is not true
Collapse Failed test_task_importasdm asdm_import3.test_evlatest1
< 1 sec
AssertionError: False is not true
test_task_importasdm.py:893: in test_evlatest1
    self.assertTrue(retValue['success'])
E   AssertionError: False is not true
Collapse Failed test_task_polcal polcal_test.test_posAngLin
< 1 sec
AssertionError: np.False_ is not true
test_task_polcal.py:412: in test_posAngLin
    self.assertTrue(np.all(np.isclose(calresult, 0)))
E   AssertionError: np.False_ is not true
Collapse Failed test_task_polcal polcal_test.test_sourceInstPolDllsLin
< 1 sec
AssertionError: np.False_ is not true
test_task_polcal.py:281: in test_sourceInstPolDllsLin
    self.assertTrue(np.all(np.isclose(calresult, refresult)))
E   AssertionError: np.False_ is not true

Error summary

The build generated some errors. See the full build log for more details.

Error response from daemon: No such container: wheel-container-test-153550850
Error response from daemon: No such container: wheel-container-test-153550850
  % Total    % Received % Xferd  Average Speed   Time    Time     Time  Current
                                 Dload  Upload   Total   Spent    Left  Speed

  0     0    0     0    0     0      0      0 --:--:-- --:--:-- --:--:--     0
100 6002k  100 6002k    0     0  74.2M      0 --:--:-- --:--:-- --:--:-- 74.2M
[230291] Failed to execute script 'atlutil' due to unhandled exception!
Traceback (most recent call last):
  File "atlutil.py", line 200, in <module>
  File "atlutil.py", line 165, in has_fix_version
KeyError: 'fields'
Already on 'master'