Test Tools and Tasks using measures at go (dot) nrao (dot) edu (slash)iers

Build: #10 failed Manual run by Akeem Wells

Test results

  • 285 tests in total
  • 129 tests failed
  • 129 failures are new
  • 3 minutes taken in total.
New test failures 129
Status Test View job Duration
Collapse Failed test_task_bandpass bandpass1_test.test_dictOutputFlagged
Test Tasks Many Linux 2.28 Rocky 8.10 Py3.12 < 1 sec
RuntimeError: Measures directory specified which does not contain the IERS data: /home/casatest/data/measures
test_task_bandpass.py:124: in test_dictOutputFlagged
    flagdata(vis=self.msfile, spw='0')
../../../../venv/lib/python3.12/site-packages/casatasks/flagdata.py:1136: in __call__
    task_result = _flagdata_t( _pc.document['vis'], _pc.document['mode'], _pc.document['autocorr'], _pc.document['inpfile'], _pc.document['reason'], _pc.document['tbuff'], _pc.document['spw'], _pc.document['field'], _pc.document['antenna'], _pc.document['uvrange'], _pc.document['timerange'], _pc.document['correlation'], _pc.document['scan'], _pc.document['intent'], _pc.document['array'], _pc.document['observation'], _pc.document['feed'], _pc.document['clipminmax'], _pc.document['datacolumn'], _pc.document['clipoutside'], _pc.document['channelavg'], _pc.document['chanbin'], _pc.document['timeavg'], _pc.document['timebin'], _pc.document['clipzeros'], _pc.document['quackinterval'], _pc.document['quackmode'], _pc.document['quackincrement'], _pc.document['tolerance'], _pc.document['addantenna'], _pc.document['lowerlimit'], _pc.document['upperlimit'], _pc.document['ntime'], _pc.document['combinescans'], _pc.document['timecutoff'], _pc.document['freqcutoff'], _pc.document['timefit'], _pc.document['freqfit'], _pc.document['maxnpieces'], _pc.document['flagdimension'], _pc.document['usewindowstats'], _pc.document['halfwin'], _pc.document['extendflags'], _pc.document['winsize'], _pc.document['timedev'], _pc.document['freqdev'], _pc.document['timedevscale'], _pc.document['freqdevscale'], _pc.document['spectralmax'], _pc.document['spectralmin'], _pc.document['antint_ref_antenna'], _pc.document['minchanfrac'], _pc.document['verbose'], _pc.document['extendpols'], _pc.document['growtime'], _pc.document['growfreq'], _pc.document['growaround'], _pc.document['flagneartime'], _pc.document['flagnearfreq'], _pc.document['minrel'], _pc.document['maxrel'], _pc.document['minabs'], _pc.document['maxabs'], _pc.document['spwchan'], _pc.document['spwcorr'], _pc.document['basecnt'], _pc.document['fieldcnt'], _pc.document['name'], _pc.document['action'], _pc.document['display'], _pc.document['flagbackup'], _pc.document['savepars'], _pc.document['cmdreason'], _pc.document['outfile'], _pc.document['overwrite'], _pc.document['writeflags'] )
                  ^^^^^^^^^^^^^^^^^^^^^^^^^^^^^^^^^^^^^^^^^^^^^^^^^^^^^^^^^^^^^^^^^^^^^^^^^^^^^^^^^^^^^^^^^^^^^^^^^^^^^^^^^^^^^^^^^^^^^^^^^^^^^^^^^^^^^^^^^^^^^^^^^^^^^^^^^^^^^^^^^^^^^^^^^^^^^^^^^^^^^^^^^^^^^^^^^^^^^^^^^^^^^^^^^^^^^^^^^^^^^^^^^^^^^^^^^^^^^^^^^^^^^^^^^^^^^^^^^^^^^^^^^^^^^^^^^^^^^^^^^^^^^^^^^^^^^^^^^^^^^^^^^^^^^^^^^^^^^^^^^^^^^^^^^^^^^^^^^^^^^^^^^^^^^^^^^^^^^^^^^^^^^^^^^^^^^^^^^^^^^^^^^^^^^^^^^^^^^^^^^^^^^^^^^^^^^^^^^^^^^^^^^^^^^^^^^^^^^^^^^^^^^^^^^^^^^^^^^^^^^^^^^^^^^^^^^^^^^^^^^^^^^^^^^^^^^^^^^^^^^^^^^^^^^^^^^^^^^^^^^^^^^^^^^^^^^^^^^^^^^^^^^^^^^^^^^^^^^^^^^^^^^^^^^^^^^^^^^^^^^^^^^^^^^^^^^^^^^^^^^^^^^^^^^^^^^^^^^^^^^^^^^^^^^^^^^^^^^^^^^^^^^^^^^^^^^^^^^^^^^^^^^^^^^^^^^^^^^^^^^^^^^^^^^^^^^^^^^^^^^^^^^^^^^^^^^^^^^^^^^^^^^^^^^^^^^^^^^^^^^^^^^^^^^^^^^^^^^^^^^^^^^^^^^^^^^^^^^^^^^^^^^^^^^^^^^^^^^^^^^^^^^^^^^^^^^^^^^^^^^^^^^^^^^^^^^^^^^^^^^^^^^^^^^^^^^^^^^^^^^^^^^^^^^^^^^^^^^^^^^^^^^^^^^^^^^^^^^^^^^^^^^^^^^^^^^^^^^^^^^^^^^^^^^^^^^^^^^^^^^^^^^^^^^^^^^^^^^^^^^^^^^^^^^^^^^^^^^^^^^^^^^^^^^^^^^^^^^^^^^^^^^^^^^^^^^^^^^^^^^^^^^^^^^^^^^^^^^^^^^^^^^^^^^^^^^^^^^^^^^^^^^^^^^^^^^^^^^^^^^^^^^^^^^^^^^^^^^^^^^^^^^^^^^^^^^^^^^^^^^^^^^^^^^^^^^^^^^^^^^^^^^^^^^^^^^^^^^^^^^^^^^^^^^^^^^^^^^^^^^^^^^^^^^^^^^^^^^^^^^^^^^^^^^^^^^^^^^^^^^^^^^^^^^^^^^^^^^^^^^^^^^^^^^^^^^^^^^^^^^^^^^^^^^^^^^^^^^^^^^^^^^^^^^^^^^^^^^^^^^^^^^^^^^^^^^^^^^^^^^^^^^^^^^^^^^^^^^^^^^^^^^^^^^^^^^^^^^^^^^^^^^^^^^^^^^^^^^^^^^^^^^^^^^^^^^^^^^^^^^^^^^^^^^^^^^^^^^^^^^^^^^^^^^^^^^^^^^^^^^^^^^^^^^^^^^^^^^^^^^^^^^^^^^^^^^^^^^^^^^^^^^^^^^^^^^^^^^^^^^^^^^^^^^^^^^^^^^^^^^^^^^^^^^^^^^^^^^^^^^^^^^^^^^^^^^^^^^^^^^^^^^^^^^^^^^^^^^^^^^^^^^^^^^^^^^^^^^^^^^^^^^^^^^^^^^^^^^^^^^^^^^^^^^^^^^^^^^^^^^^^^^^^^^^^^^^^^^^^^^^^^^^^^^^^^^^^^^^^^^^^^^^^^^^^^^^^^^^^^^^^^^^^^^^^^^^^^^^^^^^^^^^^^^^^^^^^^^^^^^^^^^^^^^^^^^^^^^^^^^^^^^^^^^^^^^^^^^^^^^^^^^^^^^^^^^^^^^^^^^^^^^^^^^^^^^^^^^^^^^^^^^^^^^^^^^^^^^^^^^^^^^^^^^^^^^^^^^^^^^^^^^^^^^^^^^^^^^^^^^^^^^^^^^^^^^^^^^^^^^^^^^^^^^^^^^^^^^^^^^^^^^^^^^^^^^^^^^^^^^^^^^^^^^^^^^^^^^^^^^^^^^^^^^^^^^^^^^^^^^^^^^^^^^^^^^^^^^^^^^^^^^^^^^^^^^^^^^^^^^^^^
../../../../venv/lib/python3.12/site-packages/casatasks/private/task_flagdata.py:696: in flagdata
    summary_stats_list = aflocal.run(writeflags, True)
(8 more lines...)
Collapse Failed test_task_bandpass bandpass2_test.test1b
Test Tasks Many Linux 2.28 Rocky 8.10 Py3.12 < 1 sec
RuntimeError: Measures directory specified which does not contain the IERS data: /home/casatest/data/measures
../../../../venv/lib/python3.12/site-packages/casatasks/private/task_bandpass.py:134: in bandpass
    mycb.solve()
../../../../venv/lib/python3.12/site-packages/casatools/calibrater.py:485: in solve
    return self._swigobj.solve()
           ^^^^^^^^^^^^^^^^^^^^^
../../../../venv/lib/python3.12/site-packages/casatools/__casac__/calibrater.py:1133: in solve
    return _calibrater.calibrater_solve(self)
(19 more lines...)
Collapse Failed test_task_bandpass bandpass1_test.test_dictOutputAntennaFlag
Test Tasks Many Linux 2.28 Rocky 8.10 Py3.12 < 1 sec
RuntimeError: Measures directory specified which does not contain the IERS data: /home/casatest/data/measures
test_task_bandpass.py:137: in test_dictOutputAntennaFlag
    flagdata(vis=self.msfile, antenna='0')
../../../../venv/lib/python3.12/site-packages/casatasks/flagdata.py:1136: in __call__
    task_result = _flagdata_t( _pc.document['vis'], _pc.document['mode'], _pc.document['autocorr'], _pc.document['inpfile'], _pc.document['reason'], _pc.document['tbuff'], _pc.document['spw'], _pc.document['field'], _pc.document['antenna'], _pc.document['uvrange'], _pc.document['timerange'], _pc.document['correlation'], _pc.document['scan'], _pc.document['intent'], _pc.document['array'], _pc.document['observation'], _pc.document['feed'], _pc.document['clipminmax'], _pc.document['datacolumn'], _pc.document['clipoutside'], _pc.document['channelavg'], _pc.document['chanbin'], _pc.document['timeavg'], _pc.document['timebin'], _pc.document['clipzeros'], _pc.document['quackinterval'], _pc.document['quackmode'], _pc.document['quackincrement'], _pc.document['tolerance'], _pc.document['addantenna'], _pc.document['lowerlimit'], _pc.document['upperlimit'], _pc.document['ntime'], _pc.document['combinescans'], _pc.document['timecutoff'], _pc.document['freqcutoff'], _pc.document['timefit'], _pc.document['freqfit'], _pc.document['maxnpieces'], _pc.document['flagdimension'], _pc.document['usewindowstats'], _pc.document['halfwin'], _pc.document['extendflags'], _pc.document['winsize'], _pc.document['timedev'], _pc.document['freqdev'], _pc.document['timedevscale'], _pc.document['freqdevscale'], _pc.document['spectralmax'], _pc.document['spectralmin'], _pc.document['antint_ref_antenna'], _pc.document['minchanfrac'], _pc.document['verbose'], _pc.document['extendpols'], _pc.document['growtime'], _pc.document['growfreq'], _pc.document['growaround'], _pc.document['flagneartime'], _pc.document['flagnearfreq'], _pc.document['minrel'], _pc.document['maxrel'], _pc.document['minabs'], _pc.document['maxabs'], _pc.document['spwchan'], _pc.document['spwcorr'], _pc.document['basecnt'], _pc.document['fieldcnt'], _pc.document['name'], _pc.document['action'], _pc.document['display'], _pc.document['flagbackup'], _pc.document['savepars'], _pc.document['cmdreason'], _pc.document['outfile'], _pc.document['overwrite'], _pc.document['writeflags'] )
                  ^^^^^^^^^^^^^^^^^^^^^^^^^^^^^^^^^^^^^^^^^^^^^^^^^^^^^^^^^^^^^^^^^^^^^^^^^^^^^^^^^^^^^^^^^^^^^^^^^^^^^^^^^^^^^^^^^^^^^^^^^^^^^^^^^^^^^^^^^^^^^^^^^^^^^^^^^^^^^^^^^^^^^^^^^^^^^^^^^^^^^^^^^^^^^^^^^^^^^^^^^^^^^^^^^^^^^^^^^^^^^^^^^^^^^^^^^^^^^^^^^^^^^^^^^^^^^^^^^^^^^^^^^^^^^^^^^^^^^^^^^^^^^^^^^^^^^^^^^^^^^^^^^^^^^^^^^^^^^^^^^^^^^^^^^^^^^^^^^^^^^^^^^^^^^^^^^^^^^^^^^^^^^^^^^^^^^^^^^^^^^^^^^^^^^^^^^^^^^^^^^^^^^^^^^^^^^^^^^^^^^^^^^^^^^^^^^^^^^^^^^^^^^^^^^^^^^^^^^^^^^^^^^^^^^^^^^^^^^^^^^^^^^^^^^^^^^^^^^^^^^^^^^^^^^^^^^^^^^^^^^^^^^^^^^^^^^^^^^^^^^^^^^^^^^^^^^^^^^^^^^^^^^^^^^^^^^^^^^^^^^^^^^^^^^^^^^^^^^^^^^^^^^^^^^^^^^^^^^^^^^^^^^^^^^^^^^^^^^^^^^^^^^^^^^^^^^^^^^^^^^^^^^^^^^^^^^^^^^^^^^^^^^^^^^^^^^^^^^^^^^^^^^^^^^^^^^^^^^^^^^^^^^^^^^^^^^^^^^^^^^^^^^^^^^^^^^^^^^^^^^^^^^^^^^^^^^^^^^^^^^^^^^^^^^^^^^^^^^^^^^^^^^^^^^^^^^^^^^^^^^^^^^^^^^^^^^^^^^^^^^^^^^^^^^^^^^^^^^^^^^^^^^^^^^^^^^^^^^^^^^^^^^^^^^^^^^^^^^^^^^^^^^^^^^^^^^^^^^^^^^^^^^^^^^^^^^^^^^^^^^^^^^^^^^^^^^^^^^^^^^^^^^^^^^^^^^^^^^^^^^^^^^^^^^^^^^^^^^^^^^^^^^^^^^^^^^^^^^^^^^^^^^^^^^^^^^^^^^^^^^^^^^^^^^^^^^^^^^^^^^^^^^^^^^^^^^^^^^^^^^^^^^^^^^^^^^^^^^^^^^^^^^^^^^^^^^^^^^^^^^^^^^^^^^^^^^^^^^^^^^^^^^^^^^^^^^^^^^^^^^^^^^^^^^^^^^^^^^^^^^^^^^^^^^^^^^^^^^^^^^^^^^^^^^^^^^^^^^^^^^^^^^^^^^^^^^^^^^^^^^^^^^^^^^^^^^^^^^^^^^^^^^^^^^^^^^^^^^^^^^^^^^^^^^^^^^^^^^^^^^^^^^^^^^^^^^^^^^^^^^^^^^^^^^^^^^^^^^^^^^^^^^^^^^^^^^^^^^^^^^^^^^^^^^^^^^^^^^^^^^^^^^^^^^^^^^^^^^^^^^^^^^^^^^^^^^^^^^^^^^^^^^^^^^^^^^^^^^^^^^^^^^^^^^^^^^^^^^^^^^^^^^^^^^^^^^^^^^^^^^^^^^^^^^^^^^^^^^^^^^^^^^^^^^^^^^^^^^^^^^^^^^^^^^^^^^^^^^^^^^^^^^^^^^^^^^^^^^^^^^^^^^^^^^^^^^^^^^^^^^^^^^^^^^^^^^^^^^^^^^^^^^^^^^^^^^^^^^^^^^^^^^^^^^^^^^^^^^^^^^^^^^^^^^^^^^^^^^^^^^^^^^^^^^^^^^^^^^^^^^^^^^^^^^^^^^^^^^^^^^^^^^^^^^^^^^^^^^^^^^^^^^^^^^^^^^^^^^^^^^^^^^^^^^^^^^^^^^^^^^^^^^^^^^^^^^^^^^^^^^^^^^^^^^^^^^^^^^^^^^^^^^^^^^^^^^^^^^^^^^^^^^^^^^^^^^^^^^^^^^^^^^^^^^^^^^^^^^^^^^^^^^^^^^^^^^^^^^^^^^^^^^^^^^^^^^^^^^^^^^^^^^^^^^^^^^^^^^^^^^^^^^^^^^^^^^^^^^^^^^^^^^^^^^^^^^^^^^^^^^^^^^^^^^^^^^^^^^^^^^^^^^^^^^^^^^^^^^^^^^^^^^^^^^^^^^^^^^^^^^^^^
../../../../venv/lib/python3.12/site-packages/casatasks/private/task_flagdata.py:696: in flagdata
    summary_stats_list = aflocal.run(writeflags, True)
(8 more lines...)
Collapse Failed test_task_bandpass bandpass1_test.test_returnDict
Test Tasks Many Linux 2.28 Rocky 8.10 Py3.12 < 1 sec
RuntimeError: Measures directory specified which does not contain the IERS data: /home/casatest/data/measures
../../../../venv/lib/python3.12/site-packages/casatasks/private/task_bandpass.py:134: in bandpass
    mycb.solve()
../../../../venv/lib/python3.12/site-packages/casatools/calibrater.py:485: in solve
    return self._swigobj.solve()
           ^^^^^^^^^^^^^^^^^^^^^
../../../../venv/lib/python3.12/site-packages/casatools/__casac__/calibrater.py:1133: in solve
    return _calibrater.calibrater_solve(self)
(20 more lines...)
Collapse Failed test_task_bandpass bandpass1_test.test_dictBelowMinBl
Test Tasks Many Linux 2.28 Rocky 8.10 Py3.12 < 1 sec
RuntimeError: Measures directory specified which does not contain the IERS data: /home/casatest/data/measures
test_task_bandpass.py:149: in test_dictBelowMinBl
    flagdata(vis=self.msfile, antenna='0~24')
../../../../venv/lib/python3.12/site-packages/casatasks/flagdata.py:1136: in __call__
    task_result = _flagdata_t( _pc.document['vis'], _pc.document['mode'], _pc.document['autocorr'], _pc.document['inpfile'], _pc.document['reason'], _pc.document['tbuff'], _pc.document['spw'], _pc.document['field'], _pc.document['antenna'], _pc.document['uvrange'], _pc.document['timerange'], _pc.document['correlation'], _pc.document['scan'], _pc.document['intent'], _pc.document['array'], _pc.document['observation'], _pc.document['feed'], _pc.document['clipminmax'], _pc.document['datacolumn'], _pc.document['clipoutside'], _pc.document['channelavg'], _pc.document['chanbin'], _pc.document['timeavg'], _pc.document['timebin'], _pc.document['clipzeros'], _pc.document['quackinterval'], _pc.document['quackmode'], _pc.document['quackincrement'], _pc.document['tolerance'], _pc.document['addantenna'], _pc.document['lowerlimit'], _pc.document['upperlimit'], _pc.document['ntime'], _pc.document['combinescans'], _pc.document['timecutoff'], _pc.document['freqcutoff'], _pc.document['timefit'], _pc.document['freqfit'], _pc.document['maxnpieces'], _pc.document['flagdimension'], _pc.document['usewindowstats'], _pc.document['halfwin'], _pc.document['extendflags'], _pc.document['winsize'], _pc.document['timedev'], _pc.document['freqdev'], _pc.document['timedevscale'], _pc.document['freqdevscale'], _pc.document['spectralmax'], _pc.document['spectralmin'], _pc.document['antint_ref_antenna'], _pc.document['minchanfrac'], _pc.document['verbose'], _pc.document['extendpols'], _pc.document['growtime'], _pc.document['growfreq'], _pc.document['growaround'], _pc.document['flagneartime'], _pc.document['flagnearfreq'], _pc.document['minrel'], _pc.document['maxrel'], _pc.document['minabs'], _pc.document['maxabs'], _pc.document['spwchan'], _pc.document['spwcorr'], _pc.document['basecnt'], _pc.document['fieldcnt'], _pc.document['name'], _pc.document['action'], _pc.document['display'], _pc.document['flagbackup'], _pc.document['savepars'], _pc.document['cmdreason'], _pc.document['outfile'], _pc.document['overwrite'], _pc.document['writeflags'] )
                  ^^^^^^^^^^^^^^^^^^^^^^^^^^^^^^^^^^^^^^^^^^^^^^^^^^^^^^^^^^^^^^^^^^^^^^^^^^^^^^^^^^^^^^^^^^^^^^^^^^^^^^^^^^^^^^^^^^^^^^^^^^^^^^^^^^^^^^^^^^^^^^^^^^^^^^^^^^^^^^^^^^^^^^^^^^^^^^^^^^^^^^^^^^^^^^^^^^^^^^^^^^^^^^^^^^^^^^^^^^^^^^^^^^^^^^^^^^^^^^^^^^^^^^^^^^^^^^^^^^^^^^^^^^^^^^^^^^^^^^^^^^^^^^^^^^^^^^^^^^^^^^^^^^^^^^^^^^^^^^^^^^^^^^^^^^^^^^^^^^^^^^^^^^^^^^^^^^^^^^^^^^^^^^^^^^^^^^^^^^^^^^^^^^^^^^^^^^^^^^^^^^^^^^^^^^^^^^^^^^^^^^^^^^^^^^^^^^^^^^^^^^^^^^^^^^^^^^^^^^^^^^^^^^^^^^^^^^^^^^^^^^^^^^^^^^^^^^^^^^^^^^^^^^^^^^^^^^^^^^^^^^^^^^^^^^^^^^^^^^^^^^^^^^^^^^^^^^^^^^^^^^^^^^^^^^^^^^^^^^^^^^^^^^^^^^^^^^^^^^^^^^^^^^^^^^^^^^^^^^^^^^^^^^^^^^^^^^^^^^^^^^^^^^^^^^^^^^^^^^^^^^^^^^^^^^^^^^^^^^^^^^^^^^^^^^^^^^^^^^^^^^^^^^^^^^^^^^^^^^^^^^^^^^^^^^^^^^^^^^^^^^^^^^^^^^^^^^^^^^^^^^^^^^^^^^^^^^^^^^^^^^^^^^^^^^^^^^^^^^^^^^^^^^^^^^^^^^^^^^^^^^^^^^^^^^^^^^^^^^^^^^^^^^^^^^^^^^^^^^^^^^^^^^^^^^^^^^^^^^^^^^^^^^^^^^^^^^^^^^^^^^^^^^^^^^^^^^^^^^^^^^^^^^^^^^^^^^^^^^^^^^^^^^^^^^^^^^^^^^^^^^^^^^^^^^^^^^^^^^^^^^^^^^^^^^^^^^^^^^^^^^^^^^^^^^^^^^^^^^^^^^^^^^^^^^^^^^^^^^^^^^^^^^^^^^^^^^^^^^^^^^^^^^^^^^^^^^^^^^^^^^^^^^^^^^^^^^^^^^^^^^^^^^^^^^^^^^^^^^^^^^^^^^^^^^^^^^^^^^^^^^^^^^^^^^^^^^^^^^^^^^^^^^^^^^^^^^^^^^^^^^^^^^^^^^^^^^^^^^^^^^^^^^^^^^^^^^^^^^^^^^^^^^^^^^^^^^^^^^^^^^^^^^^^^^^^^^^^^^^^^^^^^^^^^^^^^^^^^^^^^^^^^^^^^^^^^^^^^^^^^^^^^^^^^^^^^^^^^^^^^^^^^^^^^^^^^^^^^^^^^^^^^^^^^^^^^^^^^^^^^^^^^^^^^^^^^^^^^^^^^^^^^^^^^^^^^^^^^^^^^^^^^^^^^^^^^^^^^^^^^^^^^^^^^^^^^^^^^^^^^^^^^^^^^^^^^^^^^^^^^^^^^^^^^^^^^^^^^^^^^^^^^^^^^^^^^^^^^^^^^^^^^^^^^^^^^^^^^^^^^^^^^^^^^^^^^^^^^^^^^^^^^^^^^^^^^^^^^^^^^^^^^^^^^^^^^^^^^^^^^^^^^^^^^^^^^^^^^^^^^^^^^^^^^^^^^^^^^^^^^^^^^^^^^^^^^^^^^^^^^^^^^^^^^^^^^^^^^^^^^^^^^^^^^^^^^^^^^^^^^^^^^^^^^^^^^^^^^^^^^^^^^^^^^^^^^^^^^^^^^^^^^^^^^^^^^^^^^^^^^^^^^^^^^^^^^^^^^^^^^^^^^^^^^^^^^^^^^^^^^^^^^^^^^^^^^^^^^^^^^^^^^^^^^^^^^^^^^^^^^^^^^^^^^^^^^^^^^^^^^^^^^^^^^^^^^^^^^^^^^^^^^^^^^^^^^^^^^^^^^^^^^^^^^^^^^^^^^^^^^^^^^^^^^^^^^^^^^^^^^^^^^^^^^^^^^^^^^^^^^^^^^^^^^^^^^^^^^^^^^^^^^^^^^^^^^^^^^^^^^^^^^^^^^^^^^^^^^^^^^^^^^^^^^^^^^^^^^^^^^^^^
../../../../venv/lib/python3.12/site-packages/casatasks/private/task_flagdata.py:696: in flagdata
    summary_stats_list = aflocal.run(writeflags, True)
(8 more lines...)
Collapse Failed test_task_bandpass bandpass1_test.test1a
Test Tasks Many Linux 2.28 Rocky 8.10 Py3.12 < 1 sec
RuntimeError: Measures directory specified which does not contain the IERS data: /home/casatest/data/measures
../../../../venv/lib/python3.12/site-packages/casatasks/private/task_bandpass.py:134: in bandpass
    mycb.solve()
../../../../venv/lib/python3.12/site-packages/casatools/calibrater.py:485: in solve
    return self._swigobj.solve()
           ^^^^^^^^^^^^^^^^^^^^^
../../../../venv/lib/python3.12/site-packages/casatools/__casac__/calibrater.py:1133: in solve
    return _calibrater.calibrater_solve(self)
(19 more lines...)
Collapse Failed test_task_flagdata SomeClass.test_task_flagdata
Test Tasks Many Linux 2.28 Rocky 8.10 Py3.12 < 1 sec
Killed
Killed
Collapse Failed test_task_initweights initweights_tsys_map.testTsysMapNNSp
Test Tasks Many Linux 2.28 Rocky 8.10 Py3.12 < 1 sec
RuntimeError: Error in Calibrater::initWeights.
test_task_initweights.py:483: in testTsysMapNNSp
    self._runTest('tsys', True, [1,3,5,7,9,15], 'nearest,nearest',self.spwmap)
test_task_initweights.py:162: in _runTest
    initweights(vis=self.inputms,wtmode=wtmode,
../../../../venv/lib/python3.12/site-packages/casatasks/initweights.py:133: in __call__
    task_result = _initweights_t( _pc.document['vis'], _pc.document['wtmode'], _pc.document['tsystable'], _pc.document['gainfield'], _pc.document['interp'], _pc.document['spwmap'], _pc.document['dowtsp'] )
                  ^^^^^^^^^^^^^^^^^^^^^^^^^^^^^^^^^^^^^^^^^^^^^^^^^^^^^^^^^^^^^^^^^^^^^^^^^^^^^^^^^^^^^^^^^^^^^^^^^^^^^^^^^^^^^^^^^^^^^^^^^^^^^^^^^^^^^^^^^^^^^^^^^^^^^^^^^^^^^^^^^^^^^^^^^^^^^^^^^^^^^^^^^^^
(9 more lines...)
Collapse Failed test_task_initweights initweights_tsys_base.testTsysLC
Test Tasks Many Linux 2.28 Rocky 8.10 Py3.12 < 1 sec
RuntimeError: Error in Calibrater::initWeights.
test_task_initweights.py:363: in testTsysLC
    self._runTest('tsys', False, self.tsys_funcs.keys(), 'linear,cspline')
test_task_initweights.py:162: in _runTest
    initweights(vis=self.inputms,wtmode=wtmode,
../../../../venv/lib/python3.12/site-packages/casatasks/initweights.py:133: in __call__
    task_result = _initweights_t( _pc.document['vis'], _pc.document['wtmode'], _pc.document['tsystable'], _pc.document['gainfield'], _pc.document['interp'], _pc.document['spwmap'], _pc.document['dowtsp'] )
                  ^^^^^^^^^^^^^^^^^^^^^^^^^^^^^^^^^^^^^^^^^^^^^^^^^^^^^^^^^^^^^^^^^^^^^^^^^^^^^^^^^^^^^^^^^^^^^^^^^^^^^^^^^^^^^^^^^^^^^^^^^^^^^^^^^^^^^^^^^^^^^^^^^^^^^^^^^^^^^^^^^^^^^^^^^^^^^^^^^^^^^^^^^^^
(9 more lines...)
Collapse Failed test_task_initweights initweights_tsys_base.testTsysLCSp
Test Tasks Many Linux 2.28 Rocky 8.10 Py3.12 < 1 sec
RuntimeError: Error in Calibrater::initWeights.
test_task_initweights.py:387: in testTsysLCSp
    self._runTest('tsys', True, self.tsys_funcs.keys(), 'linear,cspline')
test_task_initweights.py:162: in _runTest
    initweights(vis=self.inputms,wtmode=wtmode,
../../../../venv/lib/python3.12/site-packages/casatasks/initweights.py:133: in __call__
    task_result = _initweights_t( _pc.document['vis'], _pc.document['wtmode'], _pc.document['tsystable'], _pc.document['gainfield'], _pc.document['interp'], _pc.document['spwmap'], _pc.document['dowtsp'] )
                  ^^^^^^^^^^^^^^^^^^^^^^^^^^^^^^^^^^^^^^^^^^^^^^^^^^^^^^^^^^^^^^^^^^^^^^^^^^^^^^^^^^^^^^^^^^^^^^^^^^^^^^^^^^^^^^^^^^^^^^^^^^^^^^^^^^^^^^^^^^^^^^^^^^^^^^^^^^^^^^^^^^^^^^^^^^^^^^^^^^^^^^^^^^^
(9 more lines...)
Collapse Failed test_task_initweights initweights_tsys_map.testTinttsysMapLCSp
Test Tasks Many Linux 2.28 Rocky 8.10 Py3.12 < 1 sec
RuntimeError: Error in Calibrater::initWeights.
test_task_initweights.py:503: in testTinttsysMapLCSp
    self._runTest('tinttsys', True, [1,3,5,7,9,11,13,15], 'linear,cspline',self.spwmap)
test_task_initweights.py:162: in _runTest
    initweights(vis=self.inputms,wtmode=wtmode,
../../../../venv/lib/python3.12/site-packages/casatasks/initweights.py:133: in __call__
    task_result = _initweights_t( _pc.document['vis'], _pc.document['wtmode'], _pc.document['tsystable'], _pc.document['gainfield'], _pc.document['interp'], _pc.document['spwmap'], _pc.document['dowtsp'] )
                  ^^^^^^^^^^^^^^^^^^^^^^^^^^^^^^^^^^^^^^^^^^^^^^^^^^^^^^^^^^^^^^^^^^^^^^^^^^^^^^^^^^^^^^^^^^^^^^^^^^^^^^^^^^^^^^^^^^^^^^^^^^^^^^^^^^^^^^^^^^^^^^^^^^^^^^^^^^^^^^^^^^^^^^^^^^^^^^^^^^^^^^^^^^^
(9 more lines...)
Collapse Failed test_task_initweights initweights_tsys_map.testTsysMapLCSp
Test Tasks Many Linux 2.28 Rocky 8.10 Py3.12 < 1 sec
RuntimeError: Error in Calibrater::initWeights.
test_task_initweights.py:491: in testTsysMapLCSp
    self._runTest('tsys', True, [1,3,5,7,9,11,13,15], 'linear,cspline',self.spwmap)
test_task_initweights.py:162: in _runTest
    initweights(vis=self.inputms,wtmode=wtmode,
../../../../venv/lib/python3.12/site-packages/casatasks/initweights.py:133: in __call__
    task_result = _initweights_t( _pc.document['vis'], _pc.document['wtmode'], _pc.document['tsystable'], _pc.document['gainfield'], _pc.document['interp'], _pc.document['spwmap'], _pc.document['dowtsp'] )
                  ^^^^^^^^^^^^^^^^^^^^^^^^^^^^^^^^^^^^^^^^^^^^^^^^^^^^^^^^^^^^^^^^^^^^^^^^^^^^^^^^^^^^^^^^^^^^^^^^^^^^^^^^^^^^^^^^^^^^^^^^^^^^^^^^^^^^^^^^^^^^^^^^^^^^^^^^^^^^^^^^^^^^^^^^^^^^^^^^^^^^^^^^^^^
(9 more lines...)
Collapse Failed test_task_initweights initweights_base.testWeightSp
Test Tasks Many Linux 2.28 Rocky 8.10 Py3.12 < 1 sec
RuntimeError: Error in Calibrater::initWeights.
test_task_initweights.py:591: in testWeightSp
    self._runTest('weight', True, self.valid_spw)
test_task_initweights.py:162: in _runTest
    initweights(vis=self.inputms,wtmode=wtmode,
../../../../venv/lib/python3.12/site-packages/casatasks/initweights.py:133: in __call__
    task_result = _initweights_t( _pc.document['vis'], _pc.document['wtmode'], _pc.document['tsystable'], _pc.document['gainfield'], _pc.document['interp'], _pc.document['spwmap'], _pc.document['dowtsp'] )
                  ^^^^^^^^^^^^^^^^^^^^^^^^^^^^^^^^^^^^^^^^^^^^^^^^^^^^^^^^^^^^^^^^^^^^^^^^^^^^^^^^^^^^^^^^^^^^^^^^^^^^^^^^^^^^^^^^^^^^^^^^^^^^^^^^^^^^^^^^^^^^^^^^^^^^^^^^^^^^^^^^^^^^^^^^^^^^^^^^^^^^^^^^^^^
(9 more lines...)
Collapse Failed test_task_initweights initweights_tsys_map.testTsysMapLC
Test Tasks Many Linux 2.28 Rocky 8.10 Py3.12 < 1 sec
RuntimeError: Error in Calibrater::initWeights.
test_task_initweights.py:467: in testTsysMapLC
    self._runTest('tsys', False, [1,3,5,7,9,11,13,15], 'linear,cspline',self.spwmap)
test_task_initweights.py:162: in _runTest
    initweights(vis=self.inputms,wtmode=wtmode,
../../../../venv/lib/python3.12/site-packages/casatasks/initweights.py:133: in __call__
    task_result = _initweights_t( _pc.document['vis'], _pc.document['wtmode'], _pc.document['tsystable'], _pc.document['gainfield'], _pc.document['interp'], _pc.document['spwmap'], _pc.document['dowtsp'] )
                  ^^^^^^^^^^^^^^^^^^^^^^^^^^^^^^^^^^^^^^^^^^^^^^^^^^^^^^^^^^^^^^^^^^^^^^^^^^^^^^^^^^^^^^^^^^^^^^^^^^^^^^^^^^^^^^^^^^^^^^^^^^^^^^^^^^^^^^^^^^^^^^^^^^^^^^^^^^^^^^^^^^^^^^^^^^^^^^^^^^^^^^^^^^^
(9 more lines...)
Collapse Failed test_task_initweights initweights_tsys_map.testTinttsysMapLLSp
Test Tasks Many Linux 2.28 Rocky 8.10 Py3.12 < 1 sec
RuntimeError: Error in Calibrater::initWeights.
test_task_initweights.py:499: in testTinttsysMapLLSp
    self._runTest('tinttsys', True, [1,3,5,7,9,11,15], 'linear,linear',self.spwmap)
test_task_initweights.py:162: in _runTest
    initweights(vis=self.inputms,wtmode=wtmode,
../../../../venv/lib/python3.12/site-packages/casatasks/initweights.py:133: in __call__
    task_result = _initweights_t( _pc.document['vis'], _pc.document['wtmode'], _pc.document['tsystable'], _pc.document['gainfield'], _pc.document['interp'], _pc.document['spwmap'], _pc.document['dowtsp'] )
                  ^^^^^^^^^^^^^^^^^^^^^^^^^^^^^^^^^^^^^^^^^^^^^^^^^^^^^^^^^^^^^^^^^^^^^^^^^^^^^^^^^^^^^^^^^^^^^^^^^^^^^^^^^^^^^^^^^^^^^^^^^^^^^^^^^^^^^^^^^^^^^^^^^^^^^^^^^^^^^^^^^^^^^^^^^^^^^^^^^^^^^^^^^^^
(9 more lines...)
Collapse Failed test_task_initweights initweights_tsys_base.testTinttsysLCSp
Test Tasks Many Linux 2.28 Rocky 8.10 Py3.12 < 1 sec
RuntimeError: Error in Calibrater::initWeights.
test_task_initweights.py:399: in testTinttsysLCSp
    self._runTest('tinttsys', True, self.tsys_funcs.keys(), 'nearest,nearest')
test_task_initweights.py:162: in _runTest
    initweights(vis=self.inputms,wtmode=wtmode,
../../../../venv/lib/python3.12/site-packages/casatasks/initweights.py:133: in __call__
    task_result = _initweights_t( _pc.document['vis'], _pc.document['wtmode'], _pc.document['tsystable'], _pc.document['gainfield'], _pc.document['interp'], _pc.document['spwmap'], _pc.document['dowtsp'] )
                  ^^^^^^^^^^^^^^^^^^^^^^^^^^^^^^^^^^^^^^^^^^^^^^^^^^^^^^^^^^^^^^^^^^^^^^^^^^^^^^^^^^^^^^^^^^^^^^^^^^^^^^^^^^^^^^^^^^^^^^^^^^^^^^^^^^^^^^^^^^^^^^^^^^^^^^^^^^^^^^^^^^^^^^^^^^^^^^^^^^^^^^^^^^^
(9 more lines...)
Collapse Failed test_task_initweights initweights_tsys_map.testTsysMapLLSp
Test Tasks Many Linux 2.28 Rocky 8.10 Py3.12 < 1 sec
RuntimeError: Error in Calibrater::initWeights.
test_task_initweights.py:487: in testTsysMapLLSp
    self._runTest('tsys', True, [1,3,5,7,9,11,15], 'linear,linear',self.spwmap)
test_task_initweights.py:162: in _runTest
    initweights(vis=self.inputms,wtmode=wtmode,
../../../../venv/lib/python3.12/site-packages/casatasks/initweights.py:133: in __call__
    task_result = _initweights_t( _pc.document['vis'], _pc.document['wtmode'], _pc.document['tsystable'], _pc.document['gainfield'], _pc.document['interp'], _pc.document['spwmap'], _pc.document['dowtsp'] )
                  ^^^^^^^^^^^^^^^^^^^^^^^^^^^^^^^^^^^^^^^^^^^^^^^^^^^^^^^^^^^^^^^^^^^^^^^^^^^^^^^^^^^^^^^^^^^^^^^^^^^^^^^^^^^^^^^^^^^^^^^^^^^^^^^^^^^^^^^^^^^^^^^^^^^^^^^^^^^^^^^^^^^^^^^^^^^^^^^^^^^^^^^^^^^
(9 more lines...)
Collapse Failed test_task_initweights initweights_base.testNyqSp
Test Tasks Many Linux 2.28 Rocky 8.10 Py3.12 < 1 sec
RuntimeError: Error in Calibrater::initWeights.
test_task_initweights.py:565: in testNyqSp
    self._runTest('nyq', True, self.valid_spw)
test_task_initweights.py:162: in _runTest
    initweights(vis=self.inputms,wtmode=wtmode,
../../../../venv/lib/python3.12/site-packages/casatasks/initweights.py:133: in __call__
    task_result = _initweights_t( _pc.document['vis'], _pc.document['wtmode'], _pc.document['tsystable'], _pc.document['gainfield'], _pc.document['interp'], _pc.document['spwmap'], _pc.document['dowtsp'] )
                  ^^^^^^^^^^^^^^^^^^^^^^^^^^^^^^^^^^^^^^^^^^^^^^^^^^^^^^^^^^^^^^^^^^^^^^^^^^^^^^^^^^^^^^^^^^^^^^^^^^^^^^^^^^^^^^^^^^^^^^^^^^^^^^^^^^^^^^^^^^^^^^^^^^^^^^^^^^^^^^^^^^^^^^^^^^^^^^^^^^^^^^^^^^^
(9 more lines...)
Collapse Failed test_task_initweights initweights_tsys_map.testTinttsysMapNNSp
Test Tasks Many Linux 2.28 Rocky 8.10 Py3.12 < 1 sec
RuntimeError: Error in Calibrater::initWeights.
test_task_initweights.py:495: in testTinttsysMapNNSp
    self._runTest('tinttsys', True, [1,3,5,7,9,15], 'nearest,nearest',self.spwmap)
test_task_initweights.py:162: in _runTest
    initweights(vis=self.inputms,wtmode=wtmode,
../../../../venv/lib/python3.12/site-packages/casatasks/initweights.py:133: in __call__
    task_result = _initweights_t( _pc.document['vis'], _pc.document['wtmode'], _pc.document['tsystable'], _pc.document['gainfield'], _pc.document['interp'], _pc.document['spwmap'], _pc.document['dowtsp'] )
                  ^^^^^^^^^^^^^^^^^^^^^^^^^^^^^^^^^^^^^^^^^^^^^^^^^^^^^^^^^^^^^^^^^^^^^^^^^^^^^^^^^^^^^^^^^^^^^^^^^^^^^^^^^^^^^^^^^^^^^^^^^^^^^^^^^^^^^^^^^^^^^^^^^^^^^^^^^^^^^^^^^^^^^^^^^^^^^^^^^^^^^^^^^^^
(9 more lines...)
Collapse Failed test_task_initweights initweights_tsys_map.testTinttsysMapLL
Test Tasks Many Linux 2.28 Rocky 8.10 Py3.12 < 1 sec
RuntimeError: Error in Calibrater::initWeights.
test_task_initweights.py:475: in testTinttsysMapLL
    self._runTest('tinttsys', False, [1,3,5,7,9,11,15], 'linear,linear',self.spwmap)
test_task_initweights.py:162: in _runTest
    initweights(vis=self.inputms,wtmode=wtmode,
../../../../venv/lib/python3.12/site-packages/casatasks/initweights.py:133: in __call__
    task_result = _initweights_t( _pc.document['vis'], _pc.document['wtmode'], _pc.document['tsystable'], _pc.document['gainfield'], _pc.document['interp'], _pc.document['spwmap'], _pc.document['dowtsp'] )
                  ^^^^^^^^^^^^^^^^^^^^^^^^^^^^^^^^^^^^^^^^^^^^^^^^^^^^^^^^^^^^^^^^^^^^^^^^^^^^^^^^^^^^^^^^^^^^^^^^^^^^^^^^^^^^^^^^^^^^^^^^^^^^^^^^^^^^^^^^^^^^^^^^^^^^^^^^^^^^^^^^^^^^^^^^^^^^^^^^^^^^^^^^^^^
(9 more lines...)
Collapse Failed test_task_initweights initweights_tsys_base.testTsysLLSp
Test Tasks Many Linux 2.28 Rocky 8.10 Py3.12 < 1 sec
RuntimeError: Error in Calibrater::initWeights.
test_task_initweights.py:383: in testTsysLLSp
    self._runTest('tsys', True, self.tsys_funcs.keys(), 'linear,linear')
test_task_initweights.py:162: in _runTest
    initweights(vis=self.inputms,wtmode=wtmode,
../../../../venv/lib/python3.12/site-packages/casatasks/initweights.py:133: in __call__
    task_result = _initweights_t( _pc.document['vis'], _pc.document['wtmode'], _pc.document['tsystable'], _pc.document['gainfield'], _pc.document['interp'], _pc.document['spwmap'], _pc.document['dowtsp'] )
                  ^^^^^^^^^^^^^^^^^^^^^^^^^^^^^^^^^^^^^^^^^^^^^^^^^^^^^^^^^^^^^^^^^^^^^^^^^^^^^^^^^^^^^^^^^^^^^^^^^^^^^^^^^^^^^^^^^^^^^^^^^^^^^^^^^^^^^^^^^^^^^^^^^^^^^^^^^^^^^^^^^^^^^^^^^^^^^^^^^^^^^^^^^^^
(9 more lines...)
Collapse Failed test_task_initweights initweights_tsys_base.testTinttsysLL
Test Tasks Many Linux 2.28 Rocky 8.10 Py3.12 < 1 sec
RuntimeError: Error in Calibrater::initWeights.
test_task_initweights.py:371: in testTinttsysLL
    self._runTest('tinttsys', False, self.tsys_funcs.keys(), 'nearest,nearest')
test_task_initweights.py:162: in _runTest
    initweights(vis=self.inputms,wtmode=wtmode,
../../../../venv/lib/python3.12/site-packages/casatasks/initweights.py:133: in __call__
    task_result = _initweights_t( _pc.document['vis'], _pc.document['wtmode'], _pc.document['tsystable'], _pc.document['gainfield'], _pc.document['interp'], _pc.document['spwmap'], _pc.document['dowtsp'] )
                  ^^^^^^^^^^^^^^^^^^^^^^^^^^^^^^^^^^^^^^^^^^^^^^^^^^^^^^^^^^^^^^^^^^^^^^^^^^^^^^^^^^^^^^^^^^^^^^^^^^^^^^^^^^^^^^^^^^^^^^^^^^^^^^^^^^^^^^^^^^^^^^^^^^^^^^^^^^^^^^^^^^^^^^^^^^^^^^^^^^^^^^^^^^^
(9 more lines...)
Collapse Failed test_task_initweights initweights_tsys_base.testTinttsysNN
Test Tasks Many Linux 2.28 Rocky 8.10 Py3.12 < 1 sec
RuntimeError: Error in Calibrater::initWeights.
test_task_initweights.py:367: in testTinttsysNN
    self._runTest('tinttsys', False, self.tsys_funcs.keys(), 'nearest,nearest')
test_task_initweights.py:162: in _runTest
    initweights(vis=self.inputms,wtmode=wtmode,
../../../../venv/lib/python3.12/site-packages/casatasks/initweights.py:133: in __call__
    task_result = _initweights_t( _pc.document['vis'], _pc.document['wtmode'], _pc.document['tsystable'], _pc.document['gainfield'], _pc.document['interp'], _pc.document['spwmap'], _pc.document['dowtsp'] )
                  ^^^^^^^^^^^^^^^^^^^^^^^^^^^^^^^^^^^^^^^^^^^^^^^^^^^^^^^^^^^^^^^^^^^^^^^^^^^^^^^^^^^^^^^^^^^^^^^^^^^^^^^^^^^^^^^^^^^^^^^^^^^^^^^^^^^^^^^^^^^^^^^^^^^^^^^^^^^^^^^^^^^^^^^^^^^^^^^^^^^^^^^^^^^
(9 more lines...)
Collapse Failed test_task_initweights initweights_tsys_map.testTsysMapNN
Test Tasks Many Linux 2.28 Rocky 8.10 Py3.12 < 1 sec
RuntimeError: Error in Calibrater::initWeights.
test_task_initweights.py:459: in testTsysMapNN
    self._runTest('tsys', False, [1,3,5,7,9,15], 'nearest,nearest',self.spwmap)
test_task_initweights.py:162: in _runTest
    initweights(vis=self.inputms,wtmode=wtmode,
../../../../venv/lib/python3.12/site-packages/casatasks/initweights.py:133: in __call__
    task_result = _initweights_t( _pc.document['vis'], _pc.document['wtmode'], _pc.document['tsystable'], _pc.document['gainfield'], _pc.document['interp'], _pc.document['spwmap'], _pc.document['dowtsp'] )
                  ^^^^^^^^^^^^^^^^^^^^^^^^^^^^^^^^^^^^^^^^^^^^^^^^^^^^^^^^^^^^^^^^^^^^^^^^^^^^^^^^^^^^^^^^^^^^^^^^^^^^^^^^^^^^^^^^^^^^^^^^^^^^^^^^^^^^^^^^^^^^^^^^^^^^^^^^^^^^^^^^^^^^^^^^^^^^^^^^^^^^^^^^^^^
(9 more lines...)
Collapse Failed test_task_initweights initweights_tsys_base.testTinttsysLC
Test Tasks Many Linux 2.28 Rocky 8.10 Py3.12 < 1 sec
RuntimeError: Error in Calibrater::initWeights.
test_task_initweights.py:375: in testTinttsysLC
    self._runTest('tinttsys', False, self.tsys_funcs.keys(), 'nearest,nearest')
test_task_initweights.py:162: in _runTest
    initweights(vis=self.inputms,wtmode=wtmode,
../../../../venv/lib/python3.12/site-packages/casatasks/initweights.py:133: in __call__
    task_result = _initweights_t( _pc.document['vis'], _pc.document['wtmode'], _pc.document['tsystable'], _pc.document['gainfield'], _pc.document['interp'], _pc.document['spwmap'], _pc.document['dowtsp'] )
                  ^^^^^^^^^^^^^^^^^^^^^^^^^^^^^^^^^^^^^^^^^^^^^^^^^^^^^^^^^^^^^^^^^^^^^^^^^^^^^^^^^^^^^^^^^^^^^^^^^^^^^^^^^^^^^^^^^^^^^^^^^^^^^^^^^^^^^^^^^^^^^^^^^^^^^^^^^^^^^^^^^^^^^^^^^^^^^^^^^^^^^^^^^^^
(9 more lines...)
Collapse Failed test_task_initweights initweights_base.testSigma
Test Tasks Many Linux 2.28 Rocky 8.10 Py3.12 < 1 sec
RuntimeError: Error in Calibrater::initWeights.
test_task_initweights.py:569: in testSigma
    self._runTest('sigma', False, self.valid_spw)
test_task_initweights.py:162: in _runTest
    initweights(vis=self.inputms,wtmode=wtmode,
../../../../venv/lib/python3.12/site-packages/casatasks/initweights.py:133: in __call__
    task_result = _initweights_t( _pc.document['vis'], _pc.document['wtmode'], _pc.document['tsystable'], _pc.document['gainfield'], _pc.document['interp'], _pc.document['spwmap'], _pc.document['dowtsp'] )
                  ^^^^^^^^^^^^^^^^^^^^^^^^^^^^^^^^^^^^^^^^^^^^^^^^^^^^^^^^^^^^^^^^^^^^^^^^^^^^^^^^^^^^^^^^^^^^^^^^^^^^^^^^^^^^^^^^^^^^^^^^^^^^^^^^^^^^^^^^^^^^^^^^^^^^^^^^^^^^^^^^^^^^^^^^^^^^^^^^^^^^^^^^^^^
(9 more lines...)
Collapse Failed test_task_initweights initweights_tsys_base.testTinttsysNNSp
Test Tasks Many Linux 2.28 Rocky 8.10 Py3.12 < 1 sec
RuntimeError: Error in Calibrater::initWeights.
test_task_initweights.py:391: in testTinttsysNNSp
    self._runTest('tinttsys', True, self.tsys_funcs.keys(), 'nearest,nearest')
test_task_initweights.py:162: in _runTest
    initweights(vis=self.inputms,wtmode=wtmode,
../../../../venv/lib/python3.12/site-packages/casatasks/initweights.py:133: in __call__
    task_result = _initweights_t( _pc.document['vis'], _pc.document['wtmode'], _pc.document['tsystable'], _pc.document['gainfield'], _pc.document['interp'], _pc.document['spwmap'], _pc.document['dowtsp'] )
                  ^^^^^^^^^^^^^^^^^^^^^^^^^^^^^^^^^^^^^^^^^^^^^^^^^^^^^^^^^^^^^^^^^^^^^^^^^^^^^^^^^^^^^^^^^^^^^^^^^^^^^^^^^^^^^^^^^^^^^^^^^^^^^^^^^^^^^^^^^^^^^^^^^^^^^^^^^^^^^^^^^^^^^^^^^^^^^^^^^^^^^^^^^^^
(9 more lines...)
Collapse Failed test_task_initweights initweights_tsys_base.testTsysLL
Test Tasks Many Linux 2.28 Rocky 8.10 Py3.12 < 1 sec
RuntimeError: Error in Calibrater::initWeights.
test_task_initweights.py:359: in testTsysLL
    self._runTest('tsys', False, self.tsys_funcs.keys(), 'linear,linear')
test_task_initweights.py:162: in _runTest
    initweights(vis=self.inputms,wtmode=wtmode,
../../../../venv/lib/python3.12/site-packages/casatasks/initweights.py:133: in __call__
    task_result = _initweights_t( _pc.document['vis'], _pc.document['wtmode'], _pc.document['tsystable'], _pc.document['gainfield'], _pc.document['interp'], _pc.document['spwmap'], _pc.document['dowtsp'] )
                  ^^^^^^^^^^^^^^^^^^^^^^^^^^^^^^^^^^^^^^^^^^^^^^^^^^^^^^^^^^^^^^^^^^^^^^^^^^^^^^^^^^^^^^^^^^^^^^^^^^^^^^^^^^^^^^^^^^^^^^^^^^^^^^^^^^^^^^^^^^^^^^^^^^^^^^^^^^^^^^^^^^^^^^^^^^^^^^^^^^^^^^^^^^^
(9 more lines...)
Collapse Failed test_task_initweights initweights_tsys_base.testTsysNNSp
Test Tasks Many Linux 2.28 Rocky 8.10 Py3.12 < 1 sec
RuntimeError: Error in Calibrater::initWeights.
test_task_initweights.py:379: in testTsysNNSp
    self._runTest('tsys', True, self.tsys_funcs.keys(), 'nearest,nearest')
test_task_initweights.py:162: in _runTest
    initweights(vis=self.inputms,wtmode=wtmode,
../../../../venv/lib/python3.12/site-packages/casatasks/initweights.py:133: in __call__
    task_result = _initweights_t( _pc.document['vis'], _pc.document['wtmode'], _pc.document['tsystable'], _pc.document['gainfield'], _pc.document['interp'], _pc.document['spwmap'], _pc.document['dowtsp'] )
                  ^^^^^^^^^^^^^^^^^^^^^^^^^^^^^^^^^^^^^^^^^^^^^^^^^^^^^^^^^^^^^^^^^^^^^^^^^^^^^^^^^^^^^^^^^^^^^^^^^^^^^^^^^^^^^^^^^^^^^^^^^^^^^^^^^^^^^^^^^^^^^^^^^^^^^^^^^^^^^^^^^^^^^^^^^^^^^^^^^^^^^^^^^^^
(9 more lines...)
Collapse Failed test_task_initweights initweights_base.testOnes
Test Tasks Many Linux 2.28 Rocky 8.10 Py3.12 < 1 sec
RuntimeError: Error in Calibrater::initWeights.
test_task_initweights.py:553: in testOnes
    self._runTest('ones', False, self.valid_spw)
test_task_initweights.py:162: in _runTest
    initweights(vis=self.inputms,wtmode=wtmode,
../../../../venv/lib/python3.12/site-packages/casatasks/initweights.py:133: in __call__
    task_result = _initweights_t( _pc.document['vis'], _pc.document['wtmode'], _pc.document['tsystable'], _pc.document['gainfield'], _pc.document['interp'], _pc.document['spwmap'], _pc.document['dowtsp'] )
                  ^^^^^^^^^^^^^^^^^^^^^^^^^^^^^^^^^^^^^^^^^^^^^^^^^^^^^^^^^^^^^^^^^^^^^^^^^^^^^^^^^^^^^^^^^^^^^^^^^^^^^^^^^^^^^^^^^^^^^^^^^^^^^^^^^^^^^^^^^^^^^^^^^^^^^^^^^^^^^^^^^^^^^^^^^^^^^^^^^^^^^^^^^^^
(9 more lines...)
Collapse Failed test_task_initweights initweights_tsys_base.testTsysNN
Test Tasks Many Linux 2.28 Rocky 8.10 Py3.12 < 1 sec
RuntimeError: Error in Calibrater::initWeights.
test_task_initweights.py:355: in testTsysNN
    self._runTest('tsys', False, self.tsys_funcs.keys(), 'nearest,nearest')
test_task_initweights.py:162: in _runTest
    initweights(vis=self.inputms,wtmode=wtmode,
../../../../venv/lib/python3.12/site-packages/casatasks/initweights.py:133: in __call__
    task_result = _initweights_t( _pc.document['vis'], _pc.document['wtmode'], _pc.document['tsystable'], _pc.document['gainfield'], _pc.document['interp'], _pc.document['spwmap'], _pc.document['dowtsp'] )
                  ^^^^^^^^^^^^^^^^^^^^^^^^^^^^^^^^^^^^^^^^^^^^^^^^^^^^^^^^^^^^^^^^^^^^^^^^^^^^^^^^^^^^^^^^^^^^^^^^^^^^^^^^^^^^^^^^^^^^^^^^^^^^^^^^^^^^^^^^^^^^^^^^^^^^^^^^^^^^^^^^^^^^^^^^^^^^^^^^^^^^^^^^^^^
(9 more lines...)
Collapse Failed test_task_initweights initweights_tsys_base.testTinttsysLLSp
Test Tasks Many Linux 2.28 Rocky 8.10 Py3.12 < 1 sec
RuntimeError: Error in Calibrater::initWeights.
test_task_initweights.py:395: in testTinttsysLLSp
    self._runTest('tinttsys', True, self.tsys_funcs.keys(), 'nearest,nearest')
test_task_initweights.py:162: in _runTest
    initweights(vis=self.inputms,wtmode=wtmode,
../../../../venv/lib/python3.12/site-packages/casatasks/initweights.py:133: in __call__
    task_result = _initweights_t( _pc.document['vis'], _pc.document['wtmode'], _pc.document['tsystable'], _pc.document['gainfield'], _pc.document['interp'], _pc.document['spwmap'], _pc.document['dowtsp'] )
                  ^^^^^^^^^^^^^^^^^^^^^^^^^^^^^^^^^^^^^^^^^^^^^^^^^^^^^^^^^^^^^^^^^^^^^^^^^^^^^^^^^^^^^^^^^^^^^^^^^^^^^^^^^^^^^^^^^^^^^^^^^^^^^^^^^^^^^^^^^^^^^^^^^^^^^^^^^^^^^^^^^^^^^^^^^^^^^^^^^^^^^^^^^^^
(9 more lines...)
Collapse Failed test_task_initweights initweights_tsys_map.testTinttsysMapLC
Test Tasks Many Linux 2.28 Rocky 8.10 Py3.12 < 1 sec
RuntimeError: Error in Calibrater::initWeights.
test_task_initweights.py:479: in testTinttsysMapLC
    self._runTest('tinttsys', False, [1,3,5,7,9,11,13,15], 'linear,cspline',self.spwmap)
test_task_initweights.py:162: in _runTest
    initweights(vis=self.inputms,wtmode=wtmode,
../../../../venv/lib/python3.12/site-packages/casatasks/initweights.py:133: in __call__
    task_result = _initweights_t( _pc.document['vis'], _pc.document['wtmode'], _pc.document['tsystable'], _pc.document['gainfield'], _pc.document['interp'], _pc.document['spwmap'], _pc.document['dowtsp'] )
                  ^^^^^^^^^^^^^^^^^^^^^^^^^^^^^^^^^^^^^^^^^^^^^^^^^^^^^^^^^^^^^^^^^^^^^^^^^^^^^^^^^^^^^^^^^^^^^^^^^^^^^^^^^^^^^^^^^^^^^^^^^^^^^^^^^^^^^^^^^^^^^^^^^^^^^^^^^^^^^^^^^^^^^^^^^^^^^^^^^^^^^^^^^^^
(9 more lines...)
Collapse Failed test_task_initweights initweights_base.testSigmaSp
Test Tasks Many Linux 2.28 Rocky 8.10 Py3.12 < 1 sec
RuntimeError: Error in Calibrater::initWeights.
test_task_initweights.py:573: in testSigmaSp
    self._runTest('sigma', True, self.valid_spw)
test_task_initweights.py:162: in _runTest
    initweights(vis=self.inputms,wtmode=wtmode,
../../../../venv/lib/python3.12/site-packages/casatasks/initweights.py:133: in __call__
    task_result = _initweights_t( _pc.document['vis'], _pc.document['wtmode'], _pc.document['tsystable'], _pc.document['gainfield'], _pc.document['interp'], _pc.document['spwmap'], _pc.document['dowtsp'] )
                  ^^^^^^^^^^^^^^^^^^^^^^^^^^^^^^^^^^^^^^^^^^^^^^^^^^^^^^^^^^^^^^^^^^^^^^^^^^^^^^^^^^^^^^^^^^^^^^^^^^^^^^^^^^^^^^^^^^^^^^^^^^^^^^^^^^^^^^^^^^^^^^^^^^^^^^^^^^^^^^^^^^^^^^^^^^^^^^^^^^^^^^^^^^^
(9 more lines...)
Collapse Failed test_task_initweights initweights_base.testOnesSp
Test Tasks Many Linux 2.28 Rocky 8.10 Py3.12 < 1 sec
RuntimeError: Error in Calibrater::initWeights.
test_task_initweights.py:557: in testOnesSp
    self._runTest('ones', True, self.valid_spw)
test_task_initweights.py:162: in _runTest
    initweights(vis=self.inputms,wtmode=wtmode,
../../../../venv/lib/python3.12/site-packages/casatasks/initweights.py:133: in __call__
    task_result = _initweights_t( _pc.document['vis'], _pc.document['wtmode'], _pc.document['tsystable'], _pc.document['gainfield'], _pc.document['interp'], _pc.document['spwmap'], _pc.document['dowtsp'] )
                  ^^^^^^^^^^^^^^^^^^^^^^^^^^^^^^^^^^^^^^^^^^^^^^^^^^^^^^^^^^^^^^^^^^^^^^^^^^^^^^^^^^^^^^^^^^^^^^^^^^^^^^^^^^^^^^^^^^^^^^^^^^^^^^^^^^^^^^^^^^^^^^^^^^^^^^^^^^^^^^^^^^^^^^^^^^^^^^^^^^^^^^^^^^^
(9 more lines...)
Collapse Failed test_task_initweights initweights_tsys_map.testTinttsysMapNN
Test Tasks Many Linux 2.28 Rocky 8.10 Py3.12 < 1 sec
RuntimeError: Error in Calibrater::initWeights.
test_task_initweights.py:471: in testTinttsysMapNN
    self._runTest('tinttsys', False, [1,3,5,7,15], 'nearest,nearest',self.spwmap)
test_task_initweights.py:162: in _runTest
    initweights(vis=self.inputms,wtmode=wtmode,
../../../../venv/lib/python3.12/site-packages/casatasks/initweights.py:133: in __call__
    task_result = _initweights_t( _pc.document['vis'], _pc.document['wtmode'], _pc.document['tsystable'], _pc.document['gainfield'], _pc.document['interp'], _pc.document['spwmap'], _pc.document['dowtsp'] )
                  ^^^^^^^^^^^^^^^^^^^^^^^^^^^^^^^^^^^^^^^^^^^^^^^^^^^^^^^^^^^^^^^^^^^^^^^^^^^^^^^^^^^^^^^^^^^^^^^^^^^^^^^^^^^^^^^^^^^^^^^^^^^^^^^^^^^^^^^^^^^^^^^^^^^^^^^^^^^^^^^^^^^^^^^^^^^^^^^^^^^^^^^^^^^
(9 more lines...)
Collapse Failed test_task_initweights initweights_base.testNyq
Test Tasks Many Linux 2.28 Rocky 8.10 Py3.12 < 1 sec
RuntimeError: Error in Calibrater::initWeights.
test_task_initweights.py:561: in testNyq
    self._runTest('nyq', False, self.valid_spw)
test_task_initweights.py:162: in _runTest
    initweights(vis=self.inputms,wtmode=wtmode,
../../../../venv/lib/python3.12/site-packages/casatasks/initweights.py:133: in __call__
    task_result = _initweights_t( _pc.document['vis'], _pc.document['wtmode'], _pc.document['tsystable'], _pc.document['gainfield'], _pc.document['interp'], _pc.document['spwmap'], _pc.document['dowtsp'] )
                  ^^^^^^^^^^^^^^^^^^^^^^^^^^^^^^^^^^^^^^^^^^^^^^^^^^^^^^^^^^^^^^^^^^^^^^^^^^^^^^^^^^^^^^^^^^^^^^^^^^^^^^^^^^^^^^^^^^^^^^^^^^^^^^^^^^^^^^^^^^^^^^^^^^^^^^^^^^^^^^^^^^^^^^^^^^^^^^^^^^^^^^^^^^^
(9 more lines...)
Collapse Failed test_task_initweights initweights_tsys_map.testTsysMapLL
Test Tasks Many Linux 2.28 Rocky 8.10 Py3.12 < 1 sec
RuntimeError: Error in Calibrater::initWeights.
test_task_initweights.py:463: in testTsysMapLL
    self._runTest('tsys', False, [1,3,5,7,9,11,15], 'linear,linear',self.spwmap)
test_task_initweights.py:162: in _runTest
    initweights(vis=self.inputms,wtmode=wtmode,
../../../../venv/lib/python3.12/site-packages/casatasks/initweights.py:133: in __call__
    task_result = _initweights_t( _pc.document['vis'], _pc.document['wtmode'], _pc.document['tsystable'], _pc.document['gainfield'], _pc.document['interp'], _pc.document['spwmap'], _pc.document['dowtsp'] )
                  ^^^^^^^^^^^^^^^^^^^^^^^^^^^^^^^^^^^^^^^^^^^^^^^^^^^^^^^^^^^^^^^^^^^^^^^^^^^^^^^^^^^^^^^^^^^^^^^^^^^^^^^^^^^^^^^^^^^^^^^^^^^^^^^^^^^^^^^^^^^^^^^^^^^^^^^^^^^^^^^^^^^^^^^^^^^^^^^^^^^^^^^^^^^
(9 more lines...)
Collapse Failed test_task_pccor pccor_test_splitMses.test_splitMses_non_contiguous_ms
Test Tasks Many Linux 2.28 Rocky 8.10 Py3.12 < 1 sec
AssertionError: False is not true : pccor should not throw exceptions with a non contigous split ms
test_task_pccor.py:360: in test_splitMses_non_contiguous_ms
    self.assertTrue(passed, 'pccor should not throw exceptions with a non contigous split ms')
E   AssertionError: False is not true : pccor should not throw exceptions with a non contigous split ms
Collapse Failed test_task_pccor pccor_test_parse.test_provideFringeFitTable_equal
Test Tasks Many Linux 2.28 Rocky 8.10 Py3.12 < 1 sec
RuntimeError: Error in Calibrater::solve.
test_task_pccor.py:233: in test_provideFringeFitTable_equal
    fringefit(vis=def_ms,
../../../../venv/lib/python3.12/site-packages/casatasks/fringefit.py:211: in __call__
    task_result = _fringefit_t( _pc.document['vis'], _pc.document['caltable'], _pc.document['field'], _pc.document['spw'], _pc.document['intent'], _pc.document['selectdata'], _pc.document['timerange'], _pc.document['uvrange'], _pc.document['antenna'], _pc.document['scan'], _pc.document['observation'], _pc.document['msselect'], _pc.document['solint'], _pc.document['combine'], _pc.document['refant'], _pc.document['minsnr'], _pc.document['zerorates'], _pc.document['globalsolve'], _pc.document['niter'], _pc.document['delaywindow'], _pc.document['ratewindow'], _pc.document['append'], _pc.document['corrdepflags'], _pc.document['corrcomb'], _pc.document['docallib'], _pc.document['callib'], _pc.document['gaintable'], _pc.document['gainfield'], _pc.document['interp'], _pc.document['spwmap'], _pc.document['paramactive'], _pc.document['concatspws'], _pc.document['parang'] )
                  ^^^^^^^^^^^^^^^^^^^^^^^^^^^^^^^^^^^^^^^^^^^^^^^^^^^^^^^^^^^^^^^^^^^^^^^^^^^^^^^^^^^^^^^^^^^^^^^^^^^^^^^^^^^^^^^^^^^^^^^^^^^^^^^^^^^^^^^^^^^^^^^^^^^^^^^^^^^^^^^^^^^^^^^^^^^^^^^^^^^^^^^^^^^^^^^^^^^^^^^^^^^^^^^^^^^^^^^^^^^^^^^^^^^^^^^^^^^^^^^^^^^^^^^^^^^^^^^^^^^^^^^^^^^^^^^^^^^^^^^^^^^^^^^^^^^^^^^^^^^^^^^^^^^^^^^^^^^^^^^^^^^^^^^^^^^^^^^^^^^^^^^^^^^^^^^^^^^^^^^^^^^^^^^^^^^^^^^^^^^^^^^^^^^^^^^^^^^^^^^^^^^^^^^^^^^^^^^^^^^^^^^^^^^^^^^^^^^^^^^^^^^^^^^^^^^^^^^^^^^^^^^^^^^^^^^^^^^^^^^^^^^^^^^^^^^^^^^^^^^^^^^^^^^^^^^^^^^^^^^^^^^^^^^^^^^^^^^^^^^^^^^^^^^^^^^^^^^^^^^^^^^^^^^^^^^^^^^^^^^^^^^^^^^^^^^^^^^^^^^^^^^^^^^^^^^^^^^^^^^^^^^^^^^^^^^^^^^^^^^^^^^^^^^^^^^^^^^^^^^^^^^^^^^^^^^^^^^^^^^^^^^^^^^^^^^^^^^^^^^^^^^^^^^^^^^^^^^^^^^^^^^^^^^^^^^^^^^^^^^^^^^^^^^^^^^^^^^^^^^^^^^^^^^^^^^^^^^^^^^^^^^^^^^^^^^^^^^^^^^^^^^^^^^^^^^^^^^^^^^^^^^^^^^^^^^^^^^^^^^^^^^^^^^^^^^^^^^^^
../../../../venv/lib/python3.12/site-packages/casatasks/private/task_fringefit.py:133: in fringefit
    mycb.solve()
(7 more lines...)
Collapse Failed test_task_pccor pccor_test_splitMses.test_splitMses_contiguous_ms
Test Tasks Many Linux 2.28 Rocky 8.10 Py3.12 < 1 sec
AssertionError: False is not true : pccor should not throw exceptions with a contigous split ms
test_task_pccor.py:352: in test_splitMses_contiguous_ms
    self.assertTrue(passed, 'pccor should not throw exceptions with a contigous split ms')
E   AssertionError: False is not true : pccor should not throw exceptions with a contigous split ms
Collapse Failed test_task_pccor pccor_test_solutionValues.test_solutionValues
Test Tasks Many Linux 2.28 Rocky 8.10 Py3.12 3 secs
RuntimeError: Error in Calibrater::solve.
test_task_pccor.py:277: in test_solutionValues
    run_pccor()
test_task_pccor.py:43: in run_pccor
    ret_dict = pccor(
../../../../venv/lib/python3.12/site-packages/casatasks/pccor.py:62: in __call__
    task_result = _pccor_t( _pc.document['vis'], _pc.document['pccor_caltable'], _pc.document['refant'], _pc.document['timerange'], _pc.document['scan'], _pc.document['spw'], _pc.document['antenna'], _pc.document['cablecal_correction'], _pc.document['ff_table'] )
                  ^^^^^^^^^^^^^^^^^^^^^^^^^^^^^^^^^^^^^^^^^^^^^^^^^^^^^^^^^^^^^^^^^^^^^^^^^^^^^^^^^^^^^^^^^^^^^^^^^^^^^^^^^^^^^^^^^^^^^^^^^^^^^^^^^^^^^^^^^^^^^^^^^^^^^^^^^^^^^^^^^^^^^^^^^^^^^^^^^^^^^^^^^^^^^^^^^^^^^^^^^^^^^^^^^^^^^^^^^^^^^^^^^^^^^^^^^^^^^^^^^^^^^
(17 more lines...)
Collapse Failed test_task_pccor pccor_test_missing.test_missingPhaseCalSubtable
Test Tasks Many Linux 2.28 Rocky 8.10 Py3.12 < 1 sec
failed on teardown with "FileNotFoundError: [Errno 2] No such file or directory: 'pccor_test.pccor'"
test_task_pccor.py:301: in tearDownClass
    shutil.rmtree(def_pccor_caltable)
/usr/local/lib/python3.12/shutil.py:759: in rmtree
    _rmtree_safe_fd(stack, onexc)
/usr/local/lib/python3.12/shutil.py:703: in _rmtree_safe_fd
    onexc(func, path, err)
/usr/local/lib/python3.12/shutil.py:669: in _rmtree_safe_fd
(3 more lines...)
Collapse Failed test_task_pccor pccor_test_parse.test_parseAntenna_antennas_specified
Test Tasks Many Linux 2.28 Rocky 8.10 Py3.12 < 1 sec
RuntimeError: Error in Calibrater::solve.
test_task_pccor.py:116: in test_parseAntenna_antennas_specified
    ret_dict = run_pccor(antenna=f','.join(ant_list))
               ^^^^^^^^^^^^^^^^^^^^^^^^^^^^^^^^^^^^^^
test_task_pccor.py:43: in run_pccor
    ret_dict = pccor(
../../../../venv/lib/python3.12/site-packages/casatasks/pccor.py:62: in __call__
    task_result = _pccor_t( _pc.document['vis'], _pc.document['pccor_caltable'], _pc.document['refant'], _pc.document['timerange'], _pc.document['scan'], _pc.document['spw'], _pc.document['antenna'], _pc.document['cablecal_correction'], _pc.document['ff_table'] )
(18 more lines...)
Collapse Failed test_task_pccor pccor_test_parse.test_parseAntenna
Test Tasks Many Linux 2.28 Rocky 8.10 Py3.12 3 secs
RuntimeError: Error in Calibrater::solve.
test_task_pccor.py:105: in test_parseAntenna
    ret_dict = run_pccor(antenna=f'!{bad_ant}')
               ^^^^^^^^^^^^^^^^^^^^^^^^^^^^^^^^
test_task_pccor.py:43: in run_pccor
    ret_dict = pccor(
../../../../venv/lib/python3.12/site-packages/casatasks/pccor.py:62: in __call__
    task_result = _pccor_t( _pc.document['vis'], _pc.document['pccor_caltable'], _pc.document['refant'], _pc.document['timerange'], _pc.document['scan'], _pc.document['spw'], _pc.document['antenna'], _pc.document['cablecal_correction'], _pc.document['ff_table'] )
(18 more lines...)
Collapse Failed test_task_pccor pccor_test_missing.test_missingPcDataUseFringefit
Test Tasks Many Linux 2.28 Rocky 8.10 Py3.12 < 1 sec
RuntimeError: Error in Calibrater::solve.
test_task_pccor.py:310: in test_missingPcDataUseFringefit
    ret_data = run_pccor()
               ^^^^^^^^^^^
test_task_pccor.py:43: in run_pccor
    ret_dict = pccor(
../../../../venv/lib/python3.12/site-packages/casatasks/pccor.py:62: in __call__
    task_result = _pccor_t( _pc.document['vis'], _pc.document['pccor_caltable'], _pc.document['refant'], _pc.document['timerange'], _pc.document['scan'], _pc.document['spw'], _pc.document['antenna'], _pc.document['cablecal_correction'], _pc.document['ff_table'] )
(18 more lines...)
Collapse Failed test_task_pccor pccor_test_parse.test_parseSpw
Test Tasks Many Linux 2.28 Rocky 8.10 Py3.12 < 1 sec
RuntimeError: Error in Calibrater::solve.
test_task_pccor.py:139: in test_parseSpw
    ret_dict = run_pccor(spw=f'!{bad_spw}')
               ^^^^^^^^^^^^^^^^^^^^^^^^^^^^
test_task_pccor.py:43: in run_pccor
    ret_dict = pccor(
../../../../venv/lib/python3.12/site-packages/casatasks/pccor.py:62: in __call__
    task_result = _pccor_t( _pc.document['vis'], _pc.document['pccor_caltable'], _pc.document['refant'], _pc.document['timerange'], _pc.document['scan'], _pc.document['spw'], _pc.document['antenna'], _pc.document['cablecal_correction'], _pc.document['ff_table'] )
(18 more lines...)
Collapse Failed test_task_phaseshift phaseshift_multi_phasecenter_test.test_phasecenter_dict_with_field_selection_overlapping
Test Tasks Many Linux 2.28 Rocky 8.10 Py3.12 < 1 sec
RuntimeError: Measures directory specified which does not contain the IERS data: /home/casatest/data/measures
test_task_phaseshift.py:1246: in test_phasecenter_dict_with_field_selection_overlapping
    result = phaseshift(datacopy, outputvis=self.outputvis, field='0,2',
../../../../venv/lib/python3.12/site-packages/casatasks/phaseshift.py:153: in __call__
    task_result = _phaseshift_t( _pc.document['vis'], _pc.document['outputvis'], _pc.document['keepmms'], _pc.document['field'], _pc.document['spw'], _pc.document['scan'], _pc.document['intent'], _pc.document['array'], _pc.document['observation'], _pc.document['datacolumn'], _pc.document['phasecenter'] )
                  ^^^^^^^^^^^^^^^^^^^^^^^^^^^^^^^^^^^^^^^^^^^^^^^^^^^^^^^^^^^^^^^^^^^^^^^^^^^^^^^^^^^^^^^^^^^^^^^^^^^^^^^^^^^^^^^^^^^^^^^^^^^^^^^^^^^^^^^^^^^^^^^^^^^^^^^^^^^^^^^^^^^^^^^^^^^^^^^^^^^^^^^^^^^^^^^^^^^^^^^^^^^^^^^^^^^^^^^^^^^^^^^^^^^^^^^^^^^^^^^^^^^^^^^^^^^^^^^^^^^^^^^^^^^^^^^^^^^^^^^^^^^^^^^
../../../../venv/lib/python3.12/site-packages/casatasks/private/task_phaseshift.py:99: in phaseshift
    mtlocal.open()
(7 more lines...)
Collapse Failed test_task_phaseshift phaseshift_test.test_fieldSelect
Test Tasks Many Linux 2.28 Rocky 8.10 Py3.12 < 1 sec
RuntimeError: Measures directory specified which does not contain the IERS data: /home/casatest/data/measures
test_task_phaseshift.py:223: in test_fieldSelect
    phaseshift(
../../../../venv/lib/python3.12/site-packages/casatasks/phaseshift.py:153: in __call__
    task_result = _phaseshift_t( _pc.document['vis'], _pc.document['outputvis'], _pc.document['keepmms'], _pc.document['field'], _pc.document['spw'], _pc.document['scan'], _pc.document['intent'], _pc.document['array'], _pc.document['observation'], _pc.document['datacolumn'], _pc.document['phasecenter'] )
                  ^^^^^^^^^^^^^^^^^^^^^^^^^^^^^^^^^^^^^^^^^^^^^^^^^^^^^^^^^^^^^^^^^^^^^^^^^^^^^^^^^^^^^^^^^^^^^^^^^^^^^^^^^^^^^^^^^^^^^^^^^^^^^^^^^^^^^^^^^^^^^^^^^^^^^^^^^^^^^^^^^^^^^^^^^^^^^^^^^^^^^^^^^^^^^^^^^^^^^^^^^^^^^^^^^^^^^^^^^^^^^^^^^^^^^^^^^^^^^^^^^^^^^^^^^^^^^^^^^^^^^^^^^^^^^^^^^^^^^^^^^^^^^^^
../../../../venv/lib/python3.12/site-packages/casatasks/private/task_phaseshift.py:99: in phaseshift
    mtlocal.open()
(7 more lines...)
Collapse Failed test_task_phaseshift reference_frame_tests.test_field
Test Tasks Many Linux 2.28 Rocky 8.10 Py3.12 < 1 sec
RuntimeError: Measures directory specified which does not contain the IERS data: /home/casatest/data/measures
test_task_phaseshift.py:1015: in test_field
    shift_and_clean(myfield, expdir)
test_task_phaseshift.py:887: in shift_and_clean
    phaseshift(
../../../../venv/lib/python3.12/site-packages/casatasks/phaseshift.py:153: in __call__
    task_result = _phaseshift_t( _pc.document['vis'], _pc.document['outputvis'], _pc.document['keepmms'], _pc.document['field'], _pc.document['spw'], _pc.document['scan'], _pc.document['intent'], _pc.document['array'], _pc.document['observation'], _pc.document['datacolumn'], _pc.document['phasecenter'] )
                  ^^^^^^^^^^^^^^^^^^^^^^^^^^^^^^^^^^^^^^^^^^^^^^^^^^^^^^^^^^^^^^^^^^^^^^^^^^^^^^^^^^^^^^^^^^^^^^^^^^^^^^^^^^^^^^^^^^^^^^^^^^^^^^^^^^^^^^^^^^^^^^^^^^^^^^^^^^^^^^^^^^^^^^^^^^^^^^^^^^^^^^^^^^^^^^^^^^^^^^^^^^^^^^^^^^^^^^^^^^^^^^^^^^^^^^^^^^^^^^^^^^^^^^^^^^^^^^^^^^^^^^^^^^^^^^^^^^^^^^^^^^^^^^^
(9 more lines...)
Collapse Failed test_task_phaseshift phaseshift_test.test_phasecenter
Test Tasks Many Linux 2.28 Rocky 8.10 Py3.12 < 1 sec
RuntimeError: Measures directory specified which does not contain the IERS data: /home/casatest/data/measures
test_task_phaseshift.py:348: in test_phasecenter
    phaseshift(datacopy_nep, outputvis=output, phasecenter=phasecenter)
../../../../venv/lib/python3.12/site-packages/casatasks/phaseshift.py:153: in __call__
    task_result = _phaseshift_t( _pc.document['vis'], _pc.document['outputvis'], _pc.document['keepmms'], _pc.document['field'], _pc.document['spw'], _pc.document['scan'], _pc.document['intent'], _pc.document['array'], _pc.document['observation'], _pc.document['datacolumn'], _pc.document['phasecenter'] )
                  ^^^^^^^^^^^^^^^^^^^^^^^^^^^^^^^^^^^^^^^^^^^^^^^^^^^^^^^^^^^^^^^^^^^^^^^^^^^^^^^^^^^^^^^^^^^^^^^^^^^^^^^^^^^^^^^^^^^^^^^^^^^^^^^^^^^^^^^^^^^^^^^^^^^^^^^^^^^^^^^^^^^^^^^^^^^^^^^^^^^^^^^^^^^^^^^^^^^^^^^^^^^^^^^^^^^^^^^^^^^^^^^^^^^^^^^^^^^^^^^^^^^^^^^^^^^^^^^^^^^^^^^^^^^^^^^^^^^^^^^^^^^^^^^
../../../../venv/lib/python3.12/site-packages/casatasks/private/task_phaseshift.py:99: in phaseshift
    mtlocal.open()
(7 more lines...)
Collapse Failed test_task_phaseshift phaseshift_multi_phasecenter_test.test_phasecenter_dict_with_field_selection_nonoverlapping
Test Tasks Many Linux 2.28 Rocky 8.10 Py3.12 < 1 sec
RuntimeError: Measures directory specified which does not contain the IERS data: /home/casatest/data/measures
test_task_phaseshift.py:1261: in test_phasecenter_dict_with_field_selection_nonoverlapping
    result = phaseshift(datacopy, outputvis=self.outputvis, field='0,2',
../../../../venv/lib/python3.12/site-packages/casatasks/phaseshift.py:153: in __call__
    task_result = _phaseshift_t( _pc.document['vis'], _pc.document['outputvis'], _pc.document['keepmms'], _pc.document['field'], _pc.document['spw'], _pc.document['scan'], _pc.document['intent'], _pc.document['array'], _pc.document['observation'], _pc.document['datacolumn'], _pc.document['phasecenter'] )
                  ^^^^^^^^^^^^^^^^^^^^^^^^^^^^^^^^^^^^^^^^^^^^^^^^^^^^^^^^^^^^^^^^^^^^^^^^^^^^^^^^^^^^^^^^^^^^^^^^^^^^^^^^^^^^^^^^^^^^^^^^^^^^^^^^^^^^^^^^^^^^^^^^^^^^^^^^^^^^^^^^^^^^^^^^^^^^^^^^^^^^^^^^^^^^^^^^^^^^^^^^^^^^^^^^^^^^^^^^^^^^^^^^^^^^^^^^^^^^^^^^^^^^^^^^^^^^^^^^^^^^^^^^^^^^^^^^^^^^^^^^^^^^^^^
../../../../venv/lib/python3.12/site-packages/casatasks/private/task_phaseshift.py:99: in phaseshift
    mtlocal.open()
(7 more lines...)
Collapse Failed test_task_phaseshift phaseshift_test.test_keepsMMS
Test Tasks Many Linux 2.28 Rocky 8.10 Py3.12 < 1 sec
RuntimeError: Measures directory specified which does not contain the IERS data: /home/casatest/data/measures
test_task_phaseshift.py:300: in test_keepsMMS
    phaseshift(
../../../../venv/lib/python3.12/site-packages/casatasks/phaseshift.py:153: in __call__
    task_result = _phaseshift_t( _pc.document['vis'], _pc.document['outputvis'], _pc.document['keepmms'], _pc.document['field'], _pc.document['spw'], _pc.document['scan'], _pc.document['intent'], _pc.document['array'], _pc.document['observation'], _pc.document['datacolumn'], _pc.document['phasecenter'] )
                  ^^^^^^^^^^^^^^^^^^^^^^^^^^^^^^^^^^^^^^^^^^^^^^^^^^^^^^^^^^^^^^^^^^^^^^^^^^^^^^^^^^^^^^^^^^^^^^^^^^^^^^^^^^^^^^^^^^^^^^^^^^^^^^^^^^^^^^^^^^^^^^^^^^^^^^^^^^^^^^^^^^^^^^^^^^^^^^^^^^^^^^^^^^^^^^^^^^^^^^^^^^^^^^^^^^^^^^^^^^^^^^^^^^^^^^^^^^^^^^^^^^^^^^^^^^^^^^^^^^^^^^^^^^^^^^^^^^^^^^^^^^^^^^^
../../../../venv/lib/python3.12/site-packages/casatasks/private/task_phaseshift.py:99: in phaseshift
    mtlocal.open()
(7 more lines...)
Collapse Failed test_task_phaseshift phaseshift_test.test_datacolumn
Test Tasks Many Linux 2.28 Rocky 8.10 Py3.12 < 1 sec
RuntimeError: Measures directory specified which does not contain the IERS data: /home/casatest/data/measures
test_task_phaseshift.py:327: in test_datacolumn
    phaseshift(
../../../../venv/lib/python3.12/site-packages/casatasks/phaseshift.py:153: in __call__
    task_result = _phaseshift_t( _pc.document['vis'], _pc.document['outputvis'], _pc.document['keepmms'], _pc.document['field'], _pc.document['spw'], _pc.document['scan'], _pc.document['intent'], _pc.document['array'], _pc.document['observation'], _pc.document['datacolumn'], _pc.document['phasecenter'] )
                  ^^^^^^^^^^^^^^^^^^^^^^^^^^^^^^^^^^^^^^^^^^^^^^^^^^^^^^^^^^^^^^^^^^^^^^^^^^^^^^^^^^^^^^^^^^^^^^^^^^^^^^^^^^^^^^^^^^^^^^^^^^^^^^^^^^^^^^^^^^^^^^^^^^^^^^^^^^^^^^^^^^^^^^^^^^^^^^^^^^^^^^^^^^^^^^^^^^^^^^^^^^^^^^^^^^^^^^^^^^^^^^^^^^^^^^^^^^^^^^^^^^^^^^^^^^^^^^^^^^^^^^^^^^^^^^^^^^^^^^^^^^^^^^^
../../../../venv/lib/python3.12/site-packages/casatasks/private/task_phaseshift.py:99: in phaseshift
    mtlocal.open()
(7 more lines...)
Collapse Failed test_task_phaseshift phaseshift_test.test_phasecenter_default_frame
Test Tasks Many Linux 2.28 Rocky 8.10 Py3.12 < 1 sec
RuntimeError: Measures directory specified which does not contain the IERS data: /home/casatest/data/measures
test_task_phaseshift.py:368: in test_phasecenter_default_frame
    phaseshift(datacopy_nep, outputvis=output, phasecenter=phasecenter)
../../../../venv/lib/python3.12/site-packages/casatasks/phaseshift.py:153: in __call__
    task_result = _phaseshift_t( _pc.document['vis'], _pc.document['outputvis'], _pc.document['keepmms'], _pc.document['field'], _pc.document['spw'], _pc.document['scan'], _pc.document['intent'], _pc.document['array'], _pc.document['observation'], _pc.document['datacolumn'], _pc.document['phasecenter'] )
                  ^^^^^^^^^^^^^^^^^^^^^^^^^^^^^^^^^^^^^^^^^^^^^^^^^^^^^^^^^^^^^^^^^^^^^^^^^^^^^^^^^^^^^^^^^^^^^^^^^^^^^^^^^^^^^^^^^^^^^^^^^^^^^^^^^^^^^^^^^^^^^^^^^^^^^^^^^^^^^^^^^^^^^^^^^^^^^^^^^^^^^^^^^^^^^^^^^^^^^^^^^^^^^^^^^^^^^^^^^^^^^^^^^^^^^^^^^^^^^^^^^^^^^^^^^^^^^^^^^^^^^^^^^^^^^^^^^^^^^^^^^^^^^^^
../../../../venv/lib/python3.12/site-packages/casatasks/private/task_phaseshift.py:99: in phaseshift
    mtlocal.open()
(7 more lines...)
Collapse Failed test_task_phaseshift phaseshift_test.test_shiftAndCompare
Test Tasks Many Linux 2.28 Rocky 8.10 Py3.12 < 1 sec
RuntimeError: Measures directory specified which does not contain the IERS data: /home/casatest/data/measures
test_task_phaseshift.py:396: in test_shiftAndCompare
    phaseshift(
../../../../venv/lib/python3.12/site-packages/casatasks/phaseshift.py:153: in __call__
    task_result = _phaseshift_t( _pc.document['vis'], _pc.document['outputvis'], _pc.document['keepmms'], _pc.document['field'], _pc.document['spw'], _pc.document['scan'], _pc.document['intent'], _pc.document['array'], _pc.document['observation'], _pc.document['datacolumn'], _pc.document['phasecenter'] )
                  ^^^^^^^^^^^^^^^^^^^^^^^^^^^^^^^^^^^^^^^^^^^^^^^^^^^^^^^^^^^^^^^^^^^^^^^^^^^^^^^^^^^^^^^^^^^^^^^^^^^^^^^^^^^^^^^^^^^^^^^^^^^^^^^^^^^^^^^^^^^^^^^^^^^^^^^^^^^^^^^^^^^^^^^^^^^^^^^^^^^^^^^^^^^^^^^^^^^^^^^^^^^^^^^^^^^^^^^^^^^^^^^^^^^^^^^^^^^^^^^^^^^^^^^^^^^^^^^^^^^^^^^^^^^^^^^^^^^^^^^^^^^^^^^
../../../../venv/lib/python3.12/site-packages/casatasks/private/task_phaseshift.py:99: in phaseshift
    mtlocal.open()
(7 more lines...)
Collapse Failed test_task_phaseshift phaseshift_multi_phasecenter_test.test_test_nodict
Test Tasks Many Linux 2.28 Rocky 8.10 Py3.12 < 1 sec
RuntimeError: Measures directory specified which does not contain the IERS data: /home/casatest/data/measures
test_task_phaseshift.py:1216: in test_test_nodict
    result = phaseshift(datacopy, outputvis=self.outputvis,
../../../../venv/lib/python3.12/site-packages/casatasks/phaseshift.py:153: in __call__
    task_result = _phaseshift_t( _pc.document['vis'], _pc.document['outputvis'], _pc.document['keepmms'], _pc.document['field'], _pc.document['spw'], _pc.document['scan'], _pc.document['intent'], _pc.document['array'], _pc.document['observation'], _pc.document['datacolumn'], _pc.document['phasecenter'] )
                  ^^^^^^^^^^^^^^^^^^^^^^^^^^^^^^^^^^^^^^^^^^^^^^^^^^^^^^^^^^^^^^^^^^^^^^^^^^^^^^^^^^^^^^^^^^^^^^^^^^^^^^^^^^^^^^^^^^^^^^^^^^^^^^^^^^^^^^^^^^^^^^^^^^^^^^^^^^^^^^^^^^^^^^^^^^^^^^^^^^^^^^^^^^^^^^^^^^^^^^^^^^^^^^^^^^^^^^^^^^^^^^^^^^^^^^^^^^^^^^^^^^^^^^^^^^^^^^^^^^^^^^^^^^^^^^^^^^^^^^^^^^^^^^^
../../../../venv/lib/python3.12/site-packages/casatasks/private/task_phaseshift.py:99: in phaseshift
    mtlocal.open()
(7 more lines...)
Collapse Failed test_task_phaseshift phaseshift_test.test_outvis
Test Tasks Many Linux 2.28 Rocky 8.10 Py3.12 < 1 sec
RuntimeError: Measures directory specified which does not contain the IERS data: /home/casatest/data/measures
test_task_phaseshift.py:212: in test_outvis
    phaseshift(
../../../../venv/lib/python3.12/site-packages/casatasks/phaseshift.py:153: in __call__
    task_result = _phaseshift_t( _pc.document['vis'], _pc.document['outputvis'], _pc.document['keepmms'], _pc.document['field'], _pc.document['spw'], _pc.document['scan'], _pc.document['intent'], _pc.document['array'], _pc.document['observation'], _pc.document['datacolumn'], _pc.document['phasecenter'] )
                  ^^^^^^^^^^^^^^^^^^^^^^^^^^^^^^^^^^^^^^^^^^^^^^^^^^^^^^^^^^^^^^^^^^^^^^^^^^^^^^^^^^^^^^^^^^^^^^^^^^^^^^^^^^^^^^^^^^^^^^^^^^^^^^^^^^^^^^^^^^^^^^^^^^^^^^^^^^^^^^^^^^^^^^^^^^^^^^^^^^^^^^^^^^^^^^^^^^^^^^^^^^^^^^^^^^^^^^^^^^^^^^^^^^^^^^^^^^^^^^^^^^^^^^^^^^^^^^^^^^^^^^^^^^^^^^^^^^^^^^^^^^^^^^^
../../../../venv/lib/python3.12/site-packages/casatasks/private/task_phaseshift.py:99: in phaseshift
    mtlocal.open()
(7 more lines...)
Collapse Failed test_task_phaseshift phaseshift_multi_phasecenter_test.test_phasecenter_dict_one_out
Test Tasks Many Linux 2.28 Rocky 8.10 Py3.12 < 1 sec
RuntimeError: Measures directory specified which does not contain the IERS data: /home/casatest/data/measures
test_task_phaseshift.py:1228: in test_phasecenter_dict_one_out
    result = phaseshift(datacopy, outputvis=self.outputvis,
../../../../venv/lib/python3.12/site-packages/casatasks/phaseshift.py:153: in __call__
    task_result = _phaseshift_t( _pc.document['vis'], _pc.document['outputvis'], _pc.document['keepmms'], _pc.document['field'], _pc.document['spw'], _pc.document['scan'], _pc.document['intent'], _pc.document['array'], _pc.document['observation'], _pc.document['datacolumn'], _pc.document['phasecenter'] )
                  ^^^^^^^^^^^^^^^^^^^^^^^^^^^^^^^^^^^^^^^^^^^^^^^^^^^^^^^^^^^^^^^^^^^^^^^^^^^^^^^^^^^^^^^^^^^^^^^^^^^^^^^^^^^^^^^^^^^^^^^^^^^^^^^^^^^^^^^^^^^^^^^^^^^^^^^^^^^^^^^^^^^^^^^^^^^^^^^^^^^^^^^^^^^^^^^^^^^^^^^^^^^^^^^^^^^^^^^^^^^^^^^^^^^^^^^^^^^^^^^^^^^^^^^^^^^^^^^^^^^^^^^^^^^^^^^^^^^^^^^^^^^^^^^
../../../../venv/lib/python3.12/site-packages/casatasks/private/task_phaseshift.py:99: in phaseshift
    mtlocal.open()
(7 more lines...)
Collapse Failed test_task_phaseshift phaseshift_test.test_takesVis
Test Tasks Many Linux 2.28 Rocky 8.10 Py3.12 < 1 sec
RuntimeError: Measures directory specified which does not contain the IERS data: /home/casatest/data/measures
test_task_phaseshift.py:200: in test_takesVis
    result = phaseshift(
../../../../venv/lib/python3.12/site-packages/casatasks/phaseshift.py:153: in __call__
    task_result = _phaseshift_t( _pc.document['vis'], _pc.document['outputvis'], _pc.document['keepmms'], _pc.document['field'], _pc.document['spw'], _pc.document['scan'], _pc.document['intent'], _pc.document['array'], _pc.document['observation'], _pc.document['datacolumn'], _pc.document['phasecenter'] )
                  ^^^^^^^^^^^^^^^^^^^^^^^^^^^^^^^^^^^^^^^^^^^^^^^^^^^^^^^^^^^^^^^^^^^^^^^^^^^^^^^^^^^^^^^^^^^^^^^^^^^^^^^^^^^^^^^^^^^^^^^^^^^^^^^^^^^^^^^^^^^^^^^^^^^^^^^^^^^^^^^^^^^^^^^^^^^^^^^^^^^^^^^^^^^^^^^^^^^^^^^^^^^^^^^^^^^^^^^^^^^^^^^^^^^^^^^^^^^^^^^^^^^^^^^^^^^^^^^^^^^^^^^^^^^^^^^^^^^^^^^^^^^^^^^
../../../../venv/lib/python3.12/site-packages/casatasks/private/task_phaseshift.py:99: in phaseshift
    mtlocal.open()
(7 more lines...)
Collapse Failed test_task_phaseshift phaseshift_multi_phasecenter_test.test_phasecenter_dict_outofrange
Test Tasks Many Linux 2.28 Rocky 8.10 Py3.12 < 1 sec
AssertionError: "field IDs" does not match "Measures directory specified which does not contain the IERS data: /home/casatest/data/measures"
RuntimeError: Measures directory specified which does not contain the IERS data: /home/casatest/data/measures

During handling of the above exception, another exception occurred:
test_task_phaseshift.py:1193: in test_phasecenter_dict_outofrange
    with self.assertRaisesRegex(RuntimeError, "field IDs"):
         ^^^^^^^^^^^^^^^^^^^^^^^^^^^^^^^^^^^^^^^^^^^^^^^^^
E   AssertionError: "field IDs" does not match "Measures directory specified which does not contain the IERS data: /home/casatest/data/measures"
Collapse Failed test_task_phaseshift reference_frame_tests.test_frames
Test Tasks Many Linux 2.28 Rocky 8.10 Py3.12 < 1 sec
RuntimeError: Error in selectData() : ColumnSet::doLock: table /home/casatest/casa6/casatestutils/nosedir/test_task_phaseshift/sim_data.ms should be locked when using UserLocking
test_task_phaseshift.py:857: in test_frames
    tclean(
../../../../venv/lib/python3.12/site-packages/casatasks/tclean.py:1875: in __call__
    task_result = _tclean_t( _pc.document['vis'], _pc.document['selectdata'], _pc.document['field'], _pc.document['spw'], _pc.document['timerange'], _pc.document['uvrange'], _pc.document['antenna'], _pc.document['scan'], _pc.document['observation'], _pc.document['intent'], _pc.document['datacolumn'], _pc.document['imagename'], _pc.document['imsize'], _pc.document['cell'], _pc.document['phasecenter'], _pc.document['stokes'], _pc.document['projection'], _pc.document['startmodel'], _pc.document['specmode'], _pc.document['reffreq'], _pc.document['nchan'], _pc.document['start'], _pc.document['width'], _pc.document['outframe'], _pc.document['veltype'], _pc.document['restfreq'], _pc.document['interpolation'], _pc.document['perchanweightdensity'], _pc.document['gridder'], _pc.document['facets'], _pc.document['psfphasecenter'], _pc.document['wprojplanes'], _pc.document['vptable'], _pc.document['mosweight'], _pc.document['aterm'], _pc.document['psterm'], _pc.document['wbawp'], _pc.document['conjbeams'], _pc.document['cfcache'], _pc.document['usepointing'], _pc.document['computepastep'], _pc.document['rotatepastep'], _pc.document['pointingoffsetsigdev'], _pc.document['pblimit'], _pc.document['normtype'], _pc.document['deconvolver'], _pc.document['scales'], _pc.document['nterms'], _pc.document['smallscalebias'], _pc.document['fusedthreshold'], _pc.document['largestscale'], _pc.document['restoration'], _pc.document['restoringbeam'], _pc.document['pbcor'], _pc.document['outlierfile'], _pc.document['weighting'], _pc.document['robust'], _pc.document['noise'], _pc.document['npixels'], _pc.document['fracbw'], _pc.document['uvtaper'], _pc.document['niter'], _pc.document['gain'], _pc.document['threshold'], _pc.document['nsigma'], _pc.document['cycleniter'], _pc.document['cyclefactor'], _pc.document['minpsffraction'], _pc.document['maxpsffraction'], _pc.document['interactive'], _pc.document['nmajor'], _pc.document['fullsummary'], _pc.document['usemask'], _pc.document['mask'], _pc.document['pbmask'], _pc.document['sidelobethreshold'], _pc.document['noisethreshold'], _pc.document['lownoisethreshold'], _pc.document['negativethreshold'], _pc.document['smoothfactor'], _pc.document['minbeamfrac'], _pc.document['cutthreshold'], _pc.document['growiterations'], _pc.document['dogrowprune'], _pc.document['minpercentchange'], _pc.document['verbose'], _pc.document['fastnoise'], _pc.document['restart'], _pc.document['savemodel'], _pc.document['calcres'], _pc.document['calcpsf'], _pc.document['psfcutoff'], _pc.document['parallel'] )
                  ^^^^^^^^^^^^^^^^^^^^^^^^^^^^^^^^^^^^^^^^^^^^^^^^^^^^^^^^^^^^^^^^^^^^^^^^^^^^^^^^^^^^^^^^^^^^^^^^^^^^^^^^^^^^^^^^^^^^^^^^^^^^^^^^^^^^^^^^^^^^^^^^^^^^^^^^^^^^^^^^^^^^^^^^^^^^^^^^^^^^^^^^^^^^^^^^^^^^^^^^^^^^^^^^^^^^^^^^^^^^^^^^^^^^^^^^^^^^^^^^^^^^^^^^^^^^^^^^^^^^^^^^^^^^^^^^^^^^^^^^^^^^^^^^^^^^^^^^^^^^^^^^^^^^^^^^^^^^^^^^^^^^^^^^^^^^^^^^^^^^^^^^^^^^^^^^^^^^^^^^^^^^^^^^^^^^^^^^^^^^^^^^^^^^^^^^^^^^^^^^^^^^^^^^^^^^^^^^^^^^^^^^^^^^^^^^^^^^^^^^^^^^^^^^^^^^^^^^^^^^^^^^^^^^^^^^^^^^^^^^^^^^^^^^^^^^^^^^^^^^^^^^^^^^^^^^^^^^^^^^^^^^^^^^^^^^^^^^^^^^^^^^^^^^^^^^^^^^^^^^^^^^^^^^^^^^^^^^^^^^^^^^^^^^^^^^^^^^^^^^^^^^^^^^^^^^^^^^^^^^^^^^^^^^^^^^^^^^^^^^^^^^^^^^^^^^^^^^^^^^^^^^^^^^^^^^^^^^^^^^^^^^^^^^^^^^^^^^^^^^^^^^^^^^^^^^^^^^^^^^^^^^^^^^^^^^^^^^^^^^^^^^^^^^^^^^^^^^^^^^^^^^^^^^^^^^^^^^^^^^^^^^^^^^^^^^^^^^^^^^^^^^^^^^^^^^^^^^^^^^^^^^^^^^^^^^^^^^^^^^^^^^^^^^^^^^^^^^^^^^^^^^^^^^^^^^^^^^^^^^^^^^^^^^^^^^^^^^^^^^^^^^^^^^^^^^^^^^^^^^^^^^^^^^^^^^^^^^^^^^^^^^^^^^^^^^^^^^^^^^^^^^^^^^^^^^^^^^^^^^^^^^^^^^^^^^^^^^^^^^^^^^^^^^^^^^^^^^^^^^^^^^^^^^^^^^^^^^^^^^^^^^^^^^^^^^^^^^^^^^^^^^^^^^^^^^^^^^^^^^^^^^^^^^^^^^^^^^^^^^^^^^^^^^^^^^^^^^^^^^^^^^^^^^^^^^^^^^^^^^^^^^^^^^^^^^^^^^^^^^^^^^^^^^^^^^^^^^^^^^^^^^^^^^^^^^^^^^^^^^^^^^^^^^^^^^^^^^^^^^^^^^^^^^^^^^^^^^^^^^^^^^^^^^^^^^^^^^^^^^^^^^^^^^^^^^^^^^^^^^^^^^^^^^^^^^^^^^^^^^^^^^^^^^^^^^^^^^^^^^^^^^^^^^^^^^^^^^^^^^^^^^^^^^^^^^^^^^^^^^^^^^^^^^^^^^^^^^^^^^^^^^^^^^^^^^^^^^^^^^^^^^^^^^^^^^^^^^^^^^^^^^^^^^^^^^^^^^^^^^^^^^^^^^^^^^^^^^^^^^^^^^^^^^^^^^^^^^^^^^^^^^^^^^^^^^^^^^^^^^^^^^^^^^^^^^^^^^^^^^^^^^^^^^^^^^^^^^^^^^^^^^^^^^^^^^^^^^^^^^^^^^^^^^^^^^^^^^^^^^^^^^^^^^^^^^^^^^^^^^^^^^^^^^^^^^^^^^^^^^^^^^^^^^^^^^^^^^^^^^^^^^^^^^^^^^^^^^^^^^^^^^^^^^^^^^^^^^^^^^^^^^^^^^^^^^^^^^^^^^^^^^^^^^^^^^^^^^^^^^^^^^^^^^^^^^^^^^^^^^^^^^^^^^^^^^^^^^^^^^^^^^^^^^^^^^^^^^^^^^^^^^^^^^^^^^^^^^^^^^^^^^^^^^^^^^^^^^^^^^^^^^^^^^^^^^^^^^^^^^^^^^^^^^^^^^^^^^^^^^^^^^^^^^^^^^^^^^^^^^^^^^^^^^^^^^^^^^^^^^^^^^^^^^^^^^^^^^^^^^^^^^^^^^^^^^^^^^^^^^^^^^^^^^^^^^^^^^^^^^^^^^^^^^^^^^^^^^^^^^^^^^^^^^^^^^^^^^^^^^^^^^^^^^^^^^^^^^^^^^^^^^^^^^^^^^^^^^^^^^^^^^^^^^^^^^^^^^^^^^^^^^^^^^^^^^^^^^^^^^^^^^^^^^^^^^^^^^^^^^^^^^^^^^^^^^^^^^^^^^^^^^^^^^^^^^^^^^^^^^^^^^^^^^^^^^^^^^^^^^^^^^^^^^^^^^^^^^^^^^^^^^^^^^^^^^^^^^^^^^^^^^^^^^^^^^^^^^^^^^^^^^^^^^^^^^^^^^^^^^^^^^^^^^^^^^^^^^^^^^^^^^^^^^^^^^^^^^^^^^^^^^^^^^^^^^^^^^^^^^^^^^^^^^^^^^^^^^^^^^^^^^^^^^^^^^^^^^^^^^^^^^^^^^^^^^^^^^^^^^^^^^^^^^^^^^^^^^^^^^^^^^^^^^^^^^^^^^^^^^^^^^^^^^^^^^^^^^^^^^^^^^^^^^^^^^^^^^^^^^^^^^^^^^^^^^^^^^^^^^^^^^^^^^^^^^^^^^^^^^^^^^^^^^^^^^^^^^^^^^^^^^^^^^^^^^^^^^^^^^^^^^
../../../../venv/lib/python3.12/site-packages/casatasks/private/task_tclean.py:488: in tclean
    imager.initializeImagers()
(9 more lines...)
Collapse Failed test_task_phaseshift phaseshift_multi_phasecenter_test.test_fix_transition_from_shifted_field_to_field_with_no_shift
Test Tasks Many Linux 2.28 Rocky 8.10 Py3.12 < 1 sec
RuntimeError: Measures directory specified which does not contain the IERS data: /home/casatest/data/measures
test_task_phaseshift.py:1273: in test_fix_transition_from_shifted_field_to_field_with_no_shift
    phaseshift(
../../../../venv/lib/python3.12/site-packages/casatasks/phaseshift.py:153: in __call__
    task_result = _phaseshift_t( _pc.document['vis'], _pc.document['outputvis'], _pc.document['keepmms'], _pc.document['field'], _pc.document['spw'], _pc.document['scan'], _pc.document['intent'], _pc.document['array'], _pc.document['observation'], _pc.document['datacolumn'], _pc.document['phasecenter'] )
                  ^^^^^^^^^^^^^^^^^^^^^^^^^^^^^^^^^^^^^^^^^^^^^^^^^^^^^^^^^^^^^^^^^^^^^^^^^^^^^^^^^^^^^^^^^^^^^^^^^^^^^^^^^^^^^^^^^^^^^^^^^^^^^^^^^^^^^^^^^^^^^^^^^^^^^^^^^^^^^^^^^^^^^^^^^^^^^^^^^^^^^^^^^^^^^^^^^^^^^^^^^^^^^^^^^^^^^^^^^^^^^^^^^^^^^^^^^^^^^^^^^^^^^^^^^^^^^^^^^^^^^^^^^^^^^^^^^^^^^^^^^^^^^^^
../../../../venv/lib/python3.12/site-packages/casatasks/private/task_phaseshift.py:99: in phaseshift
    mtlocal.open()
(7 more lines...)
Collapse Failed test_task_phaseshift phaseshift_multi_phasecenter_test.test_phasecenter_dict_simple
Test Tasks Many Linux 2.28 Rocky 8.10 Py3.12 < 1 sec
RuntimeError: Measures directory specified which does not contain the IERS data: /home/casatest/data/measures
test_task_phaseshift.py:1202: in test_phasecenter_dict_simple
    result = phaseshift(datacopy, outputvis=self.outputvis,
../../../../venv/lib/python3.12/site-packages/casatasks/phaseshift.py:153: in __call__
    task_result = _phaseshift_t( _pc.document['vis'], _pc.document['outputvis'], _pc.document['keepmms'], _pc.document['field'], _pc.document['spw'], _pc.document['scan'], _pc.document['intent'], _pc.document['array'], _pc.document['observation'], _pc.document['datacolumn'], _pc.document['phasecenter'] )
                  ^^^^^^^^^^^^^^^^^^^^^^^^^^^^^^^^^^^^^^^^^^^^^^^^^^^^^^^^^^^^^^^^^^^^^^^^^^^^^^^^^^^^^^^^^^^^^^^^^^^^^^^^^^^^^^^^^^^^^^^^^^^^^^^^^^^^^^^^^^^^^^^^^^^^^^^^^^^^^^^^^^^^^^^^^^^^^^^^^^^^^^^^^^^^^^^^^^^^^^^^^^^^^^^^^^^^^^^^^^^^^^^^^^^^^^^^^^^^^^^^^^^^^^^^^^^^^^^^^^^^^^^^^^^^^^^^^^^^^^^^^^^^^^^
../../../../venv/lib/python3.12/site-packages/casatasks/private/task_phaseshift.py:99: in phaseshift
    mtlocal.open()
(7 more lines...)
Collapse Failed test_task_phaseshift phaseshift_test.test_arraySelect
Test Tasks Many Linux 2.28 Rocky 8.10 Py3.12 < 1 sec
RuntimeError: Measures directory specified which does not contain the IERS data: /home/casatest/data/measures
test_task_phaseshift.py:268: in test_arraySelect
    phaseshift(
../../../../venv/lib/python3.12/site-packages/casatasks/phaseshift.py:153: in __call__
    task_result = _phaseshift_t( _pc.document['vis'], _pc.document['outputvis'], _pc.document['keepmms'], _pc.document['field'], _pc.document['spw'], _pc.document['scan'], _pc.document['intent'], _pc.document['array'], _pc.document['observation'], _pc.document['datacolumn'], _pc.document['phasecenter'] )
                  ^^^^^^^^^^^^^^^^^^^^^^^^^^^^^^^^^^^^^^^^^^^^^^^^^^^^^^^^^^^^^^^^^^^^^^^^^^^^^^^^^^^^^^^^^^^^^^^^^^^^^^^^^^^^^^^^^^^^^^^^^^^^^^^^^^^^^^^^^^^^^^^^^^^^^^^^^^^^^^^^^^^^^^^^^^^^^^^^^^^^^^^^^^^^^^^^^^^^^^^^^^^^^^^^^^^^^^^^^^^^^^^^^^^^^^^^^^^^^^^^^^^^^^^^^^^^^^^^^^^^^^^^^^^^^^^^^^^^^^^^^^^^^^^
../../../../venv/lib/python3.12/site-packages/casatasks/private/task_phaseshift.py:99: in phaseshift
    mtlocal.open()
(7 more lines...)
Collapse Failed test_task_phaseshift phaseshift_test.test_spwSelect
Test Tasks Many Linux 2.28 Rocky 8.10 Py3.12 < 1 sec
RuntimeError: Measures directory specified which does not contain the IERS data: /home/casatest/data/measures
test_task_phaseshift.py:235: in test_spwSelect
    phaseshift(
../../../../venv/lib/python3.12/site-packages/casatasks/phaseshift.py:153: in __call__
    task_result = _phaseshift_t( _pc.document['vis'], _pc.document['outputvis'], _pc.document['keepmms'], _pc.document['field'], _pc.document['spw'], _pc.document['scan'], _pc.document['intent'], _pc.document['array'], _pc.document['observation'], _pc.document['datacolumn'], _pc.document['phasecenter'] )
                  ^^^^^^^^^^^^^^^^^^^^^^^^^^^^^^^^^^^^^^^^^^^^^^^^^^^^^^^^^^^^^^^^^^^^^^^^^^^^^^^^^^^^^^^^^^^^^^^^^^^^^^^^^^^^^^^^^^^^^^^^^^^^^^^^^^^^^^^^^^^^^^^^^^^^^^^^^^^^^^^^^^^^^^^^^^^^^^^^^^^^^^^^^^^^^^^^^^^^^^^^^^^^^^^^^^^^^^^^^^^^^^^^^^^^^^^^^^^^^^^^^^^^^^^^^^^^^^^^^^^^^^^^^^^^^^^^^^^^^^^^^^^^^^^
../../../../venv/lib/python3.12/site-packages/casatasks/private/task_phaseshift.py:99: in phaseshift
    mtlocal.open()
(7 more lines...)
Collapse Failed test_task_phaseshift phaseshift_test.test_intentSelect
Test Tasks Many Linux 2.28 Rocky 8.10 Py3.12 < 1 sec
RuntimeError: Measures directory specified which does not contain the IERS data: /home/casatest/data/measures
test_task_phaseshift.py:249: in test_intentSelect
    phaseshift(
../../../../venv/lib/python3.12/site-packages/casatasks/phaseshift.py:153: in __call__
    task_result = _phaseshift_t( _pc.document['vis'], _pc.document['outputvis'], _pc.document['keepmms'], _pc.document['field'], _pc.document['spw'], _pc.document['scan'], _pc.document['intent'], _pc.document['array'], _pc.document['observation'], _pc.document['datacolumn'], _pc.document['phasecenter'] )
                  ^^^^^^^^^^^^^^^^^^^^^^^^^^^^^^^^^^^^^^^^^^^^^^^^^^^^^^^^^^^^^^^^^^^^^^^^^^^^^^^^^^^^^^^^^^^^^^^^^^^^^^^^^^^^^^^^^^^^^^^^^^^^^^^^^^^^^^^^^^^^^^^^^^^^^^^^^^^^^^^^^^^^^^^^^^^^^^^^^^^^^^^^^^^^^^^^^^^^^^^^^^^^^^^^^^^^^^^^^^^^^^^^^^^^^^^^^^^^^^^^^^^^^^^^^^^^^^^^^^^^^^^^^^^^^^^^^^^^^^^^^^^^^^^
../../../../venv/lib/python3.12/site-packages/casatasks/private/task_phaseshift.py:99: in phaseshift
    mtlocal.open()
(7 more lines...)
Collapse Failed test_task_phaseshift phaseshift_test.test_observationSelect
Test Tasks Many Linux 2.28 Rocky 8.10 Py3.12 < 1 sec
RuntimeError: Measures directory specified which does not contain the IERS data: /home/casatest/data/measures
test_task_phaseshift.py:286: in test_observationSelect
    phaseshift(
../../../../venv/lib/python3.12/site-packages/casatasks/phaseshift.py:153: in __call__
    task_result = _phaseshift_t( _pc.document['vis'], _pc.document['outputvis'], _pc.document['keepmms'], _pc.document['field'], _pc.document['spw'], _pc.document['scan'], _pc.document['intent'], _pc.document['array'], _pc.document['observation'], _pc.document['datacolumn'], _pc.document['phasecenter'] )
                  ^^^^^^^^^^^^^^^^^^^^^^^^^^^^^^^^^^^^^^^^^^^^^^^^^^^^^^^^^^^^^^^^^^^^^^^^^^^^^^^^^^^^^^^^^^^^^^^^^^^^^^^^^^^^^^^^^^^^^^^^^^^^^^^^^^^^^^^^^^^^^^^^^^^^^^^^^^^^^^^^^^^^^^^^^^^^^^^^^^^^^^^^^^^^^^^^^^^^^^^^^^^^^^^^^^^^^^^^^^^^^^^^^^^^^^^^^^^^^^^^^^^^^^^^^^^^^^^^^^^^^^^^^^^^^^^^^^^^^^^^^^^^^^^
../../../../venv/lib/python3.12/site-packages/casatasks/private/task_phaseshift.py:99: in phaseshift
    mtlocal.open()
(7 more lines...)
Collapse Failed test_task_sdgaincal sdgaincal_single_polarization_test.test_single_pol
Test Tasks Many Linux 2.28 Rocky 8.10 Py3.12 < 1 sec
RuntimeError: Measures directory specified which does not contain the IERS data: /home/casatest/data/measures
test_task_sdgaincal.py:575: in test_single_pol
    mstransform_cli(vis=self.infile, outputvis=self.infile_YY, correlation='YY',
../../../../venv/lib/python3.12/site-packages/casatasks/mstransform.py:620: in __call__
    task_result = _mstransform_t( _pc.document['vis'], _pc.document['outputvis'], _pc.document['createmms'], _pc.document['separationaxis'], _pc.document['numsubms'], _pc.document['tileshape'], _pc.document['field'], _pc.document['spw'], _pc.document['scan'], _pc.document['antenna'], _pc.document['correlation'], _pc.document['timerange'], _pc.document['intent'], _pc.document['array'], _pc.document['uvrange'], _pc.document['observation'], _pc.document['feed'], _pc.document['datacolumn'], _pc.document['realmodelcol'], _pc.document['keepflags'], _pc.document['usewtspectrum'], _pc.document['combinespws'], _pc.document['chanaverage'], _pc.document['chanbin'], _pc.document['hanning'], _pc.document['regridms'], _pc.document['mode'], _pc.document['nchan'], _pc.document['start'], _pc.document['width'], _pc.document['nspw'], _pc.document['interpolation'], _pc.document['phasecenter'], _pc.document['restfreq'], _pc.document['outframe'], _pc.document['veltype'], _pc.document['preaverage'], _pc.document['timeaverage'], _pc.document['timebin'], _pc.document['timespan'], _pc.document['maxuvwdistance'], _pc.document['docallib'], _pc.document['callib'], _pc.document['douvcontsub'], _pc.document['fitspw'], _pc.document['fitorder'], _pc.document['want_cont'], _pc.document['denoising_lib'], _pc.document['nthreads'], _pc.document['niter'], _pc.document['disableparallel'], _pc.document['ddistart'], _pc.document['taql'], _pc.document['monolithic_processing'], _pc.document['reindex'] )
                  ^^^^^^^^^^^^^^^^^^^^^^^^^^^^^^^^^^^^^^^^^^^^^^^^^^^^^^^^^^^^^^^^^^^^^^^^^^^^^^^^^^^^^^^^^^^^^^^^^^^^^^^^^^^^^^^^^^^^^^^^^^^^^^^^^^^^^^^^^^^^^^^^^^^^^^^^^^^^^^^^^^^^^^^^^^^^^^^^^^^^^^^^^^^^^^^^^^^^^^^^^^^^^^^^^^^^^^^^^^^^^^^^^^^^^^^^^^^^^^^^^^^^^^^^^^^^^^^^^^^^^^^^^^^^^^^^^^^^^^^^^^^^^^^^^^^^^^^^^^^^^^^^^^^^^^^^^^^^^^^^^^^^^^^^^^^^^^^^^^^^^^^^^^^^^^^^^^^^^^^^^^^^^^^^^^^^^^^^^^^^^^^^^^^^^^^^^^^^^^^^^^^^^^^^^^^^^^^^^^^^^^^^^^^^^^^^^^^^^^^^^^^^^^^^^^^^^^^^^^^^^^^^^^^^^^^^^^^^^^^^^^^^^^^^^^^^^^^^^^^^^^^^^^^^^^^^^^^^^^^^^^^^^^^^^^^^^^^^^^^^^^^^^^^^^^^^^^^^^^^^^^^^^^^^^^^^^^^^^^^^^^^^^^^^^^^^^^^^^^^^^^^^^^^^^^^^^^^^^^^^^^^^^^^^^^^^^^^^^^^^^^^^^^^^^^^^^^^^^^^^^^^^^^^^^^^^^^^^^^^^^^^^^^^^^^^^^^^^^^^^^^^^^^^^^^^^^^^^^^^^^^^^^^^^^^^^^^^^^^^^^^^^^^^^^^^^^^^^^^^^^^^^^^^^^^^^^^^^^^^^^^^^^^^^^^^^^^^^^^^^^^^^^^^^^^^^^^^^^^^^^^^^^^^^^^^^^^^^^^^^^^^^^^^^^^^^^^^^^^^^^^^^^^^^^^^^^^^^^^^^^^^^^^^^^^^^^^^^^^^^^^^^^^^^^^^^^^^^^^^^^^^^^^^^^^^^^^^^^^^^^^^^^^^^^^^^^^^^^^^^^^^^^^^^^^^^^^^^^^^^^^^^^^^^^^^^^^^^^^^^^^^^^^^^^^^^^^^^^^^^^^^^^^^^^^^^^^^^^^^^^^^^^^^^^^^^^^^^^^^^^^^^^^^^^^^^^^^^^^^^^^^^^^^^^^^^^^^^^^^^^^^^^^^^^^^^^^^^^^^^^^^^^^^^^^^^^^^^^^^^^^^^^^^^^^^^^^^^^^^^^^^^^^^^^^^^^^^^^^^^^^^^^^^^^^^^^^^^^^^^^^^^^^^^^^^^^^^^^^^^^^^^^^^^^^^^^^^^^^^^^^^^^^^^^^^^^^^^^^^^^^^^^^^^^^^^^^^^^^^^^^^^^^^^^^^^^^^^^^^^^^^^^^^^^^^^^^^^^^^^^^^^^^^^^^^^^^^^^^^^^^^^^^^^^^^^^^^^^^^^^^^^^^^^^^^^^^^^^^^^^^^^^^^^^^^^^^^^^^^^^^^^^^^^^^^^^^^^^^^^^^^^^^^^^^^^^^^^^^^^^^^^^^^^^^^^^^^^^^^^^^^^^^^
../../../../venv/lib/python3.12/site-packages/casatasks/private/task_mstransform.py:293: in mstransform
    mtlocal.open()
(7 more lines...)
Collapse Failed test_task_sdgaincal sdgaincal_preapply_test.test_preapply02
Test Tasks Many Linux 2.28 Rocky 8.10 Py3.12 < 1 sec
RuntimeError: Error in Calibrater::initialize()
test_task_sdgaincal.py:363: in setUp
    self.generate()
test_task_sdgaincal.py:429: in generate
    sdcal_cli(infile=self.infile, outfile=self.tsystable,
../../../../venv/lib/python3.12/site-packages/casatasks/sdcal.py:352: in __call__
    task_result = _sdcal_t( _pc.document['infile'], _pc.document['calmode'], _pc.document['fraction'], _pc.document['noff'], _pc.document['width'], _pc.document['elongated'], _pc.document['applytable'], _pc.document['interp'], _pc.document['spwmap'], _pc.document['outfile'], _pc.document['overwrite'], _pc.document['field'], _pc.document['spw'], _pc.document['scan'], **kwargs )
                  ^^^^^^^^^^^^^^^^^^^^^^^^^^^^^^^^^^^^^^^^^^^^^^^^^^^^^^^^^^^^^^^^^^^^^^^^^^^^^^^^^^^^^^^^^^^^^^^^^^^^^^^^^^^^^^^^^^^^^^^^^^^^^^^^^^^^^^^^^^^^^^^^^^^^^^^^^^^^^^^^^^^^^^^^^^^^^^^^^^^^^^^^^^^^^^^^^^^^^^^^^^^^^^^^^^^^^^^^^^^^^^^^^^^^^^^^^^^^^^^^^^^^^^^^^^^^^^^^^^^^^^^^^^^^^^^^^^^^^^^^^^^^^^^^^^^^^^^^^^^^^^^^^^^^^^^^^^^^^^^^^^^^^^^^^^^^^^^^^^^^^^^^^^^^^^^^^^^^^^^^^
(15 more lines...)
Collapse Failed test_task_sdgaincal sdgaincal_preapply_test.test_preapply04
Test Tasks Many Linux 2.28 Rocky 8.10 Py3.12 < 1 sec
RuntimeError: Error in Calibrater::initialize()
test_task_sdgaincal.py:363: in setUp
    self.generate()
test_task_sdgaincal.py:429: in generate
    sdcal_cli(infile=self.infile, outfile=self.tsystable,
../../../../venv/lib/python3.12/site-packages/casatasks/sdcal.py:352: in __call__
    task_result = _sdcal_t( _pc.document['infile'], _pc.document['calmode'], _pc.document['fraction'], _pc.document['noff'], _pc.document['width'], _pc.document['elongated'], _pc.document['applytable'], _pc.document['interp'], _pc.document['spwmap'], _pc.document['outfile'], _pc.document['overwrite'], _pc.document['field'], _pc.document['spw'], _pc.document['scan'], **kwargs )
                  ^^^^^^^^^^^^^^^^^^^^^^^^^^^^^^^^^^^^^^^^^^^^^^^^^^^^^^^^^^^^^^^^^^^^^^^^^^^^^^^^^^^^^^^^^^^^^^^^^^^^^^^^^^^^^^^^^^^^^^^^^^^^^^^^^^^^^^^^^^^^^^^^^^^^^^^^^^^^^^^^^^^^^^^^^^^^^^^^^^^^^^^^^^^^^^^^^^^^^^^^^^^^^^^^^^^^^^^^^^^^^^^^^^^^^^^^^^^^^^^^^^^^^^^^^^^^^^^^^^^^^^^^^^^^^^^^^^^^^^^^^^^^^^^^^^^^^^^^^^^^^^^^^^^^^^^^^^^^^^^^^^^^^^^^^^^^^^^^^^^^^^^^^^^^^^^^^^^^^^^^^
(15 more lines...)
Collapse Failed test_task_sdgaincal sdgaincal_const_test.test_const03
Test Tasks Many Linux 2.28 Rocky 8.10 Py3.12 < 1 sec
RuntimeError: Error in Calibrater::solve.
test_task_sdgaincal.py:290: in test_const03
    self.run_task(**params)
test_task_sdgaincal.py:93: in run_task
    result = sdgaincal(**params)
             ^^^^^^^^^^^^^^^^^^^
../../../../venv/lib/python3.12/site-packages/casatasks/sdgaincal.py:203: in __call__
    task_result = _sdgaincal_t( _pc.document['infile'], _pc.document['calmode'], _pc.document['radius'], _pc.document['smooth'], _pc.document['antenna'], _pc.document['field'], _pc.document['spw'], _pc.document['scan'], _pc.document['intent'], _pc.document['applytable'], _pc.document['interp'], _pc.document['spwmap'], _pc.document['outfile'], _pc.document['overwrite'] )
(13 more lines...)
Collapse Failed test_task_sdgaincal sdgaincal_preapply_test.test_preapply01
Test Tasks Many Linux 2.28 Rocky 8.10 Py3.12 < 1 sec
RuntimeError: Error in Calibrater::initialize()
test_task_sdgaincal.py:363: in setUp
    self.generate()
test_task_sdgaincal.py:429: in generate
    sdcal_cli(infile=self.infile, outfile=self.tsystable,
../../../../venv/lib/python3.12/site-packages/casatasks/sdcal.py:352: in __call__
    task_result = _sdcal_t( _pc.document['infile'], _pc.document['calmode'], _pc.document['fraction'], _pc.document['noff'], _pc.document['width'], _pc.document['elongated'], _pc.document['applytable'], _pc.document['interp'], _pc.document['spwmap'], _pc.document['outfile'], _pc.document['overwrite'], _pc.document['field'], _pc.document['spw'], _pc.document['scan'], **kwargs )
                  ^^^^^^^^^^^^^^^^^^^^^^^^^^^^^^^^^^^^^^^^^^^^^^^^^^^^^^^^^^^^^^^^^^^^^^^^^^^^^^^^^^^^^^^^^^^^^^^^^^^^^^^^^^^^^^^^^^^^^^^^^^^^^^^^^^^^^^^^^^^^^^^^^^^^^^^^^^^^^^^^^^^^^^^^^^^^^^^^^^^^^^^^^^^^^^^^^^^^^^^^^^^^^^^^^^^^^^^^^^^^^^^^^^^^^^^^^^^^^^^^^^^^^^^^^^^^^^^^^^^^^^^^^^^^^^^^^^^^^^^^^^^^^^^^^^^^^^^^^^^^^^^^^^^^^^^^^^^^^^^^^^^^^^^^^^^^^^^^^^^^^^^^^^^^^^^^^^^^^^^^^
(15 more lines...)
Collapse Failed test_task_sdgaincal sdgaincal_variable_test.test_variable01
Test Tasks Many Linux 2.28 Rocky 8.10 Py3.12 < 1 sec
RuntimeError: Error in Calibrater::initialize()
test_task_sdgaincal.py:333: in test_variable01
    self.run_task(**params)
test_task_sdgaincal.py:93: in run_task
    result = sdgaincal(**params)
             ^^^^^^^^^^^^^^^^^^^
../../../../venv/lib/python3.12/site-packages/casatasks/sdgaincal.py:203: in __call__
    task_result = _sdgaincal_t( _pc.document['infile'], _pc.document['calmode'], _pc.document['radius'], _pc.document['smooth'], _pc.document['antenna'], _pc.document['field'], _pc.document['spw'], _pc.document['scan'], _pc.document['intent'], _pc.document['applytable'], _pc.document['interp'], _pc.document['spwmap'], _pc.document['outfile'], _pc.document['overwrite'] )
(19 more lines...)
Collapse Failed test_task_sdgaincal sdgaincal_preapply_test.test_preapply03
Test Tasks Many Linux 2.28 Rocky 8.10 Py3.12 < 1 sec
RuntimeError: Error in Calibrater::initialize()
test_task_sdgaincal.py:363: in setUp
    self.generate()
test_task_sdgaincal.py:429: in generate
    sdcal_cli(infile=self.infile, outfile=self.tsystable,
../../../../venv/lib/python3.12/site-packages/casatasks/sdcal.py:352: in __call__
    task_result = _sdcal_t( _pc.document['infile'], _pc.document['calmode'], _pc.document['fraction'], _pc.document['noff'], _pc.document['width'], _pc.document['elongated'], _pc.document['applytable'], _pc.document['interp'], _pc.document['spwmap'], _pc.document['outfile'], _pc.document['overwrite'], _pc.document['field'], _pc.document['spw'], _pc.document['scan'], **kwargs )
                  ^^^^^^^^^^^^^^^^^^^^^^^^^^^^^^^^^^^^^^^^^^^^^^^^^^^^^^^^^^^^^^^^^^^^^^^^^^^^^^^^^^^^^^^^^^^^^^^^^^^^^^^^^^^^^^^^^^^^^^^^^^^^^^^^^^^^^^^^^^^^^^^^^^^^^^^^^^^^^^^^^^^^^^^^^^^^^^^^^^^^^^^^^^^^^^^^^^^^^^^^^^^^^^^^^^^^^^^^^^^^^^^^^^^^^^^^^^^^^^^^^^^^^^^^^^^^^^^^^^^^^^^^^^^^^^^^^^^^^^^^^^^^^^^^^^^^^^^^^^^^^^^^^^^^^^^^^^^^^^^^^^^^^^^^^^^^^^^^^^^^^^^^^^^^^^^^^^^^^^^^^
(15 more lines...)
Collapse Failed test_task_sdgaincal sdgaincal_const_test.test_const01
Test Tasks Many Linux 2.28 Rocky 8.10 Py3.12 < 1 sec
RuntimeError: Error in Calibrater::solve.
test_task_sdgaincal.py:272: in test_const01
    self.run_task(**params)
test_task_sdgaincal.py:93: in run_task
    result = sdgaincal(**params)
             ^^^^^^^^^^^^^^^^^^^
../../../../venv/lib/python3.12/site-packages/casatasks/sdgaincal.py:203: in __call__
    task_result = _sdgaincal_t( _pc.document['infile'], _pc.document['calmode'], _pc.document['radius'], _pc.document['smooth'], _pc.document['antenna'], _pc.document['field'], _pc.document['spw'], _pc.document['scan'], _pc.document['intent'], _pc.document['applytable'], _pc.document['interp'], _pc.document['spwmap'], _pc.document['outfile'], _pc.document['overwrite'] )
(13 more lines...)
Collapse Failed test_task_sdgaincal sdgaincal_const_test.test_const02
Test Tasks Many Linux 2.28 Rocky 8.10 Py3.12 < 1 sec
RuntimeError: Error in Calibrater::solve.
test_task_sdgaincal.py:279: in test_const02
    self.run_task(**params)
test_task_sdgaincal.py:93: in run_task
    result = sdgaincal(**params)
             ^^^^^^^^^^^^^^^^^^^
../../../../venv/lib/python3.12/site-packages/casatasks/sdgaincal.py:203: in __call__
    task_result = _sdgaincal_t( _pc.document['infile'], _pc.document['calmode'], _pc.document['radius'], _pc.document['smooth'], _pc.document['antenna'], _pc.document['field'], _pc.document['spw'], _pc.document['scan'], _pc.document['intent'], _pc.document['applytable'], _pc.document['interp'], _pc.document['spwmap'], _pc.document['outfile'], _pc.document['overwrite'] )
(13 more lines...)
Collapse Failed test_task_setjy test_setpol.testr5
Test Tasks Many Linux 2.28 Rocky 8.10 Py3.12 < 1 sec
RuntimeError: 2026-10-27 14:41:54	SEVERE	Imager::open() (file /source/casa6/casatools/src/code/synthesis/MeasurementEquations/Imager.cc, line 496)	Caught Exception: Measures directory specified which does not contain the IERS data: /home/casatest/data/measures
test_task_setjy.py:2008: in testr5
    sjran = setjy(vis=self.inpms,
../../../../venv/lib/python3.12/site-packages/casatasks/setjy.py:416: in __call__
    task_result = _setjy_t( _pc.document['vis'], _pc.document['field'], _pc.document['spw'], _pc.document['selectdata'], _pc.document['timerange'], _pc.document['scan'], _pc.document['intent'], _pc.document['observation'], _pc.document['scalebychan'], _pc.document['standard'], _pc.document['model'], _pc.document['listmodels'], _pc.document['fluxdensity'], _pc.document['spix'], _pc.document['reffreq'], _pc.document['polindex'], _pc.document['polangle'], _pc.document['rotmeas'], _pc.document['fluxdict'], _pc.document['useephemdir'], _pc.document['interpolation'], _pc.document['usescratch'], _pc.document['ismms'] )
                  ^^^^^^^^^^^^^^^^^^^^^^^^^^^^^^^^^^^^^^^^^^^^^^^^^^^^^^^^^^^^^^^^^^^^^^^^^^^^^^^^^^^^^^^^^^^^^^^^^^^^^^^^^^^^^^^^^^^^^^^^^^^^^^^^^^^^^^^^^^^^^^^^^^^^^^^^^^^^^^^^^^^^^^^^^^^^^^^^^^^^^^^^^^^^^^^^^^^^^^^^^^^^^^^^^^^^^^^^^^^^^^^^^^^^^^^^^^^^^^^^^^^^^^^^^^^^^^^^^^^^^^^^^^^^^^^^^^^^^^^^^^^^^^^^^^^^^^^^^^^^^^^^^^^^^^^^^^^^^^^^^^^^^^^^^^^^^^^^^^^^^^^^^^^^^^^^^^^^^^^^^^^^^^^^^^^^^^^^^^^^^^^^^^^^^^^^^^^^^^^^^^^^^^^^^^^^^^^^^^^^^^^^^^^^^^^^^^^^^^^^^^^^^^^^^^^^^^^^^^^^^^^^^^^^^^^^^^^^^^^^^^^^^^^^^^^^^^^^^^^^^^^^^^^^^^^^^^^^^^^^^^^^^^^^^^^^^^^^^^^^^^^^^^^^^^^^^^^^^^^^^^^^^^^^^^^^^^^^^^^^^^^^^^^^^^^^^^^^^^^^^
../../../../venv/lib/python3.12/site-packages/casatasks/private/task_setjy.py:127: in setjy
    retval = setjy_core(vis, field, spw, selectdata, timerange,
(9 more lines...)
Collapse Failed test_task_setjy test_newStandards_MMS.test_PB2017_MMS
Test Tasks Many Linux 2.28 Rocky 8.10 Py3.12 1 sec
RuntimeError: Table /home/casatest/casa6/casatestutils/nosedir/test_task_setjy/n1333_1.test.mms does not exist
test_task_setjy.py:1481: in test_PB2017_MMS
    sjran = setjy(vis=self.inpmms,
../../../../venv/lib/python3.12/site-packages/casatasks/setjy.py:416: in __call__
    task_result = _setjy_t( _pc.document['vis'], _pc.document['field'], _pc.document['spw'], _pc.document['selectdata'], _pc.document['timerange'], _pc.document['scan'], _pc.document['intent'], _pc.document['observation'], _pc.document['scalebychan'], _pc.document['standard'], _pc.document['model'], _pc.document['listmodels'], _pc.document['fluxdensity'], _pc.document['spix'], _pc.document['reffreq'], _pc.document['polindex'], _pc.document['polangle'], _pc.document['rotmeas'], _pc.document['fluxdict'], _pc.document['useephemdir'], _pc.document['interpolation'], _pc.document['usescratch'], _pc.document['ismms'] )
                  ^^^^^^^^^^^^^^^^^^^^^^^^^^^^^^^^^^^^^^^^^^^^^^^^^^^^^^^^^^^^^^^^^^^^^^^^^^^^^^^^^^^^^^^^^^^^^^^^^^^^^^^^^^^^^^^^^^^^^^^^^^^^^^^^^^^^^^^^^^^^^^^^^^^^^^^^^^^^^^^^^^^^^^^^^^^^^^^^^^^^^^^^^^^^^^^^^^^^^^^^^^^^^^^^^^^^^^^^^^^^^^^^^^^^^^^^^^^^^^^^^^^^^^^^^^^^^^^^^^^^^^^^^^^^^^^^^^^^^^^^^^^^^^^^^^^^^^^^^^^^^^^^^^^^^^^^^^^^^^^^^^^^^^^^^^^^^^^^^^^^^^^^^^^^^^^^^^^^^^^^^^^^^^^^^^^^^^^^^^^^^^^^^^^^^^^^^^^^^^^^^^^^^^^^^^^^^^^^^^^^^^^^^^^^^^^^^^^^^^^^^^^^^^^^^^^^^^^^^^^^^^^^^^^^^^^^^^^^^^^^^^^^^^^^^^^^^^^^^^^^^^^^^^^^^^^^^^^^^^^^^^^^^^^^^^^^^^^^^^^^^^^^^^^^^^^^^^^^^^^^^^^^^^^^^^^^^^^^^^^^^^^^^^^^^^^^^^^^^^^^^
../../../../venv/lib/python3.12/site-packages/casatasks/private/task_setjy.py:90: in setjy
    if ( not listmodels and ParallelDataHelper.isMMSAndNotServer(vis) and usescratch):
(14 more lines...)
Collapse Failed test_task_setjy test_MultipleObservations.test2_MultipleObservationNewModel
Test Tasks Many Linux 2.28 Rocky 8.10 Py3.12 < 1 sec
RuntimeError: 2026-10-27 14:41:44	SEVERE	Imager::open() (file /source/casa6/casatools/src/code/synthesis/MeasurementEquations/Imager.cc, line 496)	Caught Exception: Measures directory specified which does not contain the IERS data: /home/casatest/data/measures
test_task_setjy.py:941: in test2_MultipleObservationNewModel
    sjran = setjy(self.inpms, field='Titan', spw='',
../../../../venv/lib/python3.12/site-packages/casatasks/setjy.py:416: in __call__
    task_result = _setjy_t( _pc.document['vis'], _pc.document['field'], _pc.document['spw'], _pc.document['selectdata'], _pc.document['timerange'], _pc.document['scan'], _pc.document['intent'], _pc.document['observation'], _pc.document['scalebychan'], _pc.document['standard'], _pc.document['model'], _pc.document['listmodels'], _pc.document['fluxdensity'], _pc.document['spix'], _pc.document['reffreq'], _pc.document['polindex'], _pc.document['polangle'], _pc.document['rotmeas'], _pc.document['fluxdict'], _pc.document['useephemdir'], _pc.document['interpolation'], _pc.document['usescratch'], _pc.document['ismms'] )
                  ^^^^^^^^^^^^^^^^^^^^^^^^^^^^^^^^^^^^^^^^^^^^^^^^^^^^^^^^^^^^^^^^^^^^^^^^^^^^^^^^^^^^^^^^^^^^^^^^^^^^^^^^^^^^^^^^^^^^^^^^^^^^^^^^^^^^^^^^^^^^^^^^^^^^^^^^^^^^^^^^^^^^^^^^^^^^^^^^^^^^^^^^^^^^^^^^^^^^^^^^^^^^^^^^^^^^^^^^^^^^^^^^^^^^^^^^^^^^^^^^^^^^^^^^^^^^^^^^^^^^^^^^^^^^^^^^^^^^^^^^^^^^^^^^^^^^^^^^^^^^^^^^^^^^^^^^^^^^^^^^^^^^^^^^^^^^^^^^^^^^^^^^^^^^^^^^^^^^^^^^^^^^^^^^^^^^^^^^^^^^^^^^^^^^^^^^^^^^^^^^^^^^^^^^^^^^^^^^^^^^^^^^^^^^^^^^^^^^^^^^^^^^^^^^^^^^^^^^^^^^^^^^^^^^^^^^^^^^^^^^^^^^^^^^^^^^^^^^^^^^^^^^^^^^^^^^^^^^^^^^^^^^^^^^^^^^^^^^^^^^^^^^^^^^^^^^^^^^^^^^^^^^^^^^^^^^^^^^^^^^^^^^^^^^^^^^^^^^^^^^^
../../../../venv/lib/python3.12/site-packages/casatasks/private/task_setjy.py:127: in setjy
    retval = setjy_core(vis, field, spw, selectdata, timerange,
(9 more lines...)
Collapse Failed test_task_setjy test_SingleObservation.test5_SingleObservationSelectByIntentNewModel
Test Tasks Many Linux 2.28 Rocky 8.10 Py3.12 < 1 sec
RuntimeError: 2026-10-27 14:41:44	SEVERE	Imager::open() (file /source/casa6/casatools/src/code/synthesis/MeasurementEquations/Imager.cc, line 496)	Caught Exception: Measures directory specified which does not contain the IERS data: /home/casatest/data/measures
test_task_setjy.py:741: in test5_SingleObservationSelectByIntentNewModel
    sjran = setjy(vis=self.inpms, field='', spw='', model='',
../../../../venv/lib/python3.12/site-packages/casatasks/setjy.py:416: in __call__
    task_result = _setjy_t( _pc.document['vis'], _pc.document['field'], _pc.document['spw'], _pc.document['selectdata'], _pc.document['timerange'], _pc.document['scan'], _pc.document['intent'], _pc.document['observation'], _pc.document['scalebychan'], _pc.document['standard'], _pc.document['model'], _pc.document['listmodels'], _pc.document['fluxdensity'], _pc.document['spix'], _pc.document['reffreq'], _pc.document['polindex'], _pc.document['polangle'], _pc.document['rotmeas'], _pc.document['fluxdict'], _pc.document['useephemdir'], _pc.document['interpolation'], _pc.document['usescratch'], _pc.document['ismms'] )
                  ^^^^^^^^^^^^^^^^^^^^^^^^^^^^^^^^^^^^^^^^^^^^^^^^^^^^^^^^^^^^^^^^^^^^^^^^^^^^^^^^^^^^^^^^^^^^^^^^^^^^^^^^^^^^^^^^^^^^^^^^^^^^^^^^^^^^^^^^^^^^^^^^^^^^^^^^^^^^^^^^^^^^^^^^^^^^^^^^^^^^^^^^^^^^^^^^^^^^^^^^^^^^^^^^^^^^^^^^^^^^^^^^^^^^^^^^^^^^^^^^^^^^^^^^^^^^^^^^^^^^^^^^^^^^^^^^^^^^^^^^^^^^^^^^^^^^^^^^^^^^^^^^^^^^^^^^^^^^^^^^^^^^^^^^^^^^^^^^^^^^^^^^^^^^^^^^^^^^^^^^^^^^^^^^^^^^^^^^^^^^^^^^^^^^^^^^^^^^^^^^^^^^^^^^^^^^^^^^^^^^^^^^^^^^^^^^^^^^^^^^^^^^^^^^^^^^^^^^^^^^^^^^^^^^^^^^^^^^^^^^^^^^^^^^^^^^^^^^^^^^^^^^^^^^^^^^^^^^^^^^^^^^^^^^^^^^^^^^^^^^^^^^^^^^^^^^^^^^^^^^^^^^^^^^^^^^^^^^^^^^^^^^^^^^^^^^^^^^^^^^^
../../../../venv/lib/python3.12/site-packages/casatasks/private/task_setjy.py:127: in setjy
    retval = setjy_core(vis, field, spw, selectdata, timerange,
(9 more lines...)
Collapse Failed test_task_setjy test_setpol.test_setpol_wrongspix
Test Tasks Many Linux 2.28 Rocky 8.10 Py3.12 < 1 sec
AssertionError: -1 == -1 : wrong type of exception is thrown
test_task_setjy.py:2105: in test_setpol_wrongspix
    sjran = setjy(vis=self.inpms,
../../../../venv/lib/python3.12/site-packages/casatasks/setjy.py:416: in __call__
    task_result = _setjy_t( _pc.document['vis'], _pc.document['field'], _pc.document['spw'], _pc.document['selectdata'], _pc.document['timerange'], _pc.document['scan'], _pc.document['intent'], _pc.document['observation'], _pc.document['scalebychan'], _pc.document['standard'], _pc.document['model'], _pc.document['listmodels'], _pc.document['fluxdensity'], _pc.document['spix'], _pc.document['reffreq'], _pc.document['polindex'], _pc.document['polangle'], _pc.document['rotmeas'], _pc.document['fluxdict'], _pc.document['useephemdir'], _pc.document['interpolation'], _pc.document['usescratch'], _pc.document['ismms'] )
                  ^^^^^^^^^^^^^^^^^^^^^^^^^^^^^^^^^^^^^^^^^^^^^^^^^^^^^^^^^^^^^^^^^^^^^^^^^^^^^^^^^^^^^^^^^^^^^^^^^^^^^^^^^^^^^^^^^^^^^^^^^^^^^^^^^^^^^^^^^^^^^^^^^^^^^^^^^^^^^^^^^^^^^^^^^^^^^^^^^^^^^^^^^^^^^^^^^^^^^^^^^^^^^^^^^^^^^^^^^^^^^^^^^^^^^^^^^^^^^^^^^^^^^^^^^^^^^^^^^^^^^^^^^^^^^^^^^^^^^^^^^^^^^^^^^^^^^^^^^^^^^^^^^^^^^^^^^^^^^^^^^^^^^^^^^^^^^^^^^^^^^^^^^^^^^^^^^^^^^^^^^^^^^^^^^^^^^^^^^^^^^^^^^^^^^^^^^^^^^^^^^^^^^^^^^^^^^^^^^^^^^^^^^^^^^^^^^^^^^^^^^^^^^^^^^^^^^^^^^^^^^^^^^^^^^^^^^^^^^^^^^^^^^^^^^^^^^^^^^^^^^^^^^^^^^^^^^^^^^^^^^^^^^^^^^^^^^^^^^^^^^^^^^^^^^^^^^^^^^^^^^^^^^^^^^^^^^^^^^^^^^^^^^^^^^^^^^^^^^^^^^
../../../../venv/lib/python3.12/site-packages/casatasks/private/task_setjy.py:127: in setjy
    retval = setjy_core(vis, field, spw, selectdata, timerange,
(14 more lines...)
Collapse Failed test_task_setjy test_newStandards_MMS.test_PB2013_MMS
Test Tasks Many Linux 2.28 Rocky 8.10 Py3.12 2 secs
RuntimeError: Table /home/casatest/casa6/casatestutils/nosedir/test_task_setjy/n1333_1.test.mms does not exist
test_task_setjy.py:1456: in test_PB2013_MMS
    sjran = setjy(vis=self.inpmms,
../../../../venv/lib/python3.12/site-packages/casatasks/setjy.py:416: in __call__
    task_result = _setjy_t( _pc.document['vis'], _pc.document['field'], _pc.document['spw'], _pc.document['selectdata'], _pc.document['timerange'], _pc.document['scan'], _pc.document['intent'], _pc.document['observation'], _pc.document['scalebychan'], _pc.document['standard'], _pc.document['model'], _pc.document['listmodels'], _pc.document['fluxdensity'], _pc.document['spix'], _pc.document['reffreq'], _pc.document['polindex'], _pc.document['polangle'], _pc.document['rotmeas'], _pc.document['fluxdict'], _pc.document['useephemdir'], _pc.document['interpolation'], _pc.document['usescratch'], _pc.document['ismms'] )
                  ^^^^^^^^^^^^^^^^^^^^^^^^^^^^^^^^^^^^^^^^^^^^^^^^^^^^^^^^^^^^^^^^^^^^^^^^^^^^^^^^^^^^^^^^^^^^^^^^^^^^^^^^^^^^^^^^^^^^^^^^^^^^^^^^^^^^^^^^^^^^^^^^^^^^^^^^^^^^^^^^^^^^^^^^^^^^^^^^^^^^^^^^^^^^^^^^^^^^^^^^^^^^^^^^^^^^^^^^^^^^^^^^^^^^^^^^^^^^^^^^^^^^^^^^^^^^^^^^^^^^^^^^^^^^^^^^^^^^^^^^^^^^^^^^^^^^^^^^^^^^^^^^^^^^^^^^^^^^^^^^^^^^^^^^^^^^^^^^^^^^^^^^^^^^^^^^^^^^^^^^^^^^^^^^^^^^^^^^^^^^^^^^^^^^^^^^^^^^^^^^^^^^^^^^^^^^^^^^^^^^^^^^^^^^^^^^^^^^^^^^^^^^^^^^^^^^^^^^^^^^^^^^^^^^^^^^^^^^^^^^^^^^^^^^^^^^^^^^^^^^^^^^^^^^^^^^^^^^^^^^^^^^^^^^^^^^^^^^^^^^^^^^^^^^^^^^^^^^^^^^^^^^^^^^^^^^^^^^^^^^^^^^^^^^^^^^^^^^^^^^^
../../../../venv/lib/python3.12/site-packages/casatasks/private/task_setjy.py:90: in setjy
    if ( not listmodels and ParallelDataHelper.isMMSAndNotServer(vis) and usescratch):
(14 more lines...)
Collapse Failed test_task_setjy test_newVLAmodelimages.test_3C286_KaBandModel
Test Tasks Many Linux 2.28 Rocky 8.10 Py3.12 < 1 sec
RuntimeError: 2026-10-27 14:41:47	SEVERE	Imager::open() (file /source/casa6/casatools/src/code/synthesis/MeasurementEquations/Imager.cc, line 496)	Caught Exception: Measures directory specified which does not contain the IERS data: /home/casatest/data/measures
test_task_setjy.py:1399: in test_3C286_KaBandModel
    sjran = setjy(vis=self.inpms,
../../../../venv/lib/python3.12/site-packages/casatasks/setjy.py:416: in __call__
    task_result = _setjy_t( _pc.document['vis'], _pc.document['field'], _pc.document['spw'], _pc.document['selectdata'], _pc.document['timerange'], _pc.document['scan'], _pc.document['intent'], _pc.document['observation'], _pc.document['scalebychan'], _pc.document['standard'], _pc.document['model'], _pc.document['listmodels'], _pc.document['fluxdensity'], _pc.document['spix'], _pc.document['reffreq'], _pc.document['polindex'], _pc.document['polangle'], _pc.document['rotmeas'], _pc.document['fluxdict'], _pc.document['useephemdir'], _pc.document['interpolation'], _pc.document['usescratch'], _pc.document['ismms'] )
                  ^^^^^^^^^^^^^^^^^^^^^^^^^^^^^^^^^^^^^^^^^^^^^^^^^^^^^^^^^^^^^^^^^^^^^^^^^^^^^^^^^^^^^^^^^^^^^^^^^^^^^^^^^^^^^^^^^^^^^^^^^^^^^^^^^^^^^^^^^^^^^^^^^^^^^^^^^^^^^^^^^^^^^^^^^^^^^^^^^^^^^^^^^^^^^^^^^^^^^^^^^^^^^^^^^^^^^^^^^^^^^^^^^^^^^^^^^^^^^^^^^^^^^^^^^^^^^^^^^^^^^^^^^^^^^^^^^^^^^^^^^^^^^^^^^^^^^^^^^^^^^^^^^^^^^^^^^^^^^^^^^^^^^^^^^^^^^^^^^^^^^^^^^^^^^^^^^^^^^^^^^^^^^^^^^^^^^^^^^^^^^^^^^^^^^^^^^^^^^^^^^^^^^^^^^^^^^^^^^^^^^^^^^^^^^^^^^^^^^^^^^^^^^^^^^^^^^^^^^^^^^^^^^^^^^^^^^^^^^^^^^^^^^^^^^^^^^^^^^^^^^^^^^^^^^^^^^^^^^^^^^^^^^^^^^^^^^^^^^^^^^^^^^^^^^^^^^^^^^^^^^^^^^^^^^^^^^^^^^^^^^^^^^^^^^^^^^^^^^^^^^
../../../../venv/lib/python3.12/site-packages/casatasks/private/task_setjy.py:127: in setjy
    retval = setjy_core(vis, field, spw, selectdata, timerange,
(9 more lines...)
Collapse Failed test_task_setjy test_setpol.test_setpol2
Test Tasks Many Linux 2.28 Rocky 8.10 Py3.12 < 1 sec
RuntimeError: 2026-10-27 14:41:53	SEVERE	Imager::open() (file /source/casa6/casatools/src/code/synthesis/MeasurementEquations/Imager.cc, line 496)	Caught Exception: Measures directory specified which does not contain the IERS data: /home/casatest/data/measures
test_task_setjy.py:1886: in test_setpol2
    sjran = setjy(vis=self.inpms,
../../../../venv/lib/python3.12/site-packages/casatasks/setjy.py:416: in __call__
    task_result = _setjy_t( _pc.document['vis'], _pc.document['field'], _pc.document['spw'], _pc.document['selectdata'], _pc.document['timerange'], _pc.document['scan'], _pc.document['intent'], _pc.document['observation'], _pc.document['scalebychan'], _pc.document['standard'], _pc.document['model'], _pc.document['listmodels'], _pc.document['fluxdensity'], _pc.document['spix'], _pc.document['reffreq'], _pc.document['polindex'], _pc.document['polangle'], _pc.document['rotmeas'], _pc.document['fluxdict'], _pc.document['useephemdir'], _pc.document['interpolation'], _pc.document['usescratch'], _pc.document['ismms'] )
                  ^^^^^^^^^^^^^^^^^^^^^^^^^^^^^^^^^^^^^^^^^^^^^^^^^^^^^^^^^^^^^^^^^^^^^^^^^^^^^^^^^^^^^^^^^^^^^^^^^^^^^^^^^^^^^^^^^^^^^^^^^^^^^^^^^^^^^^^^^^^^^^^^^^^^^^^^^^^^^^^^^^^^^^^^^^^^^^^^^^^^^^^^^^^^^^^^^^^^^^^^^^^^^^^^^^^^^^^^^^^^^^^^^^^^^^^^^^^^^^^^^^^^^^^^^^^^^^^^^^^^^^^^^^^^^^^^^^^^^^^^^^^^^^^^^^^^^^^^^^^^^^^^^^^^^^^^^^^^^^^^^^^^^^^^^^^^^^^^^^^^^^^^^^^^^^^^^^^^^^^^^^^^^^^^^^^^^^^^^^^^^^^^^^^^^^^^^^^^^^^^^^^^^^^^^^^^^^^^^^^^^^^^^^^^^^^^^^^^^^^^^^^^^^^^^^^^^^^^^^^^^^^^^^^^^^^^^^^^^^^^^^^^^^^^^^^^^^^^^^^^^^^^^^^^^^^^^^^^^^^^^^^^^^^^^^^^^^^^^^^^^^^^^^^^^^^^^^^^^^^^^^^^^^^^^^^^^^^^^^^^^^^^^^^^^^^^^^^^^^^^^
../../../../venv/lib/python3.12/site-packages/casatasks/private/task_setjy.py:127: in setjy
    retval = setjy_core(vis, field, spw, selectdata, timerange,
(9 more lines...)
Collapse Failed test_task_setjy test_ephemtbl.test_ephemtbl1
Test Tasks Many Linux 2.28 Rocky 8.10 Py3.12 < 1 sec
RuntimeError: 2026-10-27 14:41:54	SEVERE	Imager::open() (file /source/casa6/casatools/src/code/synthesis/MeasurementEquations/Imager.cc, line 496)	Caught Exception: Measures directory specified which does not contain the IERS data: /home/casatest/data/measures
test_task_setjy.py:2150: in test_ephemtbl1
    sjran = setjy(vis=self.inpms, field='1', spw='0,1,2,3', standard='Butler-JPL-Horizons 2012', usescratch=True)
            ^^^^^^^^^^^^^^^^^^^^^^^^^^^^^^^^^^^^^^^^^^^^^^^^^^^^^^^^^^^^^^^^^^^^^^^^^^^^^^^^^^^^^^^^^^^^^^^^^^^^^
../../../../venv/lib/python3.12/site-packages/casatasks/setjy.py:416: in __call__
    task_result = _setjy_t( _pc.document['vis'], _pc.document['field'], _pc.document['spw'], _pc.document['selectdata'], _pc.document['timerange'], _pc.document['scan'], _pc.document['intent'], _pc.document['observation'], _pc.document['scalebychan'], _pc.document['standard'], _pc.document['model'], _pc.document['listmodels'], _pc.document['fluxdensity'], _pc.document['spix'], _pc.document['reffreq'], _pc.document['polindex'], _pc.document['polangle'], _pc.document['rotmeas'], _pc.document['fluxdict'], _pc.document['useephemdir'], _pc.document['interpolation'], _pc.document['usescratch'], _pc.document['ismms'] )
                  ^^^^^^^^^^^^^^^^^^^^^^^^^^^^^^^^^^^^^^^^^^^^^^^^^^^^^^^^^^^^^^^^^^^^^^^^^^^^^^^^^^^^^^^^^^^^^^^^^^^^^^^^^^^^^^^^^^^^^^^^^^^^^^^^^^^^^^^^^^^^^^^^^^^^^^^^^^^^^^^^^^^^^^^^^^^^^^^^^^^^^^^^^^^^^^^^^^^^^^^^^^^^^^^^^^^^^^^^^^^^^^^^^^^^^^^^^^^^^^^^^^^^^^^^^^^^^^^^^^^^^^^^^^^^^^^^^^^^^^^^^^^^^^^^^^^^^^^^^^^^^^^^^^^^^^^^^^^^^^^^^^^^^^^^^^^^^^^^^^^^^^^^^^^^^^^^^^^^^^^^^^^^^^^^^^^^^^^^^^^^^^^^^^^^^^^^^^^^^^^^^^^^^^^^^^^^^^^^^^^^^^^^^^^^^^^^^^^^^^^^^^^^^^^^^^^^^^^^^^^^^^^^^^^^^^^^^^^^^^^^^^^^^^^^^^^^^^^^^^^^^^^^^^^^^^^^^^^^^^^^^^^^^^^^^^^^^^^^^^^^^^^^^^^^^^^^^^^^^^^^^^^^^^^^^^^^^^^^^^^^^^^^^^^^^^^^^^^^^^^^^
../../../../venv/lib/python3.12/site-packages/casatasks/private/task_setjy.py:127: in setjy
(10 more lines...)
Collapse Failed test_task_setjy test_setpol.test_setpol4
Test Tasks Many Linux 2.28 Rocky 8.10 Py3.12 < 1 sec
RuntimeError: 2026-10-27 14:41:54	SEVERE	Imager::open() (file /source/casa6/casatools/src/code/synthesis/MeasurementEquations/Imager.cc, line 496)	Caught Exception: Measures directory specified which does not contain the IERS data: /home/casatest/data/measures
test_task_setjy.py:1962: in test_setpol4
    sjran = setjy(vis=self.inpms,
../../../../venv/lib/python3.12/site-packages/casatasks/setjy.py:416: in __call__
    task_result = _setjy_t( _pc.document['vis'], _pc.document['field'], _pc.document['spw'], _pc.document['selectdata'], _pc.document['timerange'], _pc.document['scan'], _pc.document['intent'], _pc.document['observation'], _pc.document['scalebychan'], _pc.document['standard'], _pc.document['model'], _pc.document['listmodels'], _pc.document['fluxdensity'], _pc.document['spix'], _pc.document['reffreq'], _pc.document['polindex'], _pc.document['polangle'], _pc.document['rotmeas'], _pc.document['fluxdict'], _pc.document['useephemdir'], _pc.document['interpolation'], _pc.document['usescratch'], _pc.document['ismms'] )
                  ^^^^^^^^^^^^^^^^^^^^^^^^^^^^^^^^^^^^^^^^^^^^^^^^^^^^^^^^^^^^^^^^^^^^^^^^^^^^^^^^^^^^^^^^^^^^^^^^^^^^^^^^^^^^^^^^^^^^^^^^^^^^^^^^^^^^^^^^^^^^^^^^^^^^^^^^^^^^^^^^^^^^^^^^^^^^^^^^^^^^^^^^^^^^^^^^^^^^^^^^^^^^^^^^^^^^^^^^^^^^^^^^^^^^^^^^^^^^^^^^^^^^^^^^^^^^^^^^^^^^^^^^^^^^^^^^^^^^^^^^^^^^^^^^^^^^^^^^^^^^^^^^^^^^^^^^^^^^^^^^^^^^^^^^^^^^^^^^^^^^^^^^^^^^^^^^^^^^^^^^^^^^^^^^^^^^^^^^^^^^^^^^^^^^^^^^^^^^^^^^^^^^^^^^^^^^^^^^^^^^^^^^^^^^^^^^^^^^^^^^^^^^^^^^^^^^^^^^^^^^^^^^^^^^^^^^^^^^^^^^^^^^^^^^^^^^^^^^^^^^^^^^^^^^^^^^^^^^^^^^^^^^^^^^^^^^^^^^^^^^^^^^^^^^^^^^^^^^^^^^^^^^^^^^^^^^^^^^^^^^^^^^^^^^^^^^^^^^^^^^^
../../../../venv/lib/python3.12/site-packages/casatasks/private/task_setjy.py:127: in setjy
    retval = setjy_core(vis, field, spw, selectdata, timerange,
(9 more lines...)
Collapse Failed test_task_setjy test_newVLAmodelimages.test_3C147_KaBandModel
Test Tasks Many Linux 2.28 Rocky 8.10 Py3.12 < 1 sec
RuntimeError: 2026-10-27 14:41:47	SEVERE	Imager::open() (file /source/casa6/casatools/src/code/synthesis/MeasurementEquations/Imager.cc, line 496)	Caught Exception: Measures directory specified which does not contain the IERS data: /home/casatest/data/measures
test_task_setjy.py:1353: in test_3C147_KaBandModel
    sjran = setjy(vis=self.inpms,
../../../../venv/lib/python3.12/site-packages/casatasks/setjy.py:416: in __call__
    task_result = _setjy_t( _pc.document['vis'], _pc.document['field'], _pc.document['spw'], _pc.document['selectdata'], _pc.document['timerange'], _pc.document['scan'], _pc.document['intent'], _pc.document['observation'], _pc.document['scalebychan'], _pc.document['standard'], _pc.document['model'], _pc.document['listmodels'], _pc.document['fluxdensity'], _pc.document['spix'], _pc.document['reffreq'], _pc.document['polindex'], _pc.document['polangle'], _pc.document['rotmeas'], _pc.document['fluxdict'], _pc.document['useephemdir'], _pc.document['interpolation'], _pc.document['usescratch'], _pc.document['ismms'] )
                  ^^^^^^^^^^^^^^^^^^^^^^^^^^^^^^^^^^^^^^^^^^^^^^^^^^^^^^^^^^^^^^^^^^^^^^^^^^^^^^^^^^^^^^^^^^^^^^^^^^^^^^^^^^^^^^^^^^^^^^^^^^^^^^^^^^^^^^^^^^^^^^^^^^^^^^^^^^^^^^^^^^^^^^^^^^^^^^^^^^^^^^^^^^^^^^^^^^^^^^^^^^^^^^^^^^^^^^^^^^^^^^^^^^^^^^^^^^^^^^^^^^^^^^^^^^^^^^^^^^^^^^^^^^^^^^^^^^^^^^^^^^^^^^^^^^^^^^^^^^^^^^^^^^^^^^^^^^^^^^^^^^^^^^^^^^^^^^^^^^^^^^^^^^^^^^^^^^^^^^^^^^^^^^^^^^^^^^^^^^^^^^^^^^^^^^^^^^^^^^^^^^^^^^^^^^^^^^^^^^^^^^^^^^^^^^^^^^^^^^^^^^^^^^^^^^^^^^^^^^^^^^^^^^^^^^^^^^^^^^^^^^^^^^^^^^^^^^^^^^^^^^^^^^^^^^^^^^^^^^^^^^^^^^^^^^^^^^^^^^^^^^^^^^^^^^^^^^^^^^^^^^^^^^^^^^^^^^^^^^^^^^^^^^^^^^^^^^^^^^^^^
../../../../venv/lib/python3.12/site-packages/casatasks/private/task_setjy.py:127: in setjy
    retval = setjy_core(vis, field, spw, selectdata, timerange,
(9 more lines...)
Collapse Failed test_task_setjy test_SingleObservation.test1_SingleObservationOldModel
Test Tasks Many Linux 2.28 Rocky 8.10 Py3.12 < 1 sec
RuntimeError: 2026-10-27 14:41:41	SEVERE	Imager::open() (file /source/casa6/casatools/src/code/synthesis/MeasurementEquations/Imager.cc, line 496)	Caught Exception: Measures directory specified which does not contain the IERS data: /home/casatest/data/measures
test_task_setjy.py:238: in test1_SingleObservationOldModel
    sjran = setjy(vis=self.inpms, field='Titan', spw='', model='',
../../../../venv/lib/python3.12/site-packages/casatasks/setjy.py:416: in __call__
    task_result = _setjy_t( _pc.document['vis'], _pc.document['field'], _pc.document['spw'], _pc.document['selectdata'], _pc.document['timerange'], _pc.document['scan'], _pc.document['intent'], _pc.document['observation'], _pc.document['scalebychan'], _pc.document['standard'], _pc.document['model'], _pc.document['listmodels'], _pc.document['fluxdensity'], _pc.document['spix'], _pc.document['reffreq'], _pc.document['polindex'], _pc.document['polangle'], _pc.document['rotmeas'], _pc.document['fluxdict'], _pc.document['useephemdir'], _pc.document['interpolation'], _pc.document['usescratch'], _pc.document['ismms'] )
                  ^^^^^^^^^^^^^^^^^^^^^^^^^^^^^^^^^^^^^^^^^^^^^^^^^^^^^^^^^^^^^^^^^^^^^^^^^^^^^^^^^^^^^^^^^^^^^^^^^^^^^^^^^^^^^^^^^^^^^^^^^^^^^^^^^^^^^^^^^^^^^^^^^^^^^^^^^^^^^^^^^^^^^^^^^^^^^^^^^^^^^^^^^^^^^^^^^^^^^^^^^^^^^^^^^^^^^^^^^^^^^^^^^^^^^^^^^^^^^^^^^^^^^^^^^^^^^^^^^^^^^^^^^^^^^^^^^^^^^^^^^^^^^^^^^^^^^^^^^^^^^^^^^^^^^^^^^^^^^^^^^^^^^^^^^^^^^^^^^^^^^^^^^^^^^^^^^^^^^^^^^^^^^^^^^^^^^^^^^^^^^^^^^^^^^^^^^^^^^^^^^^^^^^^^^^^^^^^^^^^^^^^^^^^^^^^^^^^^^^^^^^^^^^^^^^^^^^^^^^^^^^^^^^^^^^^^^^^^^^^^^^^^^^^^^^^^^^^^^^^^^^^^^^^^^^^^^^^^^^^^^^^^^^^^^^^^^^^^^^^^^^^^^^^^^^^^^^^^^^^^^^^^^^^^^^^^^^^^^^^^^^^^^^^^^^^^^^^^^^^^^
../../../../venv/lib/python3.12/site-packages/casatasks/private/task_setjy.py:127: in setjy
    retval = setjy_core(vis, field, spw, selectdata, timerange,
(9 more lines...)
Collapse Failed test_task_setjy test_MultipleObservations.test1_MultipleObservationOldModel
Test Tasks Many Linux 2.28 Rocky 8.10 Py3.12 < 1 sec
RuntimeError: 2026-10-27 14:41:44	SEVERE	Imager::open() (file /source/casa6/casatools/src/code/synthesis/MeasurementEquations/Imager.cc, line 496)	Caught Exception: Measures directory specified which does not contain the IERS data: /home/casatest/data/measures
test_task_setjy.py:871: in test1_MultipleObservationOldModel
    sjran = setjy(self.inpms, field='Titan', spw='',
../../../../venv/lib/python3.12/site-packages/casatasks/setjy.py:416: in __call__
    task_result = _setjy_t( _pc.document['vis'], _pc.document['field'], _pc.document['spw'], _pc.document['selectdata'], _pc.document['timerange'], _pc.document['scan'], _pc.document['intent'], _pc.document['observation'], _pc.document['scalebychan'], _pc.document['standard'], _pc.document['model'], _pc.document['listmodels'], _pc.document['fluxdensity'], _pc.document['spix'], _pc.document['reffreq'], _pc.document['polindex'], _pc.document['polangle'], _pc.document['rotmeas'], _pc.document['fluxdict'], _pc.document['useephemdir'], _pc.document['interpolation'], _pc.document['usescratch'], _pc.document['ismms'] )
                  ^^^^^^^^^^^^^^^^^^^^^^^^^^^^^^^^^^^^^^^^^^^^^^^^^^^^^^^^^^^^^^^^^^^^^^^^^^^^^^^^^^^^^^^^^^^^^^^^^^^^^^^^^^^^^^^^^^^^^^^^^^^^^^^^^^^^^^^^^^^^^^^^^^^^^^^^^^^^^^^^^^^^^^^^^^^^^^^^^^^^^^^^^^^^^^^^^^^^^^^^^^^^^^^^^^^^^^^^^^^^^^^^^^^^^^^^^^^^^^^^^^^^^^^^^^^^^^^^^^^^^^^^^^^^^^^^^^^^^^^^^^^^^^^^^^^^^^^^^^^^^^^^^^^^^^^^^^^^^^^^^^^^^^^^^^^^^^^^^^^^^^^^^^^^^^^^^^^^^^^^^^^^^^^^^^^^^^^^^^^^^^^^^^^^^^^^^^^^^^^^^^^^^^^^^^^^^^^^^^^^^^^^^^^^^^^^^^^^^^^^^^^^^^^^^^^^^^^^^^^^^^^^^^^^^^^^^^^^^^^^^^^^^^^^^^^^^^^^^^^^^^^^^^^^^^^^^^^^^^^^^^^^^^^^^^^^^^^^^^^^^^^^^^^^^^^^^^^^^^^^^^^^^^^^^^^^^^^^^^^^^^^^^^^^^^^^^^^^^^^^^
../../../../venv/lib/python3.12/site-packages/casatasks/private/task_setjy.py:127: in setjy
    retval = setjy_core(vis, field, spw, selectdata, timerange,
(9 more lines...)
Collapse Failed test_task_setjy test_newVLAmodelimages.test_3C48_KaBandModel
Test Tasks Many Linux 2.28 Rocky 8.10 Py3.12 < 1 sec
RuntimeError: 2026-10-27 14:41:47	SEVERE	Imager::open() (file /source/casa6/casatools/src/code/synthesis/MeasurementEquations/Imager.cc, line 496)	Caught Exception: Measures directory specified which does not contain the IERS data: /home/casatest/data/measures
test_task_setjy.py:1262: in test_3C48_KaBandModel
    sjran = setjy(vis=self.inpms,
../../../../venv/lib/python3.12/site-packages/casatasks/setjy.py:416: in __call__
    task_result = _setjy_t( _pc.document['vis'], _pc.document['field'], _pc.document['spw'], _pc.document['selectdata'], _pc.document['timerange'], _pc.document['scan'], _pc.document['intent'], _pc.document['observation'], _pc.document['scalebychan'], _pc.document['standard'], _pc.document['model'], _pc.document['listmodels'], _pc.document['fluxdensity'], _pc.document['spix'], _pc.document['reffreq'], _pc.document['polindex'], _pc.document['polangle'], _pc.document['rotmeas'], _pc.document['fluxdict'], _pc.document['useephemdir'], _pc.document['interpolation'], _pc.document['usescratch'], _pc.document['ismms'] )
                  ^^^^^^^^^^^^^^^^^^^^^^^^^^^^^^^^^^^^^^^^^^^^^^^^^^^^^^^^^^^^^^^^^^^^^^^^^^^^^^^^^^^^^^^^^^^^^^^^^^^^^^^^^^^^^^^^^^^^^^^^^^^^^^^^^^^^^^^^^^^^^^^^^^^^^^^^^^^^^^^^^^^^^^^^^^^^^^^^^^^^^^^^^^^^^^^^^^^^^^^^^^^^^^^^^^^^^^^^^^^^^^^^^^^^^^^^^^^^^^^^^^^^^^^^^^^^^^^^^^^^^^^^^^^^^^^^^^^^^^^^^^^^^^^^^^^^^^^^^^^^^^^^^^^^^^^^^^^^^^^^^^^^^^^^^^^^^^^^^^^^^^^^^^^^^^^^^^^^^^^^^^^^^^^^^^^^^^^^^^^^^^^^^^^^^^^^^^^^^^^^^^^^^^^^^^^^^^^^^^^^^^^^^^^^^^^^^^^^^^^^^^^^^^^^^^^^^^^^^^^^^^^^^^^^^^^^^^^^^^^^^^^^^^^^^^^^^^^^^^^^^^^^^^^^^^^^^^^^^^^^^^^^^^^^^^^^^^^^^^^^^^^^^^^^^^^^^^^^^^^^^^^^^^^^^^^^^^^^^^^^^^^^^^^^^^^^^^^^^^^^^
../../../../venv/lib/python3.12/site-packages/casatasks/private/task_setjy.py:127: in setjy
    retval = setjy_core(vis, field, spw, selectdata, timerange,
(9 more lines...)
Collapse Failed test_task_setjy test_tpmAsteroid.test1_tpm
Test Tasks Many Linux 2.28 Rocky 8.10 Py3.12 < 1 sec
RuntimeError: 2026-10-27 14:41:55	SEVERE	Imager::open() (file /source/casa6/casatools/src/code/synthesis/MeasurementEquations/Imager.cc, line 496)	Caught Exception: Measures directory specified which does not contain the IERS data: /home/casatest/data/measures
test_task_setjy.py:2256: in test1_tpm
    sjran = setjy(vis=self.inpms, field='Ceres,Vesta', spw='0,1,2,3', standard='Butler-JPL-Horizons 2012', intent="*CALIB*PHASE*",usescratch=True)
            ^^^^^^^^^^^^^^^^^^^^^^^^^^^^^^^^^^^^^^^^^^^^^^^^^^^^^^^^^^^^^^^^^^^^^^^^^^^^^^^^^^^^^^^^^^^^^^^^^^^^^^^^^^^^^^^^^^^^^^^^^^^^^^^^^^^^^^
../../../../venv/lib/python3.12/site-packages/casatasks/setjy.py:416: in __call__
    task_result = _setjy_t( _pc.document['vis'], _pc.document['field'], _pc.document['spw'], _pc.document['selectdata'], _pc.document['timerange'], _pc.document['scan'], _pc.document['intent'], _pc.document['observation'], _pc.document['scalebychan'], _pc.document['standard'], _pc.document['model'], _pc.document['listmodels'], _pc.document['fluxdensity'], _pc.document['spix'], _pc.document['reffreq'], _pc.document['polindex'], _pc.document['polangle'], _pc.document['rotmeas'], _pc.document['fluxdict'], _pc.document['useephemdir'], _pc.document['interpolation'], _pc.document['usescratch'], _pc.document['ismms'] )
                  ^^^^^^^^^^^^^^^^^^^^^^^^^^^^^^^^^^^^^^^^^^^^^^^^^^^^^^^^^^^^^^^^^^^^^^^^^^^^^^^^^^^^^^^^^^^^^^^^^^^^^^^^^^^^^^^^^^^^^^^^^^^^^^^^^^^^^^^^^^^^^^^^^^^^^^^^^^^^^^^^^^^^^^^^^^^^^^^^^^^^^^^^^^^^^^^^^^^^^^^^^^^^^^^^^^^^^^^^^^^^^^^^^^^^^^^^^^^^^^^^^^^^^^^^^^^^^^^^^^^^^^^^^^^^^^^^^^^^^^^^^^^^^^^^^^^^^^^^^^^^^^^^^^^^^^^^^^^^^^^^^^^^^^^^^^^^^^^^^^^^^^^^^^^^^^^^^^^^^^^^^^^^^^^^^^^^^^^^^^^^^^^^^^^^^^^^^^^^^^^^^^^^^^^^^^^^^^^^^^^^^^^^^^^^^^^^^^^^^^^^^^^^^^^^^^^^^^^^^^^^^^^^^^^^^^^^^^^^^^^^^^^^^^^^^^^^^^^^^^^^^^^^^^^^^^^^^^^^^^^^^^^^^^^^^^^^^^^^^^^^^^^^^^^^^^^^^^^^^^^^^^^^^^^^^^^^^^^^^^^^^^^^^^^^^^^^^^^^^^^^^
../../../../venv/lib/python3.12/site-packages/casatasks/private/task_setjy.py:127: in setjy
(10 more lines...)
Collapse Failed test_task_setjy test_newStandards.test_PB2017
Test Tasks Many Linux 2.28 Rocky 8.10 Py3.12 < 1 sec
RuntimeError: 2026-10-27 14:41:47	SEVERE	Imager::open() (file /source/casa6/casatools/src/code/synthesis/MeasurementEquations/Imager.cc, line 496)	Caught Exception: Measures directory specified which does not contain the IERS data: /home/casatest/data/measures
test_task_setjy.py:1214: in test_PB2017
    sjran = setjy(vis=self.inpms,
../../../../venv/lib/python3.12/site-packages/casatasks/setjy.py:416: in __call__
    task_result = _setjy_t( _pc.document['vis'], _pc.document['field'], _pc.document['spw'], _pc.document['selectdata'], _pc.document['timerange'], _pc.document['scan'], _pc.document['intent'], _pc.document['observation'], _pc.document['scalebychan'], _pc.document['standard'], _pc.document['model'], _pc.document['listmodels'], _pc.document['fluxdensity'], _pc.document['spix'], _pc.document['reffreq'], _pc.document['polindex'], _pc.document['polangle'], _pc.document['rotmeas'], _pc.document['fluxdict'], _pc.document['useephemdir'], _pc.document['interpolation'], _pc.document['usescratch'], _pc.document['ismms'] )
                  ^^^^^^^^^^^^^^^^^^^^^^^^^^^^^^^^^^^^^^^^^^^^^^^^^^^^^^^^^^^^^^^^^^^^^^^^^^^^^^^^^^^^^^^^^^^^^^^^^^^^^^^^^^^^^^^^^^^^^^^^^^^^^^^^^^^^^^^^^^^^^^^^^^^^^^^^^^^^^^^^^^^^^^^^^^^^^^^^^^^^^^^^^^^^^^^^^^^^^^^^^^^^^^^^^^^^^^^^^^^^^^^^^^^^^^^^^^^^^^^^^^^^^^^^^^^^^^^^^^^^^^^^^^^^^^^^^^^^^^^^^^^^^^^^^^^^^^^^^^^^^^^^^^^^^^^^^^^^^^^^^^^^^^^^^^^^^^^^^^^^^^^^^^^^^^^^^^^^^^^^^^^^^^^^^^^^^^^^^^^^^^^^^^^^^^^^^^^^^^^^^^^^^^^^^^^^^^^^^^^^^^^^^^^^^^^^^^^^^^^^^^^^^^^^^^^^^^^^^^^^^^^^^^^^^^^^^^^^^^^^^^^^^^^^^^^^^^^^^^^^^^^^^^^^^^^^^^^^^^^^^^^^^^^^^^^^^^^^^^^^^^^^^^^^^^^^^^^^^^^^^^^^^^^^^^^^^^^^^^^^^^^^^^^^^^^^^^^^^^^^^
../../../../venv/lib/python3.12/site-packages/casatasks/private/task_setjy.py:127: in setjy
    retval = setjy_core(vis, field, spw, selectdata, timerange,
(9 more lines...)
Collapse Failed test_task_setjy test_fluxscaleStandard.test_fluxscaleStandard1
Test Tasks Many Linux 2.28 Rocky 8.10 Py3.12 < 1 sec
RuntimeError: 2026-10-27 14:41:53	SEVERE	Imager::open() (file /source/casa6/casatools/src/code/synthesis/MeasurementEquations/Imager.cc, line 496)	Caught Exception: Measures directory specified which does not contain the IERS data: /home/casatest/data/measures
test_task_setjy.py:1820: in test_fluxscaleStandard1
    sjran = setjy(vis=self.inpms,
../../../../venv/lib/python3.12/site-packages/casatasks/setjy.py:416: in __call__
    task_result = _setjy_t( _pc.document['vis'], _pc.document['field'], _pc.document['spw'], _pc.document['selectdata'], _pc.document['timerange'], _pc.document['scan'], _pc.document['intent'], _pc.document['observation'], _pc.document['scalebychan'], _pc.document['standard'], _pc.document['model'], _pc.document['listmodels'], _pc.document['fluxdensity'], _pc.document['spix'], _pc.document['reffreq'], _pc.document['polindex'], _pc.document['polangle'], _pc.document['rotmeas'], _pc.document['fluxdict'], _pc.document['useephemdir'], _pc.document['interpolation'], _pc.document['usescratch'], _pc.document['ismms'] )
                  ^^^^^^^^^^^^^^^^^^^^^^^^^^^^^^^^^^^^^^^^^^^^^^^^^^^^^^^^^^^^^^^^^^^^^^^^^^^^^^^^^^^^^^^^^^^^^^^^^^^^^^^^^^^^^^^^^^^^^^^^^^^^^^^^^^^^^^^^^^^^^^^^^^^^^^^^^^^^^^^^^^^^^^^^^^^^^^^^^^^^^^^^^^^^^^^^^^^^^^^^^^^^^^^^^^^^^^^^^^^^^^^^^^^^^^^^^^^^^^^^^^^^^^^^^^^^^^^^^^^^^^^^^^^^^^^^^^^^^^^^^^^^^^^^^^^^^^^^^^^^^^^^^^^^^^^^^^^^^^^^^^^^^^^^^^^^^^^^^^^^^^^^^^^^^^^^^^^^^^^^^^^^^^^^^^^^^^^^^^^^^^^^^^^^^^^^^^^^^^^^^^^^^^^^^^^^^^^^^^^^^^^^^^^^^^^^^^^^^^^^^^^^^^^^^^^^^^^^^^^^^^^^^^^^^^^^^^^^^^^^^^^^^^^^^^^^^^^^^^^^^^^^^^^^^^^^^^^^^^^^^^^^^^^^^^^^^^^^^^^^^^^^^^^^^^^^^^^^^^^^^^^^^^^^^^^^^^^^^^^^^^^^^^^^^^^^^^^^^^^^^
../../../../venv/lib/python3.12/site-packages/casatasks/private/task_setjy.py:127: in setjy
    retval = setjy_core(vis, field, spw, selectdata, timerange,
(9 more lines...)
Collapse Failed test_task_setjy test_newStandards.test_PB2013
Test Tasks Many Linux 2.28 Rocky 8.10 Py3.12 < 1 sec
RuntimeError: 2026-10-27 14:41:46	SEVERE	Imager::open() (file /source/casa6/casatools/src/code/synthesis/MeasurementEquations/Imager.cc, line 496)	Caught Exception: Measures directory specified which does not contain the IERS data: /home/casatest/data/measures
test_task_setjy.py:1189: in test_PB2013
    sjran = setjy(vis=self.inpms,
../../../../venv/lib/python3.12/site-packages/casatasks/setjy.py:416: in __call__
    task_result = _setjy_t( _pc.document['vis'], _pc.document['field'], _pc.document['spw'], _pc.document['selectdata'], _pc.document['timerange'], _pc.document['scan'], _pc.document['intent'], _pc.document['observation'], _pc.document['scalebychan'], _pc.document['standard'], _pc.document['model'], _pc.document['listmodels'], _pc.document['fluxdensity'], _pc.document['spix'], _pc.document['reffreq'], _pc.document['polindex'], _pc.document['polangle'], _pc.document['rotmeas'], _pc.document['fluxdict'], _pc.document['useephemdir'], _pc.document['interpolation'], _pc.document['usescratch'], _pc.document['ismms'] )
                  ^^^^^^^^^^^^^^^^^^^^^^^^^^^^^^^^^^^^^^^^^^^^^^^^^^^^^^^^^^^^^^^^^^^^^^^^^^^^^^^^^^^^^^^^^^^^^^^^^^^^^^^^^^^^^^^^^^^^^^^^^^^^^^^^^^^^^^^^^^^^^^^^^^^^^^^^^^^^^^^^^^^^^^^^^^^^^^^^^^^^^^^^^^^^^^^^^^^^^^^^^^^^^^^^^^^^^^^^^^^^^^^^^^^^^^^^^^^^^^^^^^^^^^^^^^^^^^^^^^^^^^^^^^^^^^^^^^^^^^^^^^^^^^^^^^^^^^^^^^^^^^^^^^^^^^^^^^^^^^^^^^^^^^^^^^^^^^^^^^^^^^^^^^^^^^^^^^^^^^^^^^^^^^^^^^^^^^^^^^^^^^^^^^^^^^^^^^^^^^^^^^^^^^^^^^^^^^^^^^^^^^^^^^^^^^^^^^^^^^^^^^^^^^^^^^^^^^^^^^^^^^^^^^^^^^^^^^^^^^^^^^^^^^^^^^^^^^^^^^^^^^^^^^^^^^^^^^^^^^^^^^^^^^^^^^^^^^^^^^^^^^^^^^^^^^^^^^^^^^^^^^^^^^^^^^^^^^^^^^^^^^^^^^^^^^^^^^^^^^^^^
../../../../venv/lib/python3.12/site-packages/casatasks/private/task_setjy.py:127: in setjy
    retval = setjy_core(vis, field, spw, selectdata, timerange,
(9 more lines...)
Collapse Failed test_task_setjy test_SingleObservation.test2_SingleObservationScaleByChan
Test Tasks Many Linux 2.28 Rocky 8.10 Py3.12 < 1 sec
RuntimeError: 2026-10-27 14:41:42	SEVERE	Imager::open() (file /source/casa6/casatools/src/code/synthesis/MeasurementEquations/Imager.cc, line 496)	Caught Exception: Measures directory specified which does not contain the IERS data: /home/casatest/data/measures
test_task_setjy.py:359: in test2_SingleObservationScaleByChan
    sjran = setjy(vis=self.inpms, field='Titan', spw='', model='',
../../../../venv/lib/python3.12/site-packages/casatasks/setjy.py:416: in __call__
    task_result = _setjy_t( _pc.document['vis'], _pc.document['field'], _pc.document['spw'], _pc.document['selectdata'], _pc.document['timerange'], _pc.document['scan'], _pc.document['intent'], _pc.document['observation'], _pc.document['scalebychan'], _pc.document['standard'], _pc.document['model'], _pc.document['listmodels'], _pc.document['fluxdensity'], _pc.document['spix'], _pc.document['reffreq'], _pc.document['polindex'], _pc.document['polangle'], _pc.document['rotmeas'], _pc.document['fluxdict'], _pc.document['useephemdir'], _pc.document['interpolation'], _pc.document['usescratch'], _pc.document['ismms'] )
                  ^^^^^^^^^^^^^^^^^^^^^^^^^^^^^^^^^^^^^^^^^^^^^^^^^^^^^^^^^^^^^^^^^^^^^^^^^^^^^^^^^^^^^^^^^^^^^^^^^^^^^^^^^^^^^^^^^^^^^^^^^^^^^^^^^^^^^^^^^^^^^^^^^^^^^^^^^^^^^^^^^^^^^^^^^^^^^^^^^^^^^^^^^^^^^^^^^^^^^^^^^^^^^^^^^^^^^^^^^^^^^^^^^^^^^^^^^^^^^^^^^^^^^^^^^^^^^^^^^^^^^^^^^^^^^^^^^^^^^^^^^^^^^^^^^^^^^^^^^^^^^^^^^^^^^^^^^^^^^^^^^^^^^^^^^^^^^^^^^^^^^^^^^^^^^^^^^^^^^^^^^^^^^^^^^^^^^^^^^^^^^^^^^^^^^^^^^^^^^^^^^^^^^^^^^^^^^^^^^^^^^^^^^^^^^^^^^^^^^^^^^^^^^^^^^^^^^^^^^^^^^^^^^^^^^^^^^^^^^^^^^^^^^^^^^^^^^^^^^^^^^^^^^^^^^^^^^^^^^^^^^^^^^^^^^^^^^^^^^^^^^^^^^^^^^^^^^^^^^^^^^^^^^^^^^^^^^^^^^^^^^^^^^^^^^^^^^^^^^^^^^
../../../../venv/lib/python3.12/site-packages/casatasks/private/task_setjy.py:127: in setjy
    retval = setjy_core(vis, field, spw, selectdata, timerange,
(9 more lines...)
Collapse Failed test_task_setjy test_SingleObservation.test3_SingleObservationNewModel
Test Tasks Many Linux 2.28 Rocky 8.10 Py3.12 < 1 sec
RuntimeError: 2026-10-27 14:41:42	SEVERE	Imager::open() (file /source/casa6/casatools/src/code/synthesis/MeasurementEquations/Imager.cc, line 496)	Caught Exception: Measures directory specified which does not contain the IERS data: /home/casatest/data/measures
test_task_setjy.py:496: in test3_SingleObservationNewModel
    sjran = setjy(vis=self.inpms, field='Titan', spw='', model='',
../../../../venv/lib/python3.12/site-packages/casatasks/setjy.py:416: in __call__
    task_result = _setjy_t( _pc.document['vis'], _pc.document['field'], _pc.document['spw'], _pc.document['selectdata'], _pc.document['timerange'], _pc.document['scan'], _pc.document['intent'], _pc.document['observation'], _pc.document['scalebychan'], _pc.document['standard'], _pc.document['model'], _pc.document['listmodels'], _pc.document['fluxdensity'], _pc.document['spix'], _pc.document['reffreq'], _pc.document['polindex'], _pc.document['polangle'], _pc.document['rotmeas'], _pc.document['fluxdict'], _pc.document['useephemdir'], _pc.document['interpolation'], _pc.document['usescratch'], _pc.document['ismms'] )
                  ^^^^^^^^^^^^^^^^^^^^^^^^^^^^^^^^^^^^^^^^^^^^^^^^^^^^^^^^^^^^^^^^^^^^^^^^^^^^^^^^^^^^^^^^^^^^^^^^^^^^^^^^^^^^^^^^^^^^^^^^^^^^^^^^^^^^^^^^^^^^^^^^^^^^^^^^^^^^^^^^^^^^^^^^^^^^^^^^^^^^^^^^^^^^^^^^^^^^^^^^^^^^^^^^^^^^^^^^^^^^^^^^^^^^^^^^^^^^^^^^^^^^^^^^^^^^^^^^^^^^^^^^^^^^^^^^^^^^^^^^^^^^^^^^^^^^^^^^^^^^^^^^^^^^^^^^^^^^^^^^^^^^^^^^^^^^^^^^^^^^^^^^^^^^^^^^^^^^^^^^^^^^^^^^^^^^^^^^^^^^^^^^^^^^^^^^^^^^^^^^^^^^^^^^^^^^^^^^^^^^^^^^^^^^^^^^^^^^^^^^^^^^^^^^^^^^^^^^^^^^^^^^^^^^^^^^^^^^^^^^^^^^^^^^^^^^^^^^^^^^^^^^^^^^^^^^^^^^^^^^^^^^^^^^^^^^^^^^^^^^^^^^^^^^^^^^^^^^^^^^^^^^^^^^^^^^^^^^^^^^^^^^^^^^^^^^^^^^^^^^^
../../../../venv/lib/python3.12/site-packages/casatasks/private/task_setjy.py:127: in setjy
    retval = setjy_core(vis, field, spw, selectdata, timerange,
(9 more lines...)
Collapse Failed test_task_setjy test_setpol.testr6
Test Tasks Many Linux 2.28 Rocky 8.10 Py3.12 < 1 sec
RuntimeError: 2026-10-27 14:41:54	SEVERE	Imager::open() (file /source/casa6/casatools/src/code/synthesis/MeasurementEquations/Imager.cc, line 496)	Caught Exception: Measures directory specified which does not contain the IERS data: /home/casatest/data/measures
test_task_setjy.py:2054: in testr6
    sjran = setjy(vis=self.inpms,
../../../../venv/lib/python3.12/site-packages/casatasks/setjy.py:416: in __call__
    task_result = _setjy_t( _pc.document['vis'], _pc.document['field'], _pc.document['spw'], _pc.document['selectdata'], _pc.document['timerange'], _pc.document['scan'], _pc.document['intent'], _pc.document['observation'], _pc.document['scalebychan'], _pc.document['standard'], _pc.document['model'], _pc.document['listmodels'], _pc.document['fluxdensity'], _pc.document['spix'], _pc.document['reffreq'], _pc.document['polindex'], _pc.document['polangle'], _pc.document['rotmeas'], _pc.document['fluxdict'], _pc.document['useephemdir'], _pc.document['interpolation'], _pc.document['usescratch'], _pc.document['ismms'] )
                  ^^^^^^^^^^^^^^^^^^^^^^^^^^^^^^^^^^^^^^^^^^^^^^^^^^^^^^^^^^^^^^^^^^^^^^^^^^^^^^^^^^^^^^^^^^^^^^^^^^^^^^^^^^^^^^^^^^^^^^^^^^^^^^^^^^^^^^^^^^^^^^^^^^^^^^^^^^^^^^^^^^^^^^^^^^^^^^^^^^^^^^^^^^^^^^^^^^^^^^^^^^^^^^^^^^^^^^^^^^^^^^^^^^^^^^^^^^^^^^^^^^^^^^^^^^^^^^^^^^^^^^^^^^^^^^^^^^^^^^^^^^^^^^^^^^^^^^^^^^^^^^^^^^^^^^^^^^^^^^^^^^^^^^^^^^^^^^^^^^^^^^^^^^^^^^^^^^^^^^^^^^^^^^^^^^^^^^^^^^^^^^^^^^^^^^^^^^^^^^^^^^^^^^^^^^^^^^^^^^^^^^^^^^^^^^^^^^^^^^^^^^^^^^^^^^^^^^^^^^^^^^^^^^^^^^^^^^^^^^^^^^^^^^^^^^^^^^^^^^^^^^^^^^^^^^^^^^^^^^^^^^^^^^^^^^^^^^^^^^^^^^^^^^^^^^^^^^^^^^^^^^^^^^^^^^^^^^^^^^^^^^^^^^^^^^^^^^^^^^^^^
../../../../venv/lib/python3.12/site-packages/casatasks/private/task_setjy.py:127: in setjy
    retval = setjy_core(vis, field, spw, selectdata, timerange,
(9 more lines...)
Collapse Failed test_task_setjy test_newVLAmodelimages.test_3C138_KaBandModel
Test Tasks Many Linux 2.28 Rocky 8.10 Py3.12 < 1 sec
RuntimeError: 2026-10-27 14:41:47	SEVERE	Imager::open() (file /source/casa6/casatools/src/code/synthesis/MeasurementEquations/Imager.cc, line 496)	Caught Exception: Measures directory specified which does not contain the IERS data: /home/casatest/data/measures
test_task_setjy.py:1307: in test_3C138_KaBandModel
    sjran = setjy(vis=self.inpms,
../../../../venv/lib/python3.12/site-packages/casatasks/setjy.py:416: in __call__
    task_result = _setjy_t( _pc.document['vis'], _pc.document['field'], _pc.document['spw'], _pc.document['selectdata'], _pc.document['timerange'], _pc.document['scan'], _pc.document['intent'], _pc.document['observation'], _pc.document['scalebychan'], _pc.document['standard'], _pc.document['model'], _pc.document['listmodels'], _pc.document['fluxdensity'], _pc.document['spix'], _pc.document['reffreq'], _pc.document['polindex'], _pc.document['polangle'], _pc.document['rotmeas'], _pc.document['fluxdict'], _pc.document['useephemdir'], _pc.document['interpolation'], _pc.document['usescratch'], _pc.document['ismms'] )
                  ^^^^^^^^^^^^^^^^^^^^^^^^^^^^^^^^^^^^^^^^^^^^^^^^^^^^^^^^^^^^^^^^^^^^^^^^^^^^^^^^^^^^^^^^^^^^^^^^^^^^^^^^^^^^^^^^^^^^^^^^^^^^^^^^^^^^^^^^^^^^^^^^^^^^^^^^^^^^^^^^^^^^^^^^^^^^^^^^^^^^^^^^^^^^^^^^^^^^^^^^^^^^^^^^^^^^^^^^^^^^^^^^^^^^^^^^^^^^^^^^^^^^^^^^^^^^^^^^^^^^^^^^^^^^^^^^^^^^^^^^^^^^^^^^^^^^^^^^^^^^^^^^^^^^^^^^^^^^^^^^^^^^^^^^^^^^^^^^^^^^^^^^^^^^^^^^^^^^^^^^^^^^^^^^^^^^^^^^^^^^^^^^^^^^^^^^^^^^^^^^^^^^^^^^^^^^^^^^^^^^^^^^^^^^^^^^^^^^^^^^^^^^^^^^^^^^^^^^^^^^^^^^^^^^^^^^^^^^^^^^^^^^^^^^^^^^^^^^^^^^^^^^^^^^^^^^^^^^^^^^^^^^^^^^^^^^^^^^^^^^^^^^^^^^^^^^^^^^^^^^^^^^^^^^^^^^^^^^^^^^^^^^^^^^^^^^^^^^^^^^^
../../../../venv/lib/python3.12/site-packages/casatasks/private/task_setjy.py:127: in setjy
    retval = setjy_core(vis, field, spw, selectdata, timerange,
(9 more lines...)
Collapse Failed test_task_setjy test_ModImage.test1_UBandModelwithQBandMS
Test Tasks Many Linux 2.28 Rocky 8.10 Py3.12 1 sec
RuntimeError: 2026-10-27 14:41:45	SEVERE	Imager::open() (file /source/casa6/casatools/src/code/synthesis/MeasurementEquations/Imager.cc, line 496)	Caught Exception: Measures directory specified which does not contain the IERS data: /home/casatest/data/measures
test_task_setjy.py:1039: in test1_UBandModelwithQBandMS
    self.result[use_oldstandard] = self.run_setjy(use_oldstandard)
                                   ^^^^^^^^^^^^^^^^^^^^^^^^^^^^^^^
test_task_setjy.py:1126: in run_setjy
    record['setjyran'] = setjy(vis=self.inpms, field=self.field,
../../../../venv/lib/python3.12/site-packages/casatasks/setjy.py:416: in __call__
    task_result = _setjy_t( _pc.document['vis'], _pc.document['field'], _pc.document['spw'], _pc.document['selectdata'], _pc.document['timerange'], _pc.document['scan'], _pc.document['intent'], _pc.document['observation'], _pc.document['scalebychan'], _pc.document['standard'], _pc.document['model'], _pc.document['listmodels'], _pc.document['fluxdensity'], _pc.document['spix'], _pc.document['reffreq'], _pc.document['polindex'], _pc.document['polangle'], _pc.document['rotmeas'], _pc.document['fluxdict'], _pc.document['useephemdir'], _pc.document['interpolation'], _pc.document['usescratch'], _pc.document['ismms'] )
(12 more lines...)