Build: #183 failed
Job: Test Tools Many Linux 2.28 Rocky 8.10 Py3.12 was successful
Build log
The build generated 53,287 lines of output. The output is too long and has been truncated to the last 1,000 lines. Download or view full build log.
| 16-Oct-2026 10:08:08 | 2026-10-16 10:08:09 INFO name:: No table opened. |
| 16-Oct-2026 10:08:08 | 2026-10-16 10:08:09 INFO name:: No table opened. |
| 16-Oct-2026 10:08:08 | PASSED |
| 16-Oct-2026 10:08:08 | |
| 16-Oct-2026 10:08:08 | 2026-10-16 10:08:09 INFO FITSCoordinateUtil::fromFITSHeader Neither SPECSYS nor VELREF keyword given, spectral reference frame not defined ... |
| 16-Oct-2026 10:08:08 | 2026-10-16 10:08:09 INFO ImageRegion::fromRecord Selected bounding box : |
| 16-Oct-2026 10:08:08 | 2026-10-16 10:08:09 INFO ImageRegion::fromRecord+ [0, 0, 0, 0] to [2, 2, 2, 2] (04:46:00.576, +44.50.12.522, 4.7351e+09Hz, I to 04:46:00.520, +44.50.13.123, 5.5351e+09Hz, U) |
| 16-Oct-2026 10:08:08 | 2026-10-16 10:08:09 INFO FITSCoordinateUtil::fromFITSHeader Neither SPECSYS nor VELREF keyword given, spectral reference frame not defined ... |
| 16-Oct-2026 10:08:08 | test_tool_image_collapse.py::ia_collapse_test::test_4 |
| 16-Oct-2026 10:08:08 | ia.collapse(): not specifying an output image is ok |
| 16-Oct-2026 10:08:08 | 2026-10-16 10:08:09 INFO name:: No table opened. |
| 16-Oct-2026 10:08:08 | 2026-10-16 10:08:09 INFO showcache:: The Table Cache is empty. |
| 16-Oct-2026 10:08:08 | 2026-10-16 10:08:09 INFO name:: No table opened. |
| 16-Oct-2026 10:08:08 | 2026-10-16 10:08:09 INFO name:: No table opened. |
| 16-Oct-2026 10:08:08 | PASSED |
| 16-Oct-2026 10:08:08 | |
| 16-Oct-2026 10:08:08 | 2026-10-16 10:08:09 INFO FITSCoordinateUtil::fromFITSHeader Neither SPECSYS nor VELREF keyword given, spectral reference frame not defined ... |
| 16-Oct-2026 10:08:08 | 2026-10-16 10:08:09 INFO ImageRegion::fromRecord Selected bounding box : |
| 16-Oct-2026 10:08:08 | 2026-10-16 10:08:09 INFO ImageRegion::fromRecord+ [0, 0, 0, 0] to [2, 2, 2, 2] (04:46:00.576, +44.50.12.522, 4.7351e+09Hz, I to 04:46:00.520, +44.50.13.123, 5.5351e+09Hz, U) |
| 16-Oct-2026 10:08:08 | 2026-10-16 10:08:09 INFO ImageRegion::fromRecord Selected bounding box : |
| 16-Oct-2026 10:08:08 | 2026-10-16 10:08:09 INFO ImageRegion::fromRecord+ [0, 0, 0, 0] to [2, 2, 0, 2] (04:46:00.576, +44.50.12.522, 5.1351e+09Hz, I to 04:46:00.520, +44.50.13.123, 5.1351e+09Hz, U) |
| 16-Oct-2026 10:08:08 | test_tool_image_collapse.py::ia_collapse_test::test_6 |
| 16-Oct-2026 10:08:08 | ia.collapse(): memory only images can be collapsed |
| 16-Oct-2026 10:08:08 | 2026-10-16 10:08:09 INFO name:: No table opened. |
| 16-Oct-2026 10:08:08 | 2026-10-16 10:08:09 INFO showcache:: The Table Cache is empty. |
| 16-Oct-2026 10:08:08 | 2026-10-16 10:08:09 INFO name:: No table opened. |
| 16-Oct-2026 10:08:08 | 2026-10-16 10:08:09 INFO name:: No table opened. |
| 16-Oct-2026 10:08:08 | PASSED |
| 16-Oct-2026 10:08:08 | |
| 16-Oct-2026 10:08:08 | 2026-10-16 10:08:09 INFO FITSCoordinateUtil::fromFITSHeader Neither SPECSYS nor VELREF keyword given, spectral reference frame not defined ... |
| 16-Oct-2026 10:08:08 | 2026-10-16 10:08:09 INFO ImageRegion::fromRecord Selected bounding box : |
| 16-Oct-2026 10:08:08 | 2026-10-16 10:08:09 INFO ImageRegion::fromRecord+ [0, 0, 0, 0] to [2, 2, 2, 2] (04:46:00.576, +44.50.12.522, 4.7351e+09Hz, I to 04:46:00.520, +44.50.13.123, 5.5351e+09Hz, U) |
| 16-Oct-2026 10:08:08 | 2026-10-16 10:08:09 INFO FITSCoordinateUtil::fromFITSHeader Neither SPECSYS nor VELREF keyword given, spectral reference frame not defined ... |
| 16-Oct-2026 10:08:08 | 2026-10-16 10:08:09 INFO FITSCoordinateUtil::fromFITSHeader Neither SPECSYS nor VELREF keyword given, spectral reference frame not defined ... |
| 16-Oct-2026 10:08:08 | 2026-10-16 10:08:09 INFO ImageRegion::fromRecord Selected bounding box : |
| 16-Oct-2026 10:08:08 | 2026-10-16 10:08:09 INFO ImageRegion::fromRecord+ [0, 0, 0, 0] to [2, 2, 2, 2] (04:46:00.576, +44.50.12.522, 4.7351e+09Hz, I to 04:46:00.520, +44.50.13.123, 5.5351e+09Hz, U) |
| 16-Oct-2026 10:08:08 | 2026-10-16 10:08:09 INFO FITSCoordinateUtil::fromFITSHeader Neither SPECSYS nor VELREF keyword given, spectral reference frame not defined ... |
| 16-Oct-2026 10:08:08 | 2026-10-16 10:08:09 INFO FITSCoordinateUtil::fromFITSHeader Neither SPECSYS nor VELREF keyword given, spectral reference frame not defined ... |
| 16-Oct-2026 10:08:08 | 2026-10-16 10:08:09 INFO ImageRegion::fromRecord Selected bounding box : |
| 16-Oct-2026 10:08:08 | 2026-10-16 10:08:09 INFO ImageRegion::fromRecord+ [0, 0, 0, 0] to [2, 2, 2, 2] (04:46:00.576, +44.50.12.522, 4.7351e+09Hz, I to 04:46:00.520, +44.50.13.123, 5.5351e+09Hz, U) |
| 16-Oct-2026 10:08:08 | 2026-10-16 10:08:09 INFO FITSCoordinateUtil::fromFITSHeader Neither SPECSYS nor VELREF keyword given, spectral reference frame not defined ... |
| 16-Oct-2026 10:08:08 | test_tool_image_collapse.py::ia_collapse_test::test_7 |
| 16-Oct-2026 10:08:08 | ia.collapse(): verify collapsing along multiple axes works |
| 16-Oct-2026 10:08:08 | 2026-10-16 10:08:09 INFO name:: No table opened. |
| 16-Oct-2026 10:08:08 | 2026-10-16 10:08:09 INFO showcache:: The Table Cache is empty. |
| 16-Oct-2026 10:08:08 | 2026-10-16 10:08:09 INFO name:: No table opened. |
| 16-Oct-2026 10:08:08 | 2026-10-16 10:08:09 INFO name:: No table opened. |
| 16-Oct-2026 10:08:08 | PASSED |
| 16-Oct-2026 10:08:08 | |
| 16-Oct-2026 10:08:08 | 2026-10-16 10:08:09 INFO FITSCoordinateUtil::fromFITSHeader Neither SPECSYS nor VELREF keyword given, spectral reference frame not defined ... |
| 16-Oct-2026 10:08:08 | 2026-10-16 10:08:09 INFO ImageFITSConverterImpl::FITSToImage Created image of shape [3, 3, 3, 3] |
| 16-Oct-2026 10:08:08 | 2026-10-16 10:08:09 INFO ImageFITSConverterImpl::FITSToImage Copy FITS file to '/home/casatest/casa6/casatestutils/nosedir/test_tool_image_collapse/collapse_in.im' All pixels fit in memory (81 pixels). |
| 16-Oct-2026 10:08:08 | 2026-10-16 10:08:09 INFO ImageMaskHandler::_calcmask Created mask `mask0' |
| 16-Oct-2026 10:08:08 | 2026-10-16 10:08:09 INFO ImageRegion::fromRecord Selected bounding box : |
| 16-Oct-2026 10:08:08 | 2026-10-16 10:08:09 INFO ImageRegion::fromRecord+ [0, 0, 0, 0] to [2, 2, 2, 2] (04:46:00.576, +44.50.12.522, 4.7351e+09Hz, I to 04:46:00.520, +44.50.13.123, 5.5351e+09Hz, U) |
| 16-Oct-2026 10:08:08 | 2026-10-16 10:08:09 INFO ImageMaskAttacher::makeMask Created mask `mask0' |
| 16-Oct-2026 10:08:08 | 2026-10-16 10:08:09 INFO ImageRegion::fromRecord Selected bounding box : |
| 16-Oct-2026 10:08:08 | 2026-10-16 10:08:09 INFO ImageRegion::fromRecord+ [0, 0, 0, 0] to [2, 2, 2, 2] (04:46:00.576, +44.50.12.522, 4.7351e+09Hz, I to 04:46:00.520, +44.50.13.123, 5.5351e+09Hz, U) |
| 16-Oct-2026 10:08:08 | 2026-10-16 10:08:09 INFO SubImageFactory::createImage Creating image 'test_8_0mean' of shape [3, 3, 3, 1] |
| 16-Oct-2026 10:08:08 | 2026-10-16 10:08:09 INFO ImageMaskAttacher::makeMask Created mask `mask0' |
| 16-Oct-2026 10:08:09 | 2026-10-16 10:08:09 INFO ImageRegion::fromRecord Selected bounding box : |
| 16-Oct-2026 10:08:09 | 2026-10-16 10:08:09 INFO ImageRegion::fromRecord+ [0, 0, 0, 0] to [2, 2, 2, 2] (04:46:00.576, +44.50.12.522, 4.7351e+09Hz, I to 04:46:00.520, +44.50.13.123, 5.5351e+09Hz, U) |
| 16-Oct-2026 10:08:09 | 2026-10-16 10:08:09 INFO ImageMaskAttacher::makeMask Created mask `mask0' |
| 16-Oct-2026 10:08:09 | 2026-10-16 10:08:09 INFO ImageRegion::fromRecord Selected bounding box : |
| 16-Oct-2026 10:08:09 | 2026-10-16 10:08:09 INFO ImageRegion::fromRecord+ [0, 0, 0, 0] to [2, 2, 2, 2] (04:46:00.576, +44.50.12.522, 4.7351e+09Hz, I to 04:46:00.520, +44.50.13.123, 5.5351e+09Hz, U) |
| 16-Oct-2026 10:08:09 | 2026-10-16 10:08:09 INFO SubImageFactory::createImage Creating image 'test_8_0median' of shape [3, 3, 3, 1] |
| 16-Oct-2026 10:08:09 | 2026-10-16 10:08:09 INFO ImageMaskAttacher::makeMask Created mask `mask0' |
| 16-Oct-2026 10:08:09 | 2026-10-16 10:08:09 INFO ImageRegion::fromRecord Selected bounding box : |
| 16-Oct-2026 10:08:09 | 2026-10-16 10:08:09 INFO ImageRegion::fromRecord+ [0, 0, 0, 0] to [2, 2, 2, 2] (04:46:00.576, +44.50.12.522, 4.7351e+09Hz, I to 04:46:00.520, +44.50.13.123, 5.5351e+09Hz, U) |
| 16-Oct-2026 10:08:09 | 2026-10-16 10:08:09 INFO ImageMaskAttacher::makeMask Created mask `mask0' |
| 16-Oct-2026 10:08:09 | 2026-10-16 10:08:09 INFO ImageRegion::fromRecord Selected bounding box : |
| 16-Oct-2026 10:08:09 | 2026-10-16 10:08:09 INFO ImageRegion::fromRecord+ [0, 0, 0, 0] to [2, 2, 2, 2] (04:46:00.576, +44.50.12.522, 4.7351e+09Hz, I to 04:46:00.520, +44.50.13.123, 5.5351e+09Hz, U) |
| 16-Oct-2026 10:08:09 | 2026-10-16 10:08:09 INFO SubImageFactory::createImage Creating image 'test_8_1mean' of shape [3, 3, 3, 1] |
| 16-Oct-2026 10:08:09 | 2026-10-16 10:08:09 INFO ImageMaskAttacher::makeMask Created mask `mask0' |
| 16-Oct-2026 10:08:09 | 2026-10-16 10:08:09 INFO ImageRegion::fromRecord Selected bounding box : |
| 16-Oct-2026 10:08:09 | 2026-10-16 10:08:09 INFO ImageRegion::fromRecord+ [0, 0, 0, 0] to [2, 2, 2, 2] (04:46:00.576, +44.50.12.522, 4.7351e+09Hz, I to 04:46:00.520, +44.50.13.123, 5.5351e+09Hz, U) |
| 16-Oct-2026 10:08:09 | 2026-10-16 10:08:09 INFO ImageMaskAttacher::makeMask Created mask `mask0' |
| 16-Oct-2026 10:08:09 | 2026-10-16 10:08:09 INFO ImageRegion::fromRecord Selected bounding box : |
| 16-Oct-2026 10:08:09 | 2026-10-16 10:08:09 INFO ImageRegion::fromRecord+ [0, 0, 0, 0] to [2, 2, 2, 2] (04:46:00.576, +44.50.12.522, 4.7351e+09Hz, I to 04:46:00.520, +44.50.13.123, 5.5351e+09Hz, U) |
| 16-Oct-2026 10:08:09 | 2026-10-16 10:08:09 INFO SubImageFactory::createImage Creating image 'test_8_1median' of shape [3, 3, 3, 1] |
| 16-Oct-2026 10:08:09 | 2026-10-16 10:08:09 INFO ImageMaskAttacher::makeMask Created mask `mask0' |
| 16-Oct-2026 10:08:09 | 2026-10-16 10:08:09 INFO ImageRegion::fromRecord Selected bounding box : |
| 16-Oct-2026 10:08:09 | 2026-10-16 10:08:09 INFO ImageRegion::fromRecord+ [0, 0, 0, 0] to [2, 2, 2, 2] (04:46:00.576, +44.50.12.522, 4.7351e+09Hz, I to 04:46:00.520, +44.50.13.123, 5.5351e+09Hz, U) |
| 16-Oct-2026 10:08:09 | 2026-10-16 10:08:09 INFO ImageMaskAttacher::makeMask Created mask `mask0' |
| 16-Oct-2026 10:08:09 | 2026-10-16 10:08:09 INFO ImageRegion::fromRecord Selected bounding box : |
| 16-Oct-2026 10:08:09 | 2026-10-16 10:08:09 INFO ImageRegion::fromRecord+ [0, 0, 0, 0] to [2, 2, 2, 2] (04:46:00.576, +44.50.12.522, 4.7351e+09Hz, I to 04:46:00.520, +44.50.13.123, 5.5351e+09Hz, U) |
| 16-Oct-2026 10:08:09 | 2026-10-16 10:08:09 INFO SubImageFactory::createImage Creating image 'test_8_2mean' of shape [3, 3, 3, 1] |
| 16-Oct-2026 10:08:09 | 2026-10-16 10:08:09 INFO ImageMaskAttacher::makeMask Created mask `mask0' |
| 16-Oct-2026 10:08:09 | 2026-10-16 10:08:10 INFO ImageRegion::fromRecord Selected bounding box : |
| 16-Oct-2026 10:08:09 | 2026-10-16 10:08:10 INFO ImageRegion::fromRecord+ [0, 0, 0, 0] to [2, 2, 2, 2] (04:46:00.576, +44.50.12.522, 4.7351e+09Hz, I to 04:46:00.520, +44.50.13.123, 5.5351e+09Hz, U) |
| 16-Oct-2026 10:08:09 | 2026-10-16 10:08:10 INFO ImageMaskAttacher::makeMask Created mask `mask0' |
| 16-Oct-2026 10:08:09 | 2026-10-16 10:08:10 INFO ImageRegion::fromRecord Selected bounding box : |
| 16-Oct-2026 10:08:09 | 2026-10-16 10:08:10 INFO ImageRegion::fromRecord+ [0, 0, 0, 0] to [2, 2, 2, 2] (04:46:00.576, +44.50.12.522, 4.7351e+09Hz, I to 04:46:00.520, +44.50.13.123, 5.5351e+09Hz, U) |
| 16-Oct-2026 10:08:09 | 2026-10-16 10:08:10 INFO SubImageFactory::createImage Creating image 'test_8_2median' of shape [3, 3, 3, 1] |
| 16-Oct-2026 10:08:09 | 2026-10-16 10:08:10 INFO ImageMaskAttacher::makeMask Created mask `mask0' |
| 16-Oct-2026 10:08:09 | 2026-10-16 10:08:10 INFO name:: No table opened. |
| 16-Oct-2026 10:08:09 | 2026-10-16 10:08:10 INFO showcache:: The Table Cache is empty. |
| 16-Oct-2026 10:08:09 | 2026-10-16 10:08:10 INFO name:: No table opened. |
| 16-Oct-2026 10:08:09 | 2026-10-16 10:08:10 INFO name:: No table opened. |
| 16-Oct-2026 10:08:09 | test_tool_image_collapse.py::ia_collapse_test::test_8 |
| 16-Oct-2026 10:08:09 | ia.collapse(): test both OTF and permanent masking works |
| 16-Oct-2026 10:08:09 | PASSED |
| 16-Oct-2026 10:08:09 | |
| 16-Oct-2026 10:08:09 | 2026-10-16 10:08:10 INFO ImageRegion::fromRecord Selected bounding box : |
| 16-Oct-2026 10:08:09 | 2026-10-16 10:08:10 INFO ImageRegion::fromRecord+ [0, 0, 2445] to [2, 2, 2555] (02:00:00.000, +30.00.00.000, 9.99142e+13Hz to 02:00:00.154, +30.00.02.000, 9.67228e+13Hz) |
| 16-Oct-2026 10:08:09 | 2026-10-16 10:08:10 INFO AsciiRegionFileParser::_parse Combined 1 image regions (which excludes any annotation regions) |
| 16-Oct-2026 10:08:09 | 2026-10-16 10:08:10 INFO AsciiRegionFileParser::_parse The specified region will select all pixels that are included in the region. Full pixels will be included even when they are only partially covered by the region(s). |
| 16-Oct-2026 10:08:09 | 2026-10-16 10:08:10 INFO ImageRegion::fromRecord Selected bounding box : |
| 16-Oct-2026 10:08:09 | 2026-10-16 10:08:10 INFO ImageRegion::fromRecord+ [0, 0, 2445] to [2, 2, 2555] (02:00:00.000, +30.00.00.000, 9.99142e+13Hz to 02:00:00.154, +30.00.02.000, 9.67228e+13Hz) |
| 16-Oct-2026 10:08:09 | test_tool_image_collapse.py::ia_collapse_test::test_CAS3737 |
| 16-Oct-2026 10:08:09 | ia.collapse(): test tabular spectral axis has correct collapsed reference value |
| 16-Oct-2026 10:08:09 | 2026-10-16 10:08:10 INFO name:: No table opened. |
| 16-Oct-2026 10:08:09 | 2026-10-16 10:08:10 INFO showcache:: The Table Cache is empty. |
| 16-Oct-2026 10:08:09 | 2026-10-16 10:08:10 INFO name:: No table opened. |
| 16-Oct-2026 10:08:09 | 2026-10-16 10:08:10 INFO name:: No table opened. |
| 16-Oct-2026 10:08:09 | PASSED |
| 16-Oct-2026 10:08:09 | |
| 16-Oct-2026 10:08:09 | 2026-10-16 10:08:10 INFO FITSCoordinateUtil::fromFITSHeader Neither SPECSYS nor VELREF keyword given, spectral reference frame not defined ... |
| 16-Oct-2026 10:08:09 | 2026-10-16 10:08:10 INFO FITSCoordinateUtil::fromFITSHeader Neither SPECSYS nor VELREF keyword given, spectral reference frame not defined ... |
| 16-Oct-2026 10:08:09 | 2026-10-16 10:08:10 INFO ImageRegion::fromRecord Selected bounding box : |
| 16-Oct-2026 10:08:09 | 2026-10-16 10:08:10 INFO ImageRegion::fromRecord+ [0, 0, 0, 0] to [2, 2, 2, 2] (04:46:00.576, +44.50.12.522, 4.7351e+09Hz, I to 04:46:00.520, +44.50.13.123, 5.5351e+09Hz, U) |
| 16-Oct-2026 10:08:09 | 2026-10-16 10:08:10 INFO ImageRegion::fromRecord Selected bounding box : |
| 16-Oct-2026 10:08:09 | 2026-10-16 10:08:10 INFO ImageRegion::fromRecord+ [0, 0, 0, 0] to [0, 2, 2, 2] (04:46:00.548, +44.50.12.750, 4.7351e+09Hz, I to 04:46:00.548, +44.50.13.350, 5.5351e+09Hz, U) |
| 16-Oct-2026 10:08:09 | 2026-10-16 10:08:10 INFO FITSCoordinateUtil::fromFITSHeader Neither SPECSYS nor VELREF keyword given, spectral reference frame not defined ... |
| 16-Oct-2026 10:08:09 | 2026-10-16 10:08:10 INFO FITSCoordinateUtil::fromFITSHeader Neither SPECSYS nor VELREF keyword given, spectral reference frame not defined ... |
| 16-Oct-2026 10:08:09 | 2026-10-16 10:08:10 INFO ImageRegion::fromRecord Selected bounding box : |
| 16-Oct-2026 10:08:09 | 2026-10-16 10:08:10 INFO ImageRegion::fromRecord+ [0, 0, 0, 0] to [2, 2, 2, 2] (04:46:00.576, +44.50.12.522, 4.7351e+09Hz, I to 04:46:00.520, +44.50.13.123, 5.5351e+09Hz, U) |
| 16-Oct-2026 10:08:09 | 2026-10-16 10:08:10 INFO ImageRegion::fromRecord Selected bounding box : |
| 16-Oct-2026 10:08:09 | 2026-10-16 10:08:10 INFO ImageRegion::fromRecord+ [0, 0, 0, 0] to [2, 0, 2, 2] (04:46:00.576, +44.50.12.595, 4.7351e+09Hz, I to 04:46:00.520, +44.50.12.596, 5.5351e+09Hz, U) |
| 16-Oct-2026 10:08:09 | 2026-10-16 10:08:10 INFO FITSCoordinateUtil::fromFITSHeader Neither SPECSYS nor VELREF keyword given, spectral reference frame not defined ... |
| 16-Oct-2026 10:08:09 | 2026-10-16 10:08:10 INFO FITSCoordinateUtil::fromFITSHeader Neither SPECSYS nor VELREF keyword given, spectral reference frame not defined ... |
| 16-Oct-2026 10:08:09 | 2026-10-16 10:08:10 INFO ImageRegion::fromRecord Selected bounding box : |
| 16-Oct-2026 10:08:09 | 2026-10-16 10:08:10 INFO ImageRegion::fromRecord+ [0, 0, 0, 0] to [2, 2, 2, 2] (04:46:00.576, +44.50.12.522, 4.7351e+09Hz, I to 04:46:00.520, +44.50.13.123, 5.5351e+09Hz, U) |
| 16-Oct-2026 10:08:09 | 2026-10-16 10:08:10 INFO ImageRegion::fromRecord Selected bounding box : |
| 16-Oct-2026 10:08:09 | 2026-10-16 10:08:10 INFO ImageRegion::fromRecord+ [0, 0, 0, 0] to [2, 2, 0, 2] (04:46:00.576, +44.50.12.522, 5.1351e+09Hz, I to 04:46:00.520, +44.50.13.123, 5.1351e+09Hz, U) |
| 16-Oct-2026 10:08:09 | 2026-10-16 10:08:10 INFO FITSCoordinateUtil::fromFITSHeader Neither SPECSYS nor VELREF keyword given, spectral reference frame not defined ... |
| 16-Oct-2026 10:08:09 | 2026-10-16 10:08:10 INFO FITSCoordinateUtil::fromFITSHeader Neither SPECSYS nor VELREF keyword given, spectral reference frame not defined ... |
| 16-Oct-2026 10:08:09 | 2026-10-16 10:08:10 INFO ImageRegion::fromRecord Selected bounding box : |
| 16-Oct-2026 10:08:09 | 2026-10-16 10:08:10 INFO ImageRegion::fromRecord+ [0, 0, 0, 0] to [2, 2, 2, 2] (04:46:00.576, +44.50.12.522, 4.7351e+09Hz, I to 04:46:00.520, +44.50.13.123, 5.5351e+09Hz, U) |
| 16-Oct-2026 10:08:09 | 2026-10-16 10:08:10 INFO ImageRegion::fromRecord Selected bounding box : |
| 16-Oct-2026 10:08:09 | 2026-10-16 10:08:10 INFO ImageRegion::fromRecord+ [0, 0, 0, 0] to [2, 2, 2, 0] (04:46:00.576, +44.50.12.522, 4.7351e+09Hz, I to 04:46:00.520, +44.50.13.123, 5.5351e+09Hz, I) |
| 16-Oct-2026 10:08:09 | test_tool_image_collapse.py::ia_collapse_test::test_CAS_3418 |
| 16-Oct-2026 10:08:09 | ia.collapse(): Test separate code for median due to performance issues |
| 16-Oct-2026 10:08:09 | 2026-10-16 10:08:10 INFO name:: No table opened. |
| 16-Oct-2026 10:08:09 | 2026-10-16 10:08:10 INFO showcache:: The Table Cache is empty. |
| 16-Oct-2026 10:08:09 | 2026-10-16 10:08:10 INFO name:: No table opened. |
| 16-Oct-2026 10:08:09 | 2026-10-16 10:08:10 INFO name:: No table opened. |
| 16-Oct-2026 10:08:09 | PASSED |
| 16-Oct-2026 10:08:09 | |
| 16-Oct-2026 10:08:09 | 2026-10-16 10:08:10 INFO ImageFactory::createImage Created Temp image of shape [10, 10, 10, 4] with float valued pixels. |
| 16-Oct-2026 10:08:09 | 2026-10-16 10:08:10 INFO image::_casaQuantityFromVar Will use values specified in major, minor, pa to set beam |
| 16-Oct-2026 10:08:09 | 2026-10-16 10:08:10 INFO BeamManipulator::set This image currently has no beams of any kind. Since channel and/or polarization were specified, a set of per plane beams, each equal to the specified beam, will be created. |
| 16-Oct-2026 10:08:09 | 2026-10-16 10:08:10 INFO BeamManipulator::set Beam parameters: Major : 4 arcsec |
| 16-Oct-2026 10:08:09 | 2026-10-16 10:08:10 INFO BeamManipulator::set+ Minor : 3 arcsec |
| 16-Oct-2026 10:08:09 | 2026-10-16 10:08:10 INFO BeamManipulator::set+ Position Angle : 20 deg |
| 16-Oct-2026 10:08:09 | 2026-10-16 10:08:10 INFO image::_casaQuantityFromVar Will use values specified in major, minor, pa to set beam |
| 16-Oct-2026 10:08:09 | 2026-10-16 10:08:10 INFO BeamManipulator::set Beam parameters: Major : 4 arcsec |
| 16-Oct-2026 10:08:09 | 2026-10-16 10:08:10 INFO BeamManipulator::set+ Minor : 2 arcsec |
| 16-Oct-2026 10:08:09 | 2026-10-16 10:08:10 INFO BeamManipulator::set+ Position Angle : 0 deg |
| 16-Oct-2026 10:08:09 | 2026-10-16 10:08:10 INFO image::_casaQuantityFromVar Will use values specified in major, minor, pa to set beam |
| 16-Oct-2026 10:08:09 | 2026-10-16 10:08:10 INFO BeamManipulator::set Beam parameters: Major : 5 arcsec |
| 16-Oct-2026 10:08:09 | 2026-10-16 10:08:10 INFO BeamManipulator::set+ Minor : 2.5 arcsec |
| 16-Oct-2026 10:08:09 | 2026-10-16 10:08:10 INFO BeamManipulator::set+ Position Angle : 1 deg |
| 16-Oct-2026 10:08:09 | 2026-10-16 10:08:10 INFO image::_casaQuantityFromVar Will use values specified in major, minor, pa to set beam |
| 16-Oct-2026 10:08:09 | 2026-10-16 10:08:10 INFO BeamManipulator::set Beam parameters: Major : 6 arcsec |
| 16-Oct-2026 10:08:09 | 2026-10-16 10:08:10 INFO BeamManipulator::set+ Minor : 3 arcsec |
| 16-Oct-2026 10:08:09 | 2026-10-16 10:08:10 INFO BeamManipulator::set+ Position Angle : 2 deg |
| 16-Oct-2026 10:08:09 | 2026-10-16 10:08:10 INFO image::_casaQuantityFromVar Will use values specified in major, minor, pa to set beam |
| 16-Oct-2026 10:08:09 | 2026-10-16 10:08:10 INFO BeamManipulator::set Beam parameters: Major : 7 arcsec |
| 16-Oct-2026 10:08:09 | 2026-10-16 10:08:10 INFO BeamManipulator::set+ Minor : 3.5 arcsec |
| 16-Oct-2026 10:08:09 | 2026-10-16 10:08:10 INFO BeamManipulator::set+ Position Angle : 3 deg |
| 16-Oct-2026 10:08:09 | 2026-10-16 10:08:10 INFO image::_casaQuantityFromVar Will use values specified in major, minor, pa to set beam |
| 16-Oct-2026 10:08:09 | 2026-10-16 10:08:10 INFO BeamManipulator::set Beam parameters: Major : 5 arcsec |
| 16-Oct-2026 10:08:09 | 2026-10-16 10:08:10 INFO BeamManipulator::set+ Minor : 3 arcsec |
| 16-Oct-2026 10:08:09 | 2026-10-16 10:08:10 INFO BeamManipulator::set+ Position Angle : 10 deg |
| 16-Oct-2026 10:08:09 | 2026-10-16 10:08:10 INFO image::_casaQuantityFromVar Will use values specified in major, minor, pa to set beam |
| 16-Oct-2026 10:08:09 | 2026-10-16 10:08:10 INFO BeamManipulator::set Beam parameters: Major : 6 arcsec |
| 16-Oct-2026 10:08:09 | 2026-10-16 10:08:10 INFO BeamManipulator::set+ Minor : 3.5 arcsec |
| 16-Oct-2026 10:08:09 | 2026-10-16 10:08:10 INFO BeamManipulator::set+ Position Angle : 11 deg |
| 16-Oct-2026 10:08:09 | 2026-10-16 10:08:10 INFO image::_casaQuantityFromVar Will use values specified in major, minor, pa to set beam |
| 16-Oct-2026 10:08:09 | 2026-10-16 10:08:10 INFO BeamManipulator::set Beam parameters: Major : 7 arcsec |
| 16-Oct-2026 10:08:09 | 2026-10-16 10:08:10 INFO BeamManipulator::set+ Minor : 4 arcsec |
| 16-Oct-2026 10:08:09 | 2026-10-16 10:08:10 INFO BeamManipulator::set+ Position Angle : 12 deg |
| 16-Oct-2026 10:08:09 | 2026-10-16 10:08:10 INFO image::_casaQuantityFromVar Will use values specified in major, minor, pa to set beam |
| 16-Oct-2026 10:08:09 | 2026-10-16 10:08:10 INFO BeamManipulator::set Beam parameters: Major : 8 arcsec |
| 16-Oct-2026 10:08:09 | 2026-10-16 10:08:10 INFO BeamManipulator::set+ Minor : 4.5 arcsec |
| 16-Oct-2026 10:08:09 | 2026-10-16 10:08:10 INFO BeamManipulator::set+ Position Angle : 13 deg |
| 16-Oct-2026 10:08:09 | 2026-10-16 10:08:10 INFO image::_casaQuantityFromVar Will use values specified in major, minor, pa to set beam |
| 16-Oct-2026 10:08:09 | 2026-10-16 10:08:10 INFO BeamManipulator::set Beam parameters: Major : 6 arcsec |
| 16-Oct-2026 10:08:09 | 2026-10-16 10:08:10 INFO BeamManipulator::set+ Minor : 4 arcsec |
| 16-Oct-2026 10:08:09 | 2026-10-16 10:08:10 INFO BeamManipulator::set+ Position Angle : 20 deg |
| 16-Oct-2026 10:08:09 | 2026-10-16 10:08:10 INFO image::_casaQuantityFromVar Will use values specified in major, minor, pa to set beam |
| 16-Oct-2026 10:08:09 | 2026-10-16 10:08:10 INFO BeamManipulator::set Beam parameters: Major : 7 arcsec |
| 16-Oct-2026 10:08:09 | 2026-10-16 10:08:10 INFO BeamManipulator::set+ Minor : 4.5 arcsec |
| 16-Oct-2026 10:08:09 | 2026-10-16 10:08:10 INFO BeamManipulator::set+ Position Angle : 21 deg |
| 16-Oct-2026 10:08:09 | 2026-10-16 10:08:10 INFO image::_casaQuantityFromVar Will use values specified in major, minor, pa to set beam |
| 16-Oct-2026 10:08:09 | 2026-10-16 10:08:10 INFO BeamManipulator::set Beam parameters: Major : 8 arcsec |
| 16-Oct-2026 10:08:09 | 2026-10-16 10:08:10 INFO BeamManipulator::set+ Minor : 5 arcsec |
| 16-Oct-2026 10:08:09 | 2026-10-16 10:08:10 INFO BeamManipulator::set+ Position Angle : 22 deg |
| 16-Oct-2026 10:08:09 | 2026-10-16 10:08:10 INFO image::_casaQuantityFromVar Will use values specified in major, minor, pa to set beam |
| 16-Oct-2026 10:08:09 | 2026-10-16 10:08:10 INFO BeamManipulator::set Beam parameters: Major : 9 arcsec |
| 16-Oct-2026 10:08:09 | 2026-10-16 10:08:10 INFO BeamManipulator::set+ Minor : 5.5 arcsec |
| 16-Oct-2026 10:08:09 | 2026-10-16 10:08:10 INFO BeamManipulator::set+ Position Angle : 23 deg |
| 16-Oct-2026 10:08:09 | 2026-10-16 10:08:10 INFO image::_casaQuantityFromVar Will use values specified in major, minor, pa to set beam |
| 16-Oct-2026 10:08:09 | 2026-10-16 10:08:10 INFO BeamManipulator::set Beam parameters: Major : 7 arcsec |
| 16-Oct-2026 10:08:09 | 2026-10-16 10:08:10 INFO BeamManipulator::set+ Minor : 5 arcsec |
| 16-Oct-2026 10:08:09 | 2026-10-16 10:08:10 INFO BeamManipulator::set+ Position Angle : 30 deg |
| 16-Oct-2026 10:08:09 | 2026-10-16 10:08:10 INFO image::_casaQuantityFromVar Will use values specified in major, minor, pa to set beam |
| 16-Oct-2026 10:08:09 | 2026-10-16 10:08:10 INFO BeamManipulator::set Beam parameters: Major : 8 arcsec |
| 16-Oct-2026 10:08:09 | 2026-10-16 10:08:10 INFO BeamManipulator::set+ Minor : 5.5 arcsec |
| 16-Oct-2026 10:08:09 | 2026-10-16 10:08:10 INFO BeamManipulator::set+ Position Angle : 31 deg |
| 16-Oct-2026 10:08:09 | 2026-10-16 10:08:10 INFO image::_casaQuantityFromVar Will use values specified in major, minor, pa to set beam |
| 16-Oct-2026 10:08:09 | 2026-10-16 10:08:10 INFO BeamManipulator::set Beam parameters: Major : 9 arcsec |
| 16-Oct-2026 10:08:09 | 2026-10-16 10:08:10 INFO BeamManipulator::set+ Minor : 6 arcsec |
| 16-Oct-2026 10:08:09 | 2026-10-16 10:08:10 INFO BeamManipulator::set+ Position Angle : 32 deg |
| 16-Oct-2026 10:08:09 | 2026-10-16 10:08:10 INFO image::_casaQuantityFromVar Will use values specified in major, minor, pa to set beam |
| 16-Oct-2026 10:08:09 | 2026-10-16 10:08:10 INFO BeamManipulator::set Beam parameters: Major : 10 arcsec |
| 16-Oct-2026 10:08:09 | 2026-10-16 10:08:10 INFO BeamManipulator::set+ Minor : 6.5 arcsec |
| 16-Oct-2026 10:08:09 | 2026-10-16 10:08:10 INFO BeamManipulator::set+ Position Angle : 33 deg |
| 16-Oct-2026 10:08:09 | 2026-10-16 10:08:10 INFO image::_casaQuantityFromVar Will use values specified in major, minor, pa to set beam |
| 16-Oct-2026 10:08:09 | 2026-10-16 10:08:10 INFO BeamManipulator::set Beam parameters: Major : 8 arcsec |
| 16-Oct-2026 10:08:09 | 2026-10-16 10:08:10 INFO BeamManipulator::set+ Minor : 6 arcsec |
| 16-Oct-2026 10:08:09 | 2026-10-16 10:08:10 INFO BeamManipulator::set+ Position Angle : 40 deg |
| 16-Oct-2026 10:08:09 | 2026-10-16 10:08:10 INFO image::_casaQuantityFromVar Will use values specified in major, minor, pa to set beam |
| 16-Oct-2026 10:08:09 | 2026-10-16 10:08:10 INFO BeamManipulator::set Beam parameters: Major : 9 arcsec |
| 16-Oct-2026 10:08:09 | 2026-10-16 10:08:10 INFO BeamManipulator::set+ Minor : 6.5 arcsec |
| 16-Oct-2026 10:08:09 | 2026-10-16 10:08:10 INFO BeamManipulator::set+ Position Angle : 41 deg |
| 16-Oct-2026 10:08:09 | 2026-10-16 10:08:10 INFO image::_casaQuantityFromVar Will use values specified in major, minor, pa to set beam |
| 16-Oct-2026 10:08:09 | 2026-10-16 10:08:10 INFO BeamManipulator::set Beam parameters: Major : 10 arcsec |
| 16-Oct-2026 10:08:09 | 2026-10-16 10:08:10 INFO BeamManipulator::set+ Minor : 7 arcsec |
| 16-Oct-2026 10:08:09 | 2026-10-16 10:08:10 INFO BeamManipulator::set+ Position Angle : 42 deg |
| 16-Oct-2026 10:08:09 | 2026-10-16 10:08:10 INFO image::_casaQuantityFromVar Will use values specified in major, minor, pa to set beam |
| 16-Oct-2026 10:08:09 | 2026-10-16 10:08:10 INFO BeamManipulator::set Beam parameters: Major : 11 arcsec |
| 16-Oct-2026 10:08:09 | 2026-10-16 10:08:10 INFO BeamManipulator::set+ Minor : 7.5 arcsec |
| 16-Oct-2026 10:08:09 | 2026-10-16 10:08:10 INFO BeamManipulator::set+ Position Angle : 43 deg |
| 16-Oct-2026 10:08:09 | 2026-10-16 10:08:10 INFO image::_casaQuantityFromVar Will use values specified in major, minor, pa to set beam |
| 16-Oct-2026 10:08:09 | 2026-10-16 10:08:10 INFO BeamManipulator::set Beam parameters: Major : 9 arcsec |
| 16-Oct-2026 10:08:09 | 2026-10-16 10:08:10 INFO BeamManipulator::set+ Minor : 7 arcsec |
| 16-Oct-2026 10:08:09 | 2026-10-16 10:08:10 INFO BeamManipulator::set+ Position Angle : 50 deg |
| 16-Oct-2026 10:08:09 | 2026-10-16 10:08:10 INFO image::_casaQuantityFromVar Will use values specified in major, minor, pa to set beam |
| 16-Oct-2026 10:08:09 | 2026-10-16 10:08:10 INFO BeamManipulator::set Beam parameters: Major : 10 arcsec |
| 16-Oct-2026 10:08:09 | 2026-10-16 10:08:10 INFO BeamManipulator::set+ Minor : 7.5 arcsec |
| 16-Oct-2026 10:08:09 | 2026-10-16 10:08:10 INFO BeamManipulator::set+ Position Angle : 51 deg |
| 16-Oct-2026 10:08:09 | 2026-10-16 10:08:10 INFO image::_casaQuantityFromVar Will use values specified in major, minor, pa to set beam |
| 16-Oct-2026 10:08:09 | 2026-10-16 10:08:10 INFO BeamManipulator::set Beam parameters: Major : 11 arcsec |
| 16-Oct-2026 10:08:09 | 2026-10-16 10:08:10 INFO BeamManipulator::set+ Minor : 8 arcsec |
| 16-Oct-2026 10:08:09 | 2026-10-16 10:08:10 INFO BeamManipulator::set+ Position Angle : 52 deg |
| 16-Oct-2026 10:08:09 | 2026-10-16 10:08:10 INFO image::_casaQuantityFromVar Will use values specified in major, minor, pa to set beam |
| 16-Oct-2026 10:08:09 | 2026-10-16 10:08:10 INFO BeamManipulator::set Beam parameters: Major : 12 arcsec |
| 16-Oct-2026 10:08:09 | 2026-10-16 10:08:10 INFO BeamManipulator::set+ Minor : 8.5 arcsec |
| 16-Oct-2026 10:08:09 | 2026-10-16 10:08:10 INFO BeamManipulator::set+ Position Angle : 53 deg |
| 16-Oct-2026 10:08:09 | 2026-10-16 10:08:10 INFO image::_casaQuantityFromVar Will use values specified in major, minor, pa to set beam |
| 16-Oct-2026 10:08:09 | 2026-10-16 10:08:10 INFO BeamManipulator::set Beam parameters: Major : 10 arcsec |
| 16-Oct-2026 10:08:09 | 2026-10-16 10:08:10 INFO BeamManipulator::set+ Minor : 8 arcsec |
| 16-Oct-2026 10:08:09 | 2026-10-16 10:08:10 INFO BeamManipulator::set+ Position Angle : 60 deg |
| 16-Oct-2026 10:08:09 | 2026-10-16 10:08:10 INFO image::_casaQuantityFromVar Will use values specified in major, minor, pa to set beam |
| 16-Oct-2026 10:08:09 | 2026-10-16 10:08:10 INFO BeamManipulator::set Beam parameters: Major : 11 arcsec |
| 16-Oct-2026 10:08:09 | 2026-10-16 10:08:10 INFO BeamManipulator::set+ Minor : 8.5 arcsec |
| 16-Oct-2026 10:08:09 | 2026-10-16 10:08:10 INFO BeamManipulator::set+ Position Angle : 61 deg |
| 16-Oct-2026 10:08:09 | 2026-10-16 10:08:10 INFO image::_casaQuantityFromVar Will use values specified in major, minor, pa to set beam |
| 16-Oct-2026 10:08:09 | 2026-10-16 10:08:10 INFO BeamManipulator::set Beam parameters: Major : 12 arcsec |
| 16-Oct-2026 10:08:09 | 2026-10-16 10:08:10 INFO BeamManipulator::set+ Minor : 9 arcsec |
| 16-Oct-2026 10:08:09 | 2026-10-16 10:08:10 INFO BeamManipulator::set+ Position Angle : 62 deg |
| 16-Oct-2026 10:08:09 | 2026-10-16 10:08:10 INFO image::_casaQuantityFromVar Will use values specified in major, minor, pa to set beam |
| 16-Oct-2026 10:08:09 | 2026-10-16 10:08:10 INFO BeamManipulator::set Beam parameters: Major : 13 arcsec |
| 16-Oct-2026 10:08:09 | 2026-10-16 10:08:10 INFO BeamManipulator::set+ Minor : 9.5 arcsec |
| 16-Oct-2026 10:08:09 | 2026-10-16 10:08:10 INFO BeamManipulator::set+ Position Angle : 63 deg |
| 16-Oct-2026 10:08:09 | 2026-10-16 10:08:10 INFO image::_casaQuantityFromVar Will use values specified in major, minor, pa to set beam |
| 16-Oct-2026 10:08:09 | 2026-10-16 10:08:10 INFO BeamManipulator::set Beam parameters: Major : 11 arcsec |
| 16-Oct-2026 10:08:09 | 2026-10-16 10:08:10 INFO BeamManipulator::set+ Minor : 9 arcsec |
| 16-Oct-2026 10:08:09 | 2026-10-16 10:08:10 INFO BeamManipulator::set+ Position Angle : 70 deg |
| 16-Oct-2026 10:08:09 | 2026-10-16 10:08:10 INFO image::_casaQuantityFromVar Will use values specified in major, minor, pa to set beam |
| 16-Oct-2026 10:08:09 | 2026-10-16 10:08:10 INFO BeamManipulator::set Beam parameters: Major : 12 arcsec |
| 16-Oct-2026 10:08:09 | 2026-10-16 10:08:10 INFO BeamManipulator::set+ Minor : 9.5 arcsec |
| 16-Oct-2026 10:08:09 | 2026-10-16 10:08:10 INFO BeamManipulator::set+ Position Angle : 71 deg |
| 16-Oct-2026 10:08:09 | 2026-10-16 10:08:10 INFO image::_casaQuantityFromVar Will use values specified in major, minor, pa to set beam |
| 16-Oct-2026 10:08:09 | 2026-10-16 10:08:10 INFO BeamManipulator::set Beam parameters: Major : 13 arcsec |
| 16-Oct-2026 10:08:09 | 2026-10-16 10:08:10 INFO BeamManipulator::set+ Minor : 10 arcsec |
| 16-Oct-2026 10:08:09 | 2026-10-16 10:08:10 INFO BeamManipulator::set+ Position Angle : 72 deg |
| 16-Oct-2026 10:08:09 | 2026-10-16 10:08:10 INFO image::_casaQuantityFromVar Will use values specified in major, minor, pa to set beam |
| 16-Oct-2026 10:08:09 | 2026-10-16 10:08:10 INFO BeamManipulator::set Beam parameters: Major : 14 arcsec |
| 16-Oct-2026 10:08:09 | 2026-10-16 10:08:10 INFO BeamManipulator::set+ Minor : 10.5 arcsec |
| 16-Oct-2026 10:08:09 | 2026-10-16 10:08:10 INFO BeamManipulator::set+ Position Angle : 73 deg |
| 16-Oct-2026 10:08:09 | 2026-10-16 10:08:10 INFO image::_casaQuantityFromVar Will use values specified in major, minor, pa to set beam |
| 16-Oct-2026 10:08:09 | 2026-10-16 10:08:10 INFO BeamManipulator::set Beam parameters: Major : 12 arcsec |
| 16-Oct-2026 10:08:09 | 2026-10-16 10:08:10 INFO BeamManipulator::set+ Minor : 10 arcsec |
| 16-Oct-2026 10:08:09 | 2026-10-16 10:08:10 INFO BeamManipulator::set+ Position Angle : 80 deg |
| 16-Oct-2026 10:08:09 | 2026-10-16 10:08:10 INFO image::_casaQuantityFromVar Will use values specified in major, minor, pa to set beam |
| 16-Oct-2026 10:08:09 | 2026-10-16 10:08:10 INFO BeamManipulator::set Beam parameters: Major : 13 arcsec |
| 16-Oct-2026 10:08:09 | 2026-10-16 10:08:10 INFO BeamManipulator::set+ Minor : 10.5 arcsec |
| 16-Oct-2026 10:08:09 | 2026-10-16 10:08:10 INFO BeamManipulator::set+ Position Angle : 81 deg |
| 16-Oct-2026 10:08:09 | 2026-10-16 10:08:10 INFO image::_casaQuantityFromVar Will use values specified in major, minor, pa to set beam |
| 16-Oct-2026 10:08:09 | 2026-10-16 10:08:10 INFO BeamManipulator::set Beam parameters: Major : 14 arcsec |
| 16-Oct-2026 10:08:09 | 2026-10-16 10:08:10 INFO BeamManipulator::set+ Minor : 11 arcsec |
| 16-Oct-2026 10:08:09 | 2026-10-16 10:08:10 INFO BeamManipulator::set+ Position Angle : 82 deg |
| 16-Oct-2026 10:08:09 | 2026-10-16 10:08:10 INFO image::_casaQuantityFromVar Will use values specified in major, minor, pa to set beam |
| 16-Oct-2026 10:08:09 | 2026-10-16 10:08:10 INFO BeamManipulator::set Beam parameters: Major : 15 arcsec |
| 16-Oct-2026 10:08:09 | 2026-10-16 10:08:10 INFO BeamManipulator::set+ Minor : 11.5 arcsec |
| 16-Oct-2026 10:08:09 | 2026-10-16 10:08:10 INFO BeamManipulator::set+ Position Angle : 83 deg |
| 16-Oct-2026 10:08:09 | 2026-10-16 10:08:10 INFO image::_casaQuantityFromVar Will use values specified in major, minor, pa to set beam |
| 16-Oct-2026 10:08:09 | 2026-10-16 10:08:10 INFO BeamManipulator::set Beam parameters: Major : 13 arcsec |
| 16-Oct-2026 10:08:09 | 2026-10-16 10:08:10 INFO BeamManipulator::set+ Minor : 11 arcsec |
| 16-Oct-2026 10:08:09 | 2026-10-16 10:08:10 INFO BeamManipulator::set+ Position Angle : 90 deg |
| 16-Oct-2026 10:08:09 | 2026-10-16 10:08:10 INFO image::_casaQuantityFromVar Will use values specified in major, minor, pa to set beam |
| 16-Oct-2026 10:08:09 | 2026-10-16 10:08:10 INFO BeamManipulator::set Beam parameters: Major : 14 arcsec |
| 16-Oct-2026 10:08:09 | 2026-10-16 10:08:10 INFO BeamManipulator::set+ Minor : 11.5 arcsec |
| 16-Oct-2026 10:08:09 | 2026-10-16 10:08:10 INFO BeamManipulator::set+ Position Angle : 91 deg |
| 16-Oct-2026 10:08:09 | 2026-10-16 10:08:10 INFO image::_casaQuantityFromVar Will use values specified in major, minor, pa to set beam |
| 16-Oct-2026 10:08:09 | 2026-10-16 10:08:10 INFO BeamManipulator::set Beam parameters: Major : 15 arcsec |
| 16-Oct-2026 10:08:09 | 2026-10-16 10:08:10 INFO BeamManipulator::set+ Minor : 12 arcsec |
| 16-Oct-2026 10:08:09 | 2026-10-16 10:08:10 INFO BeamManipulator::set+ Position Angle : 92 deg |
| 16-Oct-2026 10:08:09 | 2026-10-16 10:08:10 INFO image::_casaQuantityFromVar Will use values specified in major, minor, pa to set beam |
| 16-Oct-2026 10:08:09 | 2026-10-16 10:08:10 INFO BeamManipulator::set Beam parameters: Major : 16 arcsec |
| 16-Oct-2026 10:08:09 | 2026-10-16 10:08:10 INFO BeamManipulator::set+ Minor : 12.5 arcsec |
| 16-Oct-2026 10:08:09 | 2026-10-16 10:08:10 INFO BeamManipulator::set+ Position Angle : 93 deg |
| 16-Oct-2026 10:08:09 | 2026-10-16 10:08:10 INFO ImageRegion::fromRecord Selected bounding box : |
| 16-Oct-2026 10:08:09 | 2026-10-16 10:08:10 INFO ImageRegion::fromRecord+ [1, 1, 1, 1] to [2, 2, 2, 2] (00:00:16.000, -00.04.00.000, 1.415e+09Hz, Q to 00:00:12.000, -00.03.00.000, 1.415e+09Hz, U) |
| 16-Oct-2026 10:08:09 | 2026-10-16 10:08:10 WARN ImageCollapser::_doMultipleBeams Input image has per plane beams but the collapse is not done exclusively along the direction axes. The output image will arbitrarily have a single beam which is the first beam available in the subimage.Thus, the image planes will not be convolved to a common restoring beam before collapsing. If, however, this is desired, then run the task imsmooth or the tool method ia.convolve2d() first, and use the output image of that as the input for collapsing. |
| 16-Oct-2026 10:08:09 | test_tool_image_collapse.py::ia_collapse_test::test_beams |
| 16-Oct-2026 10:08:09 | test per plane beams |
| 16-Oct-2026 10:08:09 | 2026-10-16 10:08:10 INFO name:: No table opened. |
| 16-Oct-2026 10:08:09 | 2026-10-16 10:08:10 INFO showcache:: The Table Cache is empty. |
| 16-Oct-2026 10:08:09 | 2026-10-16 10:08:10 INFO name:: No table opened. |
| 16-Oct-2026 10:08:09 | 2026-10-16 10:08:10 INFO name:: No table opened. |
| 16-Oct-2026 10:08:09 | PASSED |
| 16-Oct-2026 10:08:09 | |
| 16-Oct-2026 10:08:09 | 2026-10-16 10:08:10 INFO ImageFactory::createImage Created Temp image of shape [2, 2, 2] with Complex valued pixels. |
| 16-Oct-2026 10:08:09 | 2026-10-16 10:08:10 INFO ImageRegion::fromRecord Selected bounding box : |
| 16-Oct-2026 10:08:09 | 2026-10-16 10:08:10 INFO ImageRegion::fromRecord+ [0, 0, 0] to [1, 1, 1] (00:00:04.000, -00.01.00.000, I to 00:00:00.000, +00.00.00.000, Q) |
| 16-Oct-2026 10:08:09 | 2026-10-16 10:08:10 INFO ImageRegion::fromRecord Selected bounding box : |
| 16-Oct-2026 10:08:09 | 2026-10-16 10:08:10 INFO ImageRegion::fromRecord+ [0, 0, 0] to [1, 1, 0] (00:00:04.000, -00.01.00.000, I to 00:00:00.000, +00.00.00.000, I) |
| 16-Oct-2026 10:08:09 | 2026-10-16 10:08:10 INFO ImageRegion::fromRecord Selected bounding box : |
| 16-Oct-2026 10:08:09 | 2026-10-16 10:08:10 INFO ImageRegion::fromRecord+ [0, 0, 0] to [1, 1, 1] (00:00:04.000, -00.01.00.000, I to 00:00:00.000, +00.00.00.000, Q) |
| 16-Oct-2026 10:08:09 | 2026-10-16 10:08:10 INFO ImageRegion::fromRecord Selected bounding box : |
| 16-Oct-2026 10:08:09 | 2026-10-16 10:08:10 INFO ImageRegion::fromRecord+ [0, 0, 0] to [1, 1, 0] (00:00:04.000, -00.01.00.000, I to 00:00:00.000, +00.00.00.000, I) |
| 16-Oct-2026 10:08:09 | test_tool_image_collapse.py::ia_collapse_test::test_complex |
| 16-Oct-2026 10:08:09 | Test support for complex valued images |
| 16-Oct-2026 10:08:09 | 2026-10-16 10:08:10 INFO name:: No table opened. |
| 16-Oct-2026 10:08:09 | 2026-10-16 10:08:10 INFO showcache:: The Table Cache is empty. |
| 16-Oct-2026 10:08:09 | 2026-10-16 10:08:10 INFO name:: No table opened. |
| 16-Oct-2026 10:08:09 | 2026-10-16 10:08:10 INFO name:: No table opened. |
| 16-Oct-2026 10:08:09 | PASSED |
| 16-Oct-2026 10:08:09 | |
| 16-Oct-2026 10:08:09 | 2026-10-16 10:08:10 SEVERE image::open (file src/tools/image/image_cmpt.cc, line 4208) Exception Reported: Exception: File mybogus.im does not exist.. |
| 16-Oct-2026 10:08:09 | 2026-10-16 10:08:10 SEVERE image::open (file src/tools/image/image_cmpt.cc, line 4208)+ ... thrown by static void casa::ImageFactory::_checkInfile(const casacore::String&) at File: /source/casa6/casatools/src/code/imageanalysis/ImageAnalysis/ImageFactory2.cc, line: 375 |
| 16-Oct-2026 10:08:09 | 2026-10-16 10:08:10 INFO FITSCoordinateUtil::fromFITSHeader Neither SPECSYS nor VELREF keyword given, spectral reference frame not defined ... |
| 16-Oct-2026 10:08:09 | 2026-10-16 10:08:10 SEVERE image::collapse (file src/tools/image/image_cmpt.cc, line 712) Exception Reported: Exception: Aggregate function name is not specified and it must be.. |
| 16-Oct-2026 10:08:09 | 2026-10-16 10:08:10 SEVERE image::collapse (file src/tools/image/image_cmpt.cc, line 712)+ ... thrown by static casa::ImageCollapserData::AggregateType casa::ImageCollapserData::aggregateType(const casacore::String&) at File: /source/casa6/casatools/src/code/imageanalysis/ImageAnalysis/ImageCollapserData.cc, line: 65 |
| 16-Oct-2026 10:08:09 | 2026-10-16 10:08:10 INFO FITSCoordinateUtil::fromFITSHeader Neither SPECSYS nor VELREF keyword given, spectral reference frame not defined ... |
| 16-Oct-2026 10:08:09 | 2026-10-16 10:08:10 SEVERE image::collapse (file src/tools/image/image_cmpt.cc, line 712) Exception Reported: Unknown aggregate function specified by bogus function at File: /source/casa6/casatools/src/code/imageanalysis/ImageAnalysis/ImageCollapserData.cc, line: 84 |
| 16-Oct-2026 10:08:09 | 2026-10-16 10:08:10 INFO FITSCoordinateUtil::fromFITSHeader Neither SPECSYS nor VELREF keyword given, spectral reference frame not defined ... |
| 16-Oct-2026 10:08:09 | 2026-10-16 10:08:10 WARN /home/casatest/casa6/casatestutils/nosedir/test_tool_image_collapse/collapse_in.fits is not a valid or readable table |
| 16-Oct-2026 10:08:09 | 2026-10-16 10:08:10 SEVERE Cannot read image /home/casatest/casa6/casatestutils/nosedir/test_tool_image_collapse/collapse_in.fits to get region bogus_region |
| 16-Oct-2026 10:08:09 | 2026-10-16 10:08:10 SEVERE image::collapse (file src/tools/image/image_cmpt.cc, line 712) Exception Reported: Unable to open region file or region table description bogus_region in image /home/casatest/casa6/casatestutils/nosedir/test_tool_image_collapse/collapse_in.fits at File: /source/casa6/casatools/src/code/imageanalysis/Regions/CasacRegionManager.cc, line: 486 |
| 16-Oct-2026 10:08:09 | 2026-10-16 10:08:10 INFO FITSCoordinateUtil::fromFITSHeader Neither SPECSYS nor VELREF keyword given, spectral reference frame not defined ... |
| 16-Oct-2026 10:08:09 | 2026-10-16 10:08:10 SEVERE image::collapse (file src/tools/image/image_cmpt.cc, line 712) Exception Reported: Exception: box not specified correctly. |
| 16-Oct-2026 10:08:09 | 2026-10-16 10:08:10 SEVERE image::collapse (file src/tools/image/image_cmpt.cc, line 712)+ ... thrown by casacore::Record casa::CasacRegionManager::fromBCS(casacore::String&, casacore::uInt&, casacore::String&, const casacore::Record* const&, const casacore::String&, const casacore::String&, casa::CasacRegionManager::StokesControl, const casacore::String&, const casacore::IPosition&, const casacore::String&, casacore::Bool) at File: /source/casa6/casatools/src/code/imageanalysis/Regions/CasacRegionManager.cc, line: 232 |
| 16-Oct-2026 10:08:09 | 2026-10-16 10:08:10 INFO FITSCoordinateUtil::fromFITSHeader Neither SPECSYS nor VELREF keyword given, spectral reference frame not defined ... |
| 16-Oct-2026 10:08:09 | 2026-10-16 10:08:10 INFO CasacRegionManager::_fromBCS dAxisNum0=0 dAxisNum1=1x=1000 imShape[0]=3 y=1000 imShape[1]=3 |
| 16-Oct-2026 10:08:09 | 2026-10-16 10:08:10 SEVERE CasacRegionManager::_fromBCS trc in box spec is greater than or equal to number of direction coordinate pixels in the image |
| 16-Oct-2026 10:08:09 | 2026-10-16 10:08:10 SEVERE image::collapse (file src/tools/image/image_cmpt.cc, line 712) Exception Reported: 2026-10-16 10:08:10 SEVERE CasacRegionManager::_fromBCS trc in box spec is greater than or equal to number of direction coordinate pixels in the image |
| 16-Oct-2026 10:08:09 | 2026-10-16 10:08:10 INFO FITSCoordinateUtil::fromFITSHeader Neither SPECSYS nor VELREF keyword given, spectral reference frame not defined ... |
| 16-Oct-2026 10:08:09 | 2026-10-16 10:08:10 SEVERE CoordinateSystem::getWorldAxesOrder (file /source/casa6/casatools/casacore/coordinates/Coordinates/CoordinateSystem.cc, line 4663) Multiple axes [right ascension,declination,frequency,stokes] match requested axis |
| 16-Oct-2026 10:08:09 | 2026-10-16 10:08:10 SEVERE image::collapse (file src/tools/image/image_cmpt.cc, line 712) Exception Reported: 2026-10-16 10:08:10 SEVERE CoordinateSystem::getWorldAxesOrder (file /source/casa6/casatools/casacore/coordinates/Coordinates/CoordinateSystem.cc, line 4663) Multiple axes [right ascension,declination,frequency,stokes] match requested axis |
| 16-Oct-2026 10:08:09 | 2026-10-16 10:08:10 INFO FITSCoordinateUtil::fromFITSHeader Neither SPECSYS nor VELREF keyword given, spectral reference frame not defined ... |
| 16-Oct-2026 10:08:09 | 2026-10-16 10:08:10 SEVERE image::collapse (file src/tools/image/image_cmpt.cc, line 712) Exception Reported: Exception: Specified zero-based axis (10) must be less than the number of axes in /home/casatest/casa6/casatestutils/nosedir/test_tool_image_collapse/collapse_in.fits(4). |
| 16-Oct-2026 10:08:09 | 2026-10-16 10:08:10 SEVERE image::collapse (file src/tools/image/image_cmpt.cc, line 712)+ ... thrown by void casa::ImageCollapser<T>::_finishConstruction() [with T = float] at File: /source/casainstall/include/casacpp/imageanalysis/ImageAnalysis/ImageCollapser.tcc, line: 559 |
| 16-Oct-2026 10:08:09 | 2026-10-16 10:08:10 INFO name:: No table opened. |
| 16-Oct-2026 10:08:09 | 2026-10-16 10:08:10 INFO showcache:: The Table Cache is empty. |
| 16-Oct-2026 10:08:09 | 2026-10-16 10:08:10 INFO name:: No table opened. |
| 16-Oct-2026 10:08:09 | 2026-10-16 10:08:10 INFO name:: No table opened. |
| 16-Oct-2026 10:08:09 | test_tool_image_collapse.py::ia_collapse_test::test_exceptions |
| 16-Oct-2026 10:08:09 | ia.collapse: Test various exception cases |
| 16-Oct-2026 10:08:09 | PASSED |
| 16-Oct-2026 10:08:09 | |
| 16-Oct-2026 10:08:09 | 2026-10-16 10:08:10 INFO ImageFactory::createImage Created Paged image 'flux_test.im' of shape [10, 10, 10] with float valued pixels. |
| 16-Oct-2026 10:08:09 | 2026-10-16 10:08:10 INFO ImageRegion::fromRecord Selected bounding box : |
| 16-Oct-2026 10:08:09 | 2026-10-16 10:08:10 INFO ImageRegion::fromRecord+ [0, 0, 0] to [9, 9, 9] (00:00:20.000, -00.05.00.000, 1.415e+09Hz to 23:59:44.000, +00.04.00.000, 1.415e+09Hz) |
| 16-Oct-2026 10:08:09 | 2026-10-16 10:08:10 SEVERE image::collapse (file src/tools/image/image_cmpt.cc, line 712) Exception Reported: Unable to calculate flux density: [] at File: /source/casainstall/include/casacpp/imageanalysis/ImageAnalysis/ImageCollapser.tcc, line: 433 |
| 16-Oct-2026 10:08:09 | 2026-10-16 10:08:10 INFO image::_casaQuantityFromVar Will use values specified in major, minor, pa to set beam |
| 16-Oct-2026 10:08:09 | 2026-10-16 10:08:10 INFO BeamManipulator::set Setting (global) restoring beam. |
| 16-Oct-2026 10:08:09 | 2026-10-16 10:08:10 INFO BeamManipulator::set Beam parameters: Major : 3 arcmin |
| 16-Oct-2026 10:08:09 | 2026-10-16 10:08:10 INFO BeamManipulator::set+ Minor : 3 arcmin |
| 16-Oct-2026 10:08:09 | 2026-10-16 10:08:10 INFO BeamManipulator::set+ Position Angle : 0 deg |
| 16-Oct-2026 10:08:09 | 2026-10-16 10:08:10 INFO ImageRegion::fromRecord Selected bounding box : |
| 16-Oct-2026 10:08:09 | 2026-10-16 10:08:10 INFO ImageRegion::fromRecord+ [0, 0, 0] to [9, 9, 9] (00:00:20.000, -00.05.00.000, 1.415e+09Hz to 23:59:44.000, +00.04.00.000, 1.415e+09Hz) |
| 16-Oct-2026 10:08:09 | 2026-10-16 10:08:10 INFO name:: No table opened. |
| 16-Oct-2026 10:08:09 | test_tool_image_collapse.py::ia_collapse_test::test_flux |
| 16-Oct-2026 10:08:09 | 2026-10-16 10:08:10 INFO showcache:: The Table Cache is empty. |
| 16-Oct-2026 10:08:09 | Test flux function |
| 16-Oct-2026 10:08:09 | 2026-10-16 10:08:10 INFO name:: No table opened. |
| 16-Oct-2026 10:08:09 | 2026-10-16 10:08:10 INFO name:: No table opened. |
| 16-Oct-2026 10:08:09 | PASSED |
| 16-Oct-2026 10:08:09 | |
| 16-Oct-2026 10:08:09 | 2026-10-16 10:08:10 INFO ImageFactory::createImage Created Temp image of shape [20, 20, 20] with float valued pixels. |
| 16-Oct-2026 10:08:09 | 2026-10-16 10:08:10 INFO ImageRegion::fromRecord Selected bounding box : |
| 16-Oct-2026 10:08:09 | 2026-10-16 10:08:10 INFO ImageRegion::fromRecord+ [0, 0, 0] to [19, 19, 19] (00:00:40.000, -00.10.00.001, 1.41499e+09Hz to 23:59:24.000, +00.09.00.001, 1.41501e+09Hz) |
| 16-Oct-2026 10:08:09 | 2026-10-16 10:08:10 INFO ::::ImageFactory::createImage Created Temp image of shape [20, 20, 20] with float valued pixels. |
| 16-Oct-2026 10:08:09 | 2026-10-16 10:08:10 INFO ::::image::fromshape Ran ia.fromshape |
| 16-Oct-2026 10:08:09 | 2026-10-16 10:08:10 INFO ::::image::fromshape ia.fromshape(outfile="", shape=[20,20,20], csys={...}, linear=false, overwrite=false, log=true, type="f") |
| 16-Oct-2026 10:08:09 | 2026-10-16 10:08:10 INFO ::::image::collapse Ran ia.collapse on Temporary_Image |
| 16-Oct-2026 10:08:09 | 2026-10-16 10:08:10 INFO ::::image::collapse ia.collapse(function='mean', axes=2, outfile='', region='', box='', chans='', stokes='', mask='', overwrite=false, stretch=false) |
| 16-Oct-2026 10:08:09 | 2026-10-16 10:08:10 INFO name:: No table opened. |
| 16-Oct-2026 10:08:09 | 2026-10-16 10:08:10 INFO showcache:: The Table Cache is empty. |
| 16-Oct-2026 10:08:09 | 2026-10-16 10:08:10 INFO name:: No table opened. |
| 16-Oct-2026 10:08:09 | 2026-10-16 10:08:10 INFO name:: No table opened. |
| 16-Oct-2026 10:08:09 | test_tool_image_collapse.py::ia_collapse_test::test_history |
| 16-Oct-2026 10:08:09 | Test history record is written |
| 16-Oct-2026 10:08:09 | PASSED |
| 16-Oct-2026 10:08:09 | |
| 16-Oct-2026 10:08:09 | 2026-10-16 10:08:10 INFO ImageFactory::createImage Created Paged image 'median.im' of shape [3, 3, 3] with float valued pixels. |
| 16-Oct-2026 10:08:10 | 2026-10-16 10:08:10 INFO ImageRegion::fromRecord Selected bounding box : |
| 16-Oct-2026 10:08:10 | 2026-10-16 10:08:10 INFO ImageRegion::fromRecord+ [0, 0, 0] to [2, 2, 2] (00:00:04.000, -00.01.00.000, I to 23:59:56.000, +00.01.00.000, U) |
| 16-Oct-2026 10:08:10 | 2026-10-16 10:08:10 INFO ImageRegion::fromRecord Selected bounding box : |
| 16-Oct-2026 10:08:10 | 2026-10-16 10:08:10 INFO ImageRegion::fromRecord+ [0, 0, 0] to [2, 2, 2] (00:00:04.000, -00.01.00.000, I to 23:59:56.000, +00.01.00.000, U) |
| 16-Oct-2026 10:08:10 | 2026-10-16 10:08:10 INFO ImageFactory::createImage Created Temp image of shape [20, 20, 5] with float valued pixels. |
| 16-Oct-2026 10:08:10 | 2026-10-16 10:08:10 INFO AsciiRegionFileParser::_parse Combined 1 image regions (which excludes any annotation regions) |
| 16-Oct-2026 10:08:10 | 2026-10-16 10:08:10 INFO AsciiRegionFileParser::_parse The specified region will select all pixels that are included in the region. Full pixels will be included even when they are only partially covered by the region(s). |
| 16-Oct-2026 10:08:10 | 2026-10-16 10:08:10 INFO ImageRegion::fromRecord Selected bounding box : |
| 16-Oct-2026 10:08:10 | 2026-10-16 10:08:10 INFO ImageRegion::fromRecord+ [5, 5, 0] to [15, 15, 4] (00:00:20.000, -00.05.00.000, 1.415e+09Hz to 23:59:40.000, +00.05.00.000, 1.415e+09Hz) |
| 16-Oct-2026 10:08:10 | test_tool_image_collapse.py::ia_collapse_test::test_median |
| 16-Oct-2026 10:08:10 | Test median when collapsing along multiple axes |
| 16-Oct-2026 10:08:10 | 2026-10-16 10:08:10 INFO name:: No table opened. |
| 16-Oct-2026 10:08:10 | 2026-10-16 10:08:10 INFO showcache:: The Table Cache is empty. |
| 16-Oct-2026 10:08:10 | 2026-10-16 10:08:10 INFO name:: No table opened. |
| 16-Oct-2026 10:08:10 | 2026-10-16 10:08:10 INFO name:: No table opened. |
| 16-Oct-2026 10:08:10 | PASSED |
| 16-Oct-2026 10:08:10 | |
| 16-Oct-2026 10:08:10 | 2026-10-16 10:08:10 INFO ImageFactory::createImage Created Temp image of shape [10, 10, 10] with float valued pixels. |
| 16-Oct-2026 10:08:10 | 2026-10-16 10:08:10 INFO ImageRegion::fromRecord Selected bounding box : |
| 16-Oct-2026 10:08:10 | 2026-10-16 10:08:10 INFO ImageRegion::fromRecord+ [0, 4, 0] to [9, 6, 9] (00:00:20.000, -00.01.00.000, 1.415e+09Hz to 23:59:44.000, +00.01.00.000, 1.415e+09Hz) |
| 16-Oct-2026 10:08:10 | test_tool_image_collapse.py::ia_collapse_test::test_region |
| 16-Oct-2026 10:08:10 | ia.collapse(): Test region |
| 16-Oct-2026 10:08:10 | 2026-10-16 10:08:10 INFO name:: No table opened. |
| 16-Oct-2026 10:08:10 | 2026-10-16 10:08:10 INFO showcache:: The Table Cache is empty. |
| 16-Oct-2026 10:08:10 | 2026-10-16 10:08:10 INFO name:: No table opened. |
| 16-Oct-2026 10:08:10 | 2026-10-16 10:08:10 INFO name:: No table opened. |
| 16-Oct-2026 10:08:10 | PASSED |
| 16-Oct-2026 10:08:10 | |
| 16-Oct-2026 10:08:10 | 2026-10-16 10:08:10 INFO ImageFactory::createImage Created Temp image of shape [2, 2, 2] with float valued pixels. |
| 16-Oct-2026 10:08:10 | 2026-10-16 10:08:10 INFO ImageRegion::fromRecord Selected bounding box : |
| 16-Oct-2026 10:08:10 | 2026-10-16 10:08:10 INFO ImageRegion::fromRecord+ [0, 0, 0] to [1, 1, 1] (00:00:04.000, -00.01.00.000, I to 00:00:00.000, +00.00.00.000, Q) |
| 16-Oct-2026 10:08:10 | 2026-10-16 10:08:10 INFO ImageRegion::fromRecord Selected bounding box : |
| 16-Oct-2026 10:08:10 | 2026-10-16 10:08:10 INFO ImageRegion::fromRecord+ [0, 0, 0] to [1, 1, 1] (00:00:04.000, -00.01.00.000, I to 00:00:00.000, +00.00.00.000, Q) |
| 16-Oct-2026 10:08:10 | test_tool_image_collapse.py::ia_collapse_test::test_sqrtsum |
| 16-Oct-2026 10:08:10 | Test sqrtsum function |
| 16-Oct-2026 10:08:10 | 2026-10-16 10:08:10 INFO name:: No table opened. |
| 16-Oct-2026 10:08:10 | 2026-10-16 10:08:10 INFO showcache:: The Table Cache is empty. |
| 16-Oct-2026 10:08:10 | 2026-10-16 10:08:10 INFO name:: No table opened. |
| 16-Oct-2026 10:08:10 | 2026-10-16 10:08:10 INFO name:: No table opened. |
| 16-Oct-2026 10:08:10 | PASSED |
| 16-Oct-2026 10:08:10 | |
| 16-Oct-2026 10:08:10 | 2026-10-16 10:08:10 INFO ImageFactory::createImage Created Temp image of shape [2, 2, 2] with float valued pixels. |
| 16-Oct-2026 10:08:10 | 2026-10-16 10:08:10 INFO ImageRegion::fromRecord Selected bounding box : |
| 16-Oct-2026 10:08:10 | 2026-10-16 10:08:10 INFO ImageRegion::fromRecord+ [0, 0, 0] to [1, 1, 1] (00:00:04.000, -00.01.00.000, I to 00:00:00.000, +00.00.00.000, Q) |
| 16-Oct-2026 10:08:10 | 2026-10-16 10:08:10 INFO ImageRegion::fromRecord Selected bounding box : |
| 16-Oct-2026 10:08:10 | 2026-10-16 10:08:10 INFO ImageRegion::fromRecord+ [0, 0, 0] to [1, 1, 1] (00:00:04.000, -00.01.00.000, I to 00:00:00.000, +00.00.00.000, Q) |
| 16-Oct-2026 10:08:10 | test_tool_image_collapse.py::ia_collapse_test::test_sqrtsum_npix |
| 16-Oct-2026 10:08:10 | Test sqrtsum function |
| 16-Oct-2026 10:08:10 | 2026-10-16 10:08:10 INFO name:: No table opened. |
| 16-Oct-2026 10:08:10 | 2026-10-16 10:08:10 INFO showcache:: The Table Cache is empty. |
| 16-Oct-2026 10:08:10 | 2026-10-16 10:08:10 INFO name:: No table opened. |
| 16-Oct-2026 10:08:10 | 2026-10-16 10:08:10 INFO name:: No table opened. |
| 16-Oct-2026 10:08:10 | PASSED |
| 16-Oct-2026 10:08:10 | |
| 16-Oct-2026 10:08:10 | 2026-10-16 10:08:10 INFO ImageFactory::createImage Created Temp image of shape [2, 2, 2] with float valued pixels. |
| 16-Oct-2026 10:08:10 | 2026-10-16 10:08:10 INFO image::_casaQuantityFromVar Will use values specified in major, minor, pa to set beam |
| 16-Oct-2026 10:08:10 | 2026-10-16 10:08:10 INFO BeamManipulator::set Setting (global) restoring beam. |
| 16-Oct-2026 10:08:10 | 2026-10-16 10:08:10 INFO BeamManipulator::set Beam parameters: Major : 3 arcmin |
| 16-Oct-2026 10:08:10 | 2026-10-16 10:08:10 INFO BeamManipulator::set+ Minor : 3 arcmin |
| 16-Oct-2026 10:08:10 | 2026-10-16 10:08:10 INFO BeamManipulator::set+ Position Angle : 0 deg |
| 16-Oct-2026 10:08:10 | 2026-10-16 10:08:10 INFO ImageRegion::fromRecord Selected bounding box : |
| 16-Oct-2026 10:08:10 | 2026-10-16 10:08:10 INFO ImageRegion::fromRecord+ [0, 0, 0] to [1, 1, 1] (00:00:04.000, -00.01.00.000, I to 00:00:00.000, +00.00.00.000, Q) |
| 16-Oct-2026 10:08:10 | 2026-10-16 10:08:10 INFO ImageRegion::fromRecord Selected bounding box : |
| 16-Oct-2026 10:08:10 | 2026-10-16 10:08:10 INFO ImageRegion::fromRecord+ [0, 0, 0] to [1, 1, 1] (00:00:04.000, -00.01.00.000, I to 00:00:00.000, +00.00.00.000, Q) |
| 16-Oct-2026 10:08:10 | test_tool_image_collapse.py::ia_collapse_test::test_sqrtsum_npix_beam |
| 16-Oct-2026 10:08:10 | Test sqrtsum function |
| 16-Oct-2026 10:08:10 | 2026-10-16 10:08:10 INFO name:: No table opened. |
| 16-Oct-2026 10:08:10 | 2026-10-16 10:08:10 INFO showcache:: The Table Cache is empty. |
| 16-Oct-2026 10:08:10 | 2026-10-16 10:08:10 INFO name:: No table opened. |
| 16-Oct-2026 10:08:10 | 2026-10-16 10:08:10 INFO name:: No table opened. |
| 16-Oct-2026 10:08:10 | PASSED |
| 16-Oct-2026 10:08:10 | |
| 16-Oct-2026 10:08:10 | 2026-10-16 10:08:10 INFO FITSCoordinateUtil::fromFITSHeader Neither SPECSYS nor VELREF keyword given, spectral reference frame not defined ... |
| 16-Oct-2026 10:08:10 | 2026-10-16 10:08:10 INFO ImageFactory::createImage Created Paged image 'ymask' of shape [3, 3, 1, 1] with float valued pixels. |
| 16-Oct-2026 10:08:10 | 2026-10-16 10:08:10 INFO FITSCoordinateUtil::fromFITSHeader Neither SPECSYS nor VELREF keyword given, spectral reference frame not defined ... |
| 16-Oct-2026 10:08:10 | 2026-10-16 10:08:10 INFO ImageRegion::fromRecord Selected bounding box : |
| 16-Oct-2026 10:08:10 | 2026-10-16 10:08:10 INFO ImageRegion::fromRecord+ [0, 0, 0, 0] to [2, 2, 2, 2] (04:46:00.576, +44.50.12.522, 4.7351e+09Hz, I to 04:46:00.520, +44.50.13.123, 5.5351e+09Hz, U) |
| 16-Oct-2026 10:08:10 | test_tool_image_collapse.py::ia_collapse_test::test_stretch |
| 16-Oct-2026 10:08:10 | 2026-10-16 10:08:10 INFO name:: No table opened. |
| 16-Oct-2026 10:08:10 | ia.collapse(): Test stretch parameter |
| 16-Oct-2026 10:08:10 | 2026-10-16 10:08:10 INFO showcache:: The Table Cache is empty. |
| 16-Oct-2026 10:08:10 | 2026-10-16 10:08:10 INFO name:: No table opened. |
| 16-Oct-2026 10:08:10 | 2026-10-16 10:08:10 INFO name:: No table opened. |
| 16-Oct-2026 10:08:10 | PASSED |
| 16-Oct-2026 10:08:10 | |
| 16-Oct-2026 10:08:10 | - generated xml file: /home/casatest/casa6/casatestutils/nosedir/xml/test_tool_image_collapse/nose.xml - |
| 16-Oct-2026 10:08:10 | ======================== 20 passed, 1 warning in 2.61s ========================= |
| 16-Oct-2026 10:08:10 | ============================= test session starts ============================== |
| 16-Oct-2026 10:08:10 | platform linux -- Python 3.12.9, pytest-9.1.1, pluggy-1.7.0 -- /home/casatest/venv/bin/python3.12 |
| 16-Oct-2026 10:08:10 | cachedir: .pytest_cache |
| 16-Oct-2026 10:08:10 | rootdir: /home/casatest/casa6/casatestutils/nosedir/test_tool_image_pbcor |
| 16-Oct-2026 10:08:10 | configfile: pytest.ini |
| 16-Oct-2026 10:08:10 | collecting ... collected 9 items |
| 16-Oct-2026 10:08:10 | |
| 16-Oct-2026 10:08:10 | |
| 16-Oct-2026 10:08:10 | 2026-10-16 10:08:11 INFO FITSCoordinateUtil::fromFITSHeader passing empty or nonexistant spectral Coordinate axis |
| 16-Oct-2026 10:08:10 | 2026-10-16 10:08:11 INFO FITSCoordinateUtil::fromFITSHeader passing empty or nonexistant spectral Coordinate axis |
| 16-Oct-2026 10:08:10 | 2026-10-16 10:08:11 INFO CasacRegionManager::fromBCS No directional region specified. Using full positional plane. |
| 16-Oct-2026 10:08:10 | 2026-10-16 10:08:11 INFO CasacRegionManager::fromBCS Using all spectral channels. |
| 16-Oct-2026 10:08:10 | 2026-10-16 10:08:11 INFO CasacRegionManager::fromBCS Using polarizations ALL |
| 16-Oct-2026 10:08:10 | 2026-10-16 10:08:11 INFO ImageRegion::fromRecord Selected bounding box : |
| 16-Oct-2026 10:08:10 | 2026-10-16 10:08:11 INFO ImageRegion::fromRecord+ [0, 0, 0, 0] to [112, 75, 4, 1] (00:03:44.024, -00.38.00.046, 1.415e+09Hz, I to 23:56:15.977, +00.37.00.043, 1.415e+09Hz, Q) |
| 16-Oct-2026 10:08:10 | 2026-10-16 10:08:11 INFO ImageRegion::fromRecord Selected bounding box : |
| 16-Oct-2026 10:08:10 | 2026-10-16 10:08:11 INFO ImageRegion::fromRecord+ [0, 0, 0, 0] to [112, 75, 4, 1] (00:03:44.024, -00.38.00.046, 1.415e+09Hz, I to 23:56:15.977, +00.37.00.043, 1.415e+09Hz, Q) |
| 16-Oct-2026 10:08:11 | 2026-10-16 10:08:11 INFO SubImageFactory::createImage Creating image 'mypb.im' of shape [113, 76, 5, 2] |
| 16-Oct-2026 10:08:11 | 2026-10-16 10:08:11 INFO ImageMaskAttacher::makeMask Created mask `mask0' |
| 16-Oct-2026 10:08:11 | 2026-10-16 10:08:11 INFO ImageRegion::fromRecord Selected bounding box : |
| 16-Oct-2026 10:08:11 | 2026-10-16 10:08:11 INFO ImageRegion::fromRecord+ [0, 0, 0, 0] to [112, 75, 0, 0] (00:03:44.024, -00.38.00.046, 1.415e+09Hz, I to 23:56:15.977, +00.37.00.043, 1.415e+09Hz, I) |
| 16-Oct-2026 10:08:11 | 2026-10-16 10:08:11 INFO CasacRegionManager::fromBCS No directional region specified. Using full positional plane. |
| 16-Oct-2026 10:08:11 | 2026-10-16 10:08:11 INFO CasacRegionManager::fromBCS Using all spectral channels. |
| 16-Oct-2026 10:08:11 | 2026-10-16 10:08:11 INFO CasacRegionManager::fromBCS Using polarizations ALL |
| 16-Oct-2026 10:08:11 | 2026-10-16 10:08:11 INFO ImageRegion::fromRecord Selected bounding box : |
| 16-Oct-2026 10:08:11 | 2026-10-16 10:08:11 INFO ImageRegion::fromRecord+ [0, 0, 0, 0] to [112, 75, 4, 1] (00:03:44.024, -00.38.00.046, 1.415e+09Hz, I to 23:56:15.977, +00.37.00.043, 1.415e+09Hz, Q) |
| 16-Oct-2026 10:08:11 | 2026-10-16 10:08:11 INFO ImageRegion::fromRecord Selected bounding box : |
| 16-Oct-2026 10:08:11 | 2026-10-16 10:08:11 INFO ImageRegion::fromRecord+ [0, 0, 0, 0] to [112, 75, 4, 1] (00:03:44.024, -00.38.00.046, 1.415e+09Hz, I to 23:56:15.977, +00.37.00.043, 1.415e+09Hz, Q) |
| 16-Oct-2026 10:08:11 | 2026-10-16 10:08:11 INFO SubImageFactory::createImage Creating image 'mypb.im' of shape [113, 76, 5, 2] |
| 16-Oct-2026 10:08:11 | 2026-10-16 10:08:11 INFO ImageMaskAttacher::makeMask Created mask `mask0' |
| 16-Oct-2026 10:08:11 | 2026-10-16 10:08:11 INFO name:: No table opened. |
| 16-Oct-2026 10:08:11 | 2026-10-16 10:08:11 INFO showcache:: The Table Cache is empty. |
| 16-Oct-2026 10:08:11 | test_tool_image_pbcor.py::ia_pbcor_test::test_4d_image_with_2d_pb |
| 16-Oct-2026 10:08:11 | ia.pbcor: Test full image divide with cutoff. Primary beam is 2 D, image is 4 D |
| 16-Oct-2026 10:08:11 | PASSED |
| 16-Oct-2026 10:08:11 | |
| 16-Oct-2026 10:08:11 | 2026-10-16 10:08:11 INFO SubImageFactory::createImage Creating image 'mypb.im' of shape [5, 5, 1, 1] |
| 16-Oct-2026 10:08:11 | 2026-10-16 10:08:11 INFO name:: No table opened. |
| 16-Oct-2026 10:08:11 | 2026-10-16 10:08:11 INFO showcache:: The Table Cache is empty. |
| 16-Oct-2026 10:08:11 | test_tool_image_pbcor.py::ia_pbcor_test::test_diff_spectral_coordinate |
| 16-Oct-2026 10:08:11 | Verify fix that a different spectral coordinates in target and template don't matter, CAS-5096 |
| 16-Oct-2026 10:08:11 | PASSED |
| 16-Oct-2026 10:08:11 | |
| 16-Oct-2026 10:08:11 | 2026-10-16 10:08:12 INFO ImageFactory::createImage Created Paged image 't_in.im' of shape [20, 20, 4, 20] with float valued pixels. |
| 16-Oct-2026 10:08:11 | 2026-10-16 10:08:12 INFO ImageFactory::createImage Created Paged image 't_pb_in.im' of shape [20, 20, 4, 20] with float valued pixels. |
| 16-Oct-2026 10:08:11 | 2026-10-16 10:08:12 INFO CasacRegionManager::fromBCS No directional region specified. Using full positional plane. |
| 16-Oct-2026 10:08:11 | 2026-10-16 10:08:12 INFO CasacRegionManager::fromBCS Using all spectral channels. |
| 16-Oct-2026 10:08:11 | 2026-10-16 10:08:12 INFO CasacRegionManager::fromBCS Using polarizations I |
| 16-Oct-2026 10:08:11 | 2026-10-16 10:08:12 INFO ImageRegion::fromRecord Selected bounding box : |
| 16-Oct-2026 10:08:11 | 2026-10-16 10:08:12 INFO ImageRegion::fromRecord+ [0, 0, 0, 0] to [19, 19, 0, 19] (00:00:40.000, -00.10.00.001, I, 1.41499e+09Hz to 23:59:24.000, +00.09.00.001, I, 1.41501e+09Hz) |
| 16-Oct-2026 10:08:11 | 2026-10-16 10:08:12 INFO ImageRegion::fromRecord Selected bounding box : |
| 16-Oct-2026 10:08:11 | 2026-10-16 10:08:12 INFO ImageRegion::fromRecord+ [0, 0, 0, 0] to [19, 19, 0, 19] (00:00:40.000, -00.10.00.001, I, 1.41499e+09Hz to 23:59:24.000, +00.09.00.001, I, 1.41501e+09Hz) |
| 16-Oct-2026 10:08:11 | 2026-10-16 10:08:12 INFO SubImageFactory::createImage Creating image 't_out.im' of shape [20, 20, 1, 20] |
| 16-Oct-2026 10:08:11 | 2026-10-16 10:08:12 INFO name:: No table opened. |
| 16-Oct-2026 10:08:11 | 2026-10-16 10:08:12 INFO showcache:: The Table Cache is empty. |
| 16-Oct-2026 10:08:11 | test_tool_image_pbcor.py::ia_pbcor_test::test_empty_region_and_stokes |
| 16-Oct-2026 10:08:11 | Test specifying stokes with empty region works (CAS-11708) |
| 16-Oct-2026 10:08:11 | PASSED |
| 16-Oct-2026 10:08:11 | |
| 16-Oct-2026 10:08:11 | 2026-10-16 10:08:12 SEVERE image::open (file src/tools/image/image_cmpt.cc, line 4208) Exception Reported: Exception: File name is empty. |
| 16-Oct-2026 10:08:11 | 2026-10-16 10:08:12 SEVERE image::open (file src/tools/image/image_cmpt.cc, line 4208)+ ... thrown by static void casa::ImageFactory::_checkInfile(const casacore::String&) at File: /source/casa6/casatools/src/code/imageanalysis/ImageAnalysis/ImageFactory2.cc, line: 371 |
| 16-Oct-2026 10:08:11 | 2026-10-16 10:08:12 SEVERE image::open (file src/tools/image/image_cmpt.cc, line 4208) Exception Reported: Exception: File totally_bogus does not exist.. |
| 16-Oct-2026 10:08:11 | 2026-10-16 10:08:12 SEVERE image::open (file src/tools/image/image_cmpt.cc, line 4208)+ ... thrown by static void casa::ImageFactory::_checkInfile(const casacore::String&) at File: /source/casa6/casatools/src/code/imageanalysis/ImageAnalysis/ImageFactory2.cc, line: 375 |
| 16-Oct-2026 10:08:11 | 2026-10-16 10:08:12 INFO FITSCoordinateUtil::fromFITSHeader passing empty or nonexistant spectral Coordinate axis |
| 16-Oct-2026 10:08:11 | 2026-10-16 10:08:12 SEVERE image::pbcor (file src/tools/image/image_cmpt.cc, line 4289) Exception Reported: Exception: The image filename is empty. |
| 16-Oct-2026 10:08:11 | 2026-10-16 10:08:12 SEVERE image::pbcor (file src/tools/image/image_cmpt.cc, line 4289)+ ... thrown by static void casacore::ImageUtilities::openImage(casacore::ImageInterface<T>*&, const casacore::String&) [with T = float] at File: /source/casainstall/include/casacore/images/Images/ImageUtilities2.tcc, line: 255 |
| 16-Oct-2026 10:08:11 | 2026-10-16 10:08:12 INFO FITSCoordinateUtil::fromFITSHeader passing empty or nonexistant spectral Coordinate axis |
| 16-Oct-2026 10:08:11 | 2026-10-16 10:08:12 SEVERE image::pbcor (file src/tools/image/image_cmpt.cc, line 4289) Exception Reported: Exception: File 'totally_bogus2' does not exist. |
| 16-Oct-2026 10:08:11 | 2026-10-16 10:08:12 SEVERE image::pbcor (file src/tools/image/image_cmpt.cc, line 4289)+ ... thrown by static void casacore::ImageUtilities::openImage(casacore::ImageInterface<T>*&, const casacore::String&) [with T = float] at File: /source/casainstall/include/casacore/images/Images/ImageUtilities2.tcc, line: 260 |
| 16-Oct-2026 10:08:11 | 2026-10-16 10:08:12 INFO FITSCoordinateUtil::fromFITSHeader passing empty or nonexistant spectral Coordinate axis |
| 16-Oct-2026 10:08:11 | 2026-10-16 10:08:12 INFO FITSCoordinateUtil::fromFITSHeader passing empty or nonexistant spectral Coordinate axis |
| 16-Oct-2026 10:08:11 | 2026-10-16 10:08:12 SEVERE ImageInputProcessor::_process Requested output image /bogusplace/bogusimage cannot be created so will not be written |
| 16-Oct-2026 10:08:11 | 2026-10-16 10:08:12 SEVERE image::pbcor (file src/tools/image/image_cmpt.cc, line 4289) Exception Reported: 2026-10-16 10:08:12 SEVERE ImageInputProcessor::_process Requested output image /bogusplace/bogusimage cannot be created so will not be written |
| 16-Oct-2026 10:08:11 | 2026-10-16 10:08:12 INFO FITSCoordinateUtil::fromFITSHeader passing empty or nonexistant spectral Coordinate axis |
| 16-Oct-2026 10:08:11 | 2026-10-16 10:08:12 INFO FITSCoordinateUtil::fromFITSHeader passing empty or nonexistant spectral Coordinate axis |
| 16-Oct-2026 10:08:11 | 2026-10-16 10:08:12 WARN /home/casatest/casa6/casatestutils/nosedir/test_tool_image_pbcor/pbtest1_im.fits is not a valid or readable table |
| 16-Oct-2026 10:08:11 | 2026-10-16 10:08:12 SEVERE Cannot read image /home/casatest/casa6/casatestutils/nosedir/test_tool_image_pbcor/pbtest1_im.fits to get region bogus_region |
| 16-Oct-2026 10:08:11 | 2026-10-16 10:08:12 SEVERE image::pbcor (file src/tools/image/image_cmpt.cc, line 4289) Exception Reported: Unable to open region file or region table description bogus_region in image /home/casatest/casa6/casatestutils/nosedir/test_tool_image_pbcor/pbtest1_im.fits at File: /source/casa6/casatools/src/code/imageanalysis/Regions/CasacRegionManager.cc, line: 486 |
| 16-Oct-2026 10:08:11 | 2026-10-16 10:08:12 INFO FITSCoordinateUtil::fromFITSHeader passing empty or nonexistant spectral Coordinate axis |
| 16-Oct-2026 10:08:11 | 2026-10-16 10:08:12 INFO FITSCoordinateUtil::fromFITSHeader passing empty or nonexistant spectral Coordinate axis |
| 16-Oct-2026 10:08:11 | 2026-10-16 10:08:12 SEVERE image::pbcor (file src/tools/image/image_cmpt.cc, line 4289) Exception Reported: Unknown mode zz |
| 16-Oct-2026 10:08:11 | 2026-10-16 10:08:12 INFO FITSCoordinateUtil::fromFITSHeader passing empty or nonexistant spectral Coordinate axis |
| 16-Oct-2026 10:08:11 | 2026-10-16 10:08:12 INFO FITSCoordinateUtil::fromFITSHeader passing empty or nonexistant spectral Coordinate axis |
| 16-Oct-2026 10:08:11 | 2026-10-16 10:08:12 SEVERE image::pbcor (file src/tools/image/image_cmpt.cc, line 4289) Exception Reported: Coordinate systems of image and template are different: The DirectionCoordinates have differing LinearXform components at File: /source/casa6/casatools/src/code/imageanalysis/ImageAnalysis/ImagePrimaryBeamCorrector.cc, line: 141 |
| 16-Oct-2026 10:08:11 | 2026-10-16 10:08:12 INFO name:: No table opened. |
| 16-Oct-2026 10:08:11 | 2026-10-16 10:08:12 INFO showcache:: The Table Cache is empty. |
| 16-Oct-2026 10:08:11 | test_tool_image_pbcor.py::ia_pbcor_test::test_exceptions |
| 16-Oct-2026 10:08:11 | ia.pbcor: Test various exception cases |
| 16-Oct-2026 10:08:11 | PASSED |
| 16-Oct-2026 10:08:11 | |
| 16-Oct-2026 10:08:11 | 2026-10-16 10:08:12 INFO FITSCoordinateUtil::fromFITSHeader passing empty or nonexistant spectral Coordinate axis |
| 16-Oct-2026 10:08:11 | 2026-10-16 10:08:12 INFO FITSCoordinateUtil::fromFITSHeader passing empty or nonexistant spectral Coordinate axis |
| 16-Oct-2026 10:08:11 | 2026-10-16 10:08:12 INFO FITSCoordinateUtil::fromFITSHeader passing empty or nonexistant spectral Coordinate axis |
| 16-Oct-2026 10:08:11 | 2026-10-16 10:08:12 INFO CasacRegionManager::fromBCS No directional region specified. Using full positional plane. |
| 16-Oct-2026 10:08:11 | 2026-10-16 10:08:12 INFO ImageRegion::fromRecord Selected bounding box : |
| 16-Oct-2026 10:08:11 | 2026-10-16 10:08:12 INFO ImageRegion::fromRecord+ [0, 0] to [112, 75] (00:00:29.333, -00.07.24.000 to 23:59:29.600, +00.07.36.000) |
| 16-Oct-2026 10:08:11 | 2026-10-16 10:08:12 INFO ImageRegion::fromRecord Selected bounding box : |
| 16-Oct-2026 10:08:11 | 2026-10-16 10:08:12 INFO ImageRegion::fromRecord+ [0, 0] to [112, 75] (00:00:29.333, -00.07.24.000 to 23:59:29.600, +00.07.36.000) |
| 16-Oct-2026 10:08:11 | 2026-10-16 10:08:12 INFO SubImageFactory::createImage Creating image 'mypb.im' of shape [113, 76] |
| 16-Oct-2026 10:08:11 | 2026-10-16 10:08:12 INFO FITSCoordinateUtil::fromFITSHeader passing empty or nonexistant spectral Coordinate axis |
| 16-Oct-2026 10:08:11 | 2026-10-16 10:08:12 INFO FITSCoordinateUtil::fromFITSHeader passing empty or nonexistant spectral Coordinate axis |
| 16-Oct-2026 10:08:11 | 2026-10-16 10:08:12 INFO CasacRegionManager::fromBCS No directional region specified. Using full positional plane. |
| 16-Oct-2026 10:08:11 | 2026-10-16 10:08:12 INFO ImageRegion::fromRecord Selected bounding box : |
| 16-Oct-2026 10:08:11 | 2026-10-16 10:08:12 INFO ImageRegion::fromRecord+ [0, 0] to [112, 75] (00:00:29.333, -00.07.24.000 to 23:59:29.600, +00.07.36.000) |
| 16-Oct-2026 10:08:11 | 2026-10-16 10:08:12 INFO ImageRegion::fromRecord Selected bounding box : |
| 16-Oct-2026 10:08:11 | 2026-10-16 10:08:12 INFO ImageRegion::fromRecord+ [0, 0] to [112, 75] (00:00:29.333, -00.07.24.000 to 23:59:29.600, +00.07.36.000) |
| 16-Oct-2026 10:08:11 | 2026-10-16 10:08:12 INFO SubImageFactory::createImage Creating image 'mypb.im' of shape [113, 76] |
| 16-Oct-2026 10:08:12 | 2026-10-16 10:08:12 INFO FITSCoordinateUtil::fromFITSHeader passing empty or nonexistant spectral Coordinate axis |
| 16-Oct-2026 10:08:12 | 2026-10-16 10:08:12 INFO name:: No table opened. |
| 16-Oct-2026 10:08:12 | 2026-10-16 10:08:12 INFO showcache:: The Table Cache is empty. |
| 16-Oct-2026 10:08:12 | test_tool_image_pbcor.py::ia_pbcor_test::test_full_image_divide |
| 16-Oct-2026 10:08:12 | ia.pbcor: Test full image divide |
| 16-Oct-2026 10:08:12 | PASSED |
| 16-Oct-2026 10:08:12 | |
| 16-Oct-2026 10:08:12 | 2026-10-16 10:08:12 INFO FITSCoordinateUtil::fromFITSHeader passing empty or nonexistant spectral Coordinate axis |
| 16-Oct-2026 10:08:12 | 2026-10-16 10:08:12 INFO FITSCoordinateUtil::fromFITSHeader passing empty or nonexistant spectral Coordinate axis |
| 16-Oct-2026 10:08:12 | 2026-10-16 10:08:12 INFO FITSCoordinateUtil::fromFITSHeader passing empty or nonexistant spectral Coordinate axis |
| 16-Oct-2026 10:08:12 | 2026-10-16 10:08:12 INFO CasacRegionManager::fromBCS No directional region specified. Using full positional plane. |
| 16-Oct-2026 10:08:12 | 2026-10-16 10:08:12 INFO ImageRegion::fromRecord Selected bounding box : |
| 16-Oct-2026 10:08:12 | 2026-10-16 10:08:12 INFO ImageRegion::fromRecord+ [0, 0] to [112, 75] (00:00:29.333, -00.07.24.000 to 23:59:29.600, +00.07.36.000) |
| 16-Oct-2026 10:08:12 | 2026-10-16 10:08:12 INFO ImageRegion::fromRecord Selected bounding box : |
| 16-Oct-2026 10:08:12 | 2026-10-16 10:08:12 INFO ImageRegion::fromRecord+ [0, 0] to [112, 75] (00:00:29.333, -00.07.24.000 to 23:59:29.600, +00.07.36.000) |
| 16-Oct-2026 10:08:12 | 2026-10-16 10:08:12 INFO SubImageFactory::createImage Creating image 'mypb.im' of shape [113, 76] |
| 16-Oct-2026 10:08:12 | 2026-10-16 10:08:12 INFO ImageMaskAttacher::makeMask Created mask `mask0' |
| 16-Oct-2026 10:08:12 | 2026-10-16 10:08:12 INFO FITSCoordinateUtil::fromFITSHeader passing empty or nonexistant spectral Coordinate axis |
| 16-Oct-2026 10:08:12 | 2026-10-16 10:08:12 INFO CasacRegionManager::fromBCS No directional region specified. Using full positional plane. |
| 16-Oct-2026 10:08:12 | 2026-10-16 10:08:12 INFO ImageRegion::fromRecord Selected bounding box : |
| 16-Oct-2026 10:08:12 | 2026-10-16 10:08:12 INFO ImageRegion::fromRecord+ [0, 0] to [112, 75] (00:00:29.333, -00.07.24.000 to 23:59:29.600, +00.07.36.000) |
| 16-Oct-2026 10:08:12 | 2026-10-16 10:08:12 INFO ImageRegion::fromRecord Selected bounding box : |
| 16-Oct-2026 10:08:12 | 2026-10-16 10:08:12 INFO ImageRegion::fromRecord+ [0, 0] to [112, 75] (00:00:29.333, -00.07.24.000 to 23:59:29.600, +00.07.36.000) |
| 16-Oct-2026 10:08:12 | 2026-10-16 10:08:12 INFO SubImageFactory::createImage Creating image 'mypb.im' of shape [113, 76] |
| 16-Oct-2026 10:08:12 | 2026-10-16 10:08:12 INFO ImageMaskAttacher::makeMask Created mask `mask0' |
| 16-Oct-2026 10:08:12 | 2026-10-16 10:08:12 INFO name:: No table opened. |
| 16-Oct-2026 10:08:12 | 2026-10-16 10:08:12 INFO showcache:: The Table Cache is empty. |
| 16-Oct-2026 10:08:12 | test_tool_image_pbcor.py::ia_pbcor_test::test_full_image_using_cutoff |
| 16-Oct-2026 10:08:12 | ia.pbcor: Test full image divide with cutoff |
| 16-Oct-2026 10:08:12 | PASSED |
| 16-Oct-2026 10:08:12 | |
| 16-Oct-2026 10:08:12 | 2026-10-16 10:08:12 INFO ImageFactory::createImage Created Paged image 'zz.im' of shape [20, 20] with float valued pixels. |
| 16-Oct-2026 10:08:12 | 2026-10-16 10:08:13 INFO SubImageFactory::createImage Creating image 'pb_out.im' of shape [20, 20] |
| 16-Oct-2026 10:08:12 | 2026-10-16 10:08:12 INFO ::::ImageFactory::createImage Created Paged image 'zz.im' of shape [20, 20] with float valued pixels. |
| 16-Oct-2026 10:08:12 | 2026-10-16 10:08:12 INFO ::::image::fromshape Ran ia.fromshape |
| 16-Oct-2026 10:08:12 | 2026-10-16 10:08:12 INFO ::::image::fromshape ia.fromshape(outfile="zz.im", shape=[20,20], csys={...}, linear=false, overwrite=false, log=true, type="f") |
| 16-Oct-2026 10:08:12 | 2026-10-16 10:08:13 INFO ::::image::pbcor Ran ia.pbcor |
| 16-Oct-2026 10:08:12 | 2026-10-16 10:08:13 INFO ::::image::pbcor ia.pbcor(pbimage="(...)", outfile="pb_out.im", overwrite=false, box="", region={...}, chans="", stokes="", mask="", mode="divide", cutoff=-1.000000, stretch=false) |
| 16-Oct-2026 10:08:12 | 2026-10-16 10:08:13 INFO name:: No table opened. |
| 16-Oct-2026 10:08:12 | 2026-10-16 10:08:13 INFO showcache:: The Table Cache is empty. |
| 16-Oct-2026 10:08:12 | test_tool_image_pbcor.py::ia_pbcor_test::test_history |
| 16-Oct-2026 10:08:12 | Test history records are written |
| 16-Oct-2026 10:08:12 | PASSED |
| 16-Oct-2026 10:08:12 | |
| 16-Oct-2026 10:08:12 | 2026-10-16 10:08:13 INFO FITSCoordinateUtil::fromFITSHeader passing empty or nonexistant spectral Coordinate axis |
| 16-Oct-2026 10:08:12 | 2026-10-16 10:08:13 INFO ImageFactory::createImage Created Paged image 'mult_pb.im' of shape [113, 76] with float valued pixels. |
| 16-Oct-2026 10:08:12 | 2026-10-16 10:08:13 INFO CasacRegionManager::fromBCS No directional region specified. Using full positional plane. |
| 16-Oct-2026 10:08:12 | 2026-10-16 10:08:13 INFO CasacRegionManager::fromBCS Using all spectral channels. |
| 16-Oct-2026 10:08:12 | 2026-10-16 10:08:13 INFO CasacRegionManager::fromBCS Using polarizations ALL |
| 16-Oct-2026 10:08:12 | 2026-10-16 10:08:13 INFO ImageRegion::fromRecord Selected bounding box : |
| 16-Oct-2026 10:08:12 | 2026-10-16 10:08:13 INFO ImageRegion::fromRecord+ [0, 0, 0, 0] to [112, 75, 4, 1] (00:03:44.024, -00.38.00.046, 1.415e+09Hz, I to 23:56:15.977, +00.37.00.043, 1.415e+09Hz, Q) |
| 16-Oct-2026 10:08:12 | 2026-10-16 10:08:13 INFO ImageRegion::fromRecord Selected bounding box : |
| 16-Oct-2026 10:08:12 | 2026-10-16 10:08:13 INFO ImageRegion::fromRecord+ [0, 0, 0, 0] to [112, 75, 4, 1] (00:03:44.024, -00.38.00.046, 1.415e+09Hz, I to 23:56:15.977, +00.37.00.043, 1.415e+09Hz, Q) |
| 16-Oct-2026 10:08:12 | 2026-10-16 10:08:13 INFO SubImageFactory::createImage Creating image 'mypb.im' of shape [113, 76, 5, 2] |
| 16-Oct-2026 10:08:12 | 2026-10-16 10:08:13 INFO ImageMaskAttacher::makeMask Created mask `mask0' |
| 16-Oct-2026 10:08:12 | 2026-10-16 10:08:13 INFO ImageRegion::fromRecord Selected bounding box : |
| 16-Oct-2026 10:08:12 | 2026-10-16 10:08:13 INFO ImageRegion::fromRecord+ [0, 0, 0, 0] to [112, 75, 0, 0] (00:03:44.024, -00.38.00.046, 1.415e+09Hz, I to 23:56:15.977, +00.37.00.043, 1.415e+09Hz, I) |
| 16-Oct-2026 10:08:12 | 2026-10-16 10:08:13 INFO CasacRegionManager::fromBCS No directional region specified. Using full positional plane. |
| 16-Oct-2026 10:08:12 | 2026-10-16 10:08:13 INFO CasacRegionManager::fromBCS Using all spectral channels. |
| 16-Oct-2026 10:08:12 | 2026-10-16 10:08:13 INFO CasacRegionManager::fromBCS Using polarizations ALL |
| 16-Oct-2026 10:08:12 | 2026-10-16 10:08:13 INFO ImageRegion::fromRecord Selected bounding box : |
| 16-Oct-2026 10:08:12 | 2026-10-16 10:08:13 INFO ImageRegion::fromRecord+ [0, 0, 0, 0] to [112, 75, 4, 1] (00:03:44.024, -00.38.00.046, 1.415e+09Hz, I to 23:56:15.977, +00.37.00.043, 1.415e+09Hz, Q) |
| 16-Oct-2026 10:08:12 | 2026-10-16 10:08:13 INFO ImageRegion::fromRecord Selected bounding box : |
| 16-Oct-2026 10:08:12 | 2026-10-16 10:08:13 INFO ImageRegion::fromRecord+ [0, 0, 0, 0] to [112, 75, 4, 1] (00:03:44.024, -00.38.00.046, 1.415e+09Hz, I to 23:56:15.977, +00.37.00.043, 1.415e+09Hz, Q) |
| 16-Oct-2026 10:08:12 | 2026-10-16 10:08:13 INFO SubImageFactory::createImage Creating image 'mypb.im' of shape [113, 76, 5, 2] |
| 16-Oct-2026 10:08:12 | 2026-10-16 10:08:13 INFO ImageMaskAttacher::makeMask Created mask `mask0' |
| 16-Oct-2026 10:08:12 | 2026-10-16 10:08:13 INFO name:: No table opened. |
| 16-Oct-2026 10:08:12 | 2026-10-16 10:08:13 INFO showcache:: The Table Cache is empty. |
| 16-Oct-2026 10:08:12 | test_tool_image_pbcor.py::ia_pbcor_test::test_multiply |
| 16-Oct-2026 10:08:12 | ia.pbcor: Test full image multiply with cutoff. Primary beam is 2 D, image is 4 D |
| 16-Oct-2026 10:08:12 | PASSED |
| 16-Oct-2026 10:08:12 | |
| 16-Oct-2026 10:08:12 | 2026-10-16 10:08:13 INFO ImageFactory::createImage Created Temp image of shape [113, 76, 1, 1] with float valued pixels. |
| 16-Oct-2026 10:08:12 | 2026-10-16 10:08:13 INFO SubImageFactory::createImage Creating image 'maskim' of shape [113, 76, 1, 1] |
| 16-Oct-2026 10:08:13 | 2026-10-16 10:08:13 INFO FITSCoordinateUtil::fromFITSHeader passing empty or nonexistant spectral Coordinate axis |
| 16-Oct-2026 10:08:13 | 2026-10-16 10:08:13 SEVERE image::pbcor (file src/tools/image/image_cmpt.cc, line 4289) Exception Reported: The input image shape ([113, 76, 5, 2]) and mask shape ([113, 76, 1, 1]) are different, and it was specified that the mask should not be extended, so the mask cannot be applied to the (sub)image. Specifying that the mask should be extended may resolve the issue at File: /source/casainstall/include/casacpp/imageanalysis/ImageAnalysis/SubImageFactory.tcc, line: 306 |
| 16-Oct-2026 10:08:13 | 2026-10-16 10:08:13 WARN image::open (file src/tools/image/image_cmpt.cc, line 4208) Another image is already open, closing first |
| 16-Oct-2026 10:08:13 | 2026-10-16 10:08:13 INFO FITSCoordinateUtil::fromFITSHeader passing empty or nonexistant spectral Coordinate axis |
| 16-Oct-2026 10:08:13 | 2026-10-16 10:08:13 INFO SubImageFactory::createImage Creating image 'blahblah' of shape [113, 76, 5, 2] |
| 16-Oct-2026 10:08:13 | 2026-10-16 10:08:13 INFO ImageMaskAttacher::makeMask Created mask `mask0' |
| 16-Oct-2026 10:08:13 | 2026-10-16 10:08:13 INFO name:: No table opened. |
| 16-Oct-2026 10:08:13 | 2026-10-16 10:08:13 INFO showcache:: The Table Cache is empty. |
| 16-Oct-2026 10:08:13 | test_tool_image_pbcor.py::ia_pbcor_test::test_stretch |
| 16-Oct-2026 10:08:13 | ia.pbcor(): Test stretch parameter |
| 16-Oct-2026 10:08:13 | PASSED |
| 16-Oct-2026 10:08:13 | |
| 16-Oct-2026 10:08:13 | - generated xml file: /home/casatest/casa6/casatestutils/nosedir/xml/test_tool_image_pbcor/nose.xml - |
| 16-Oct-2026 10:08:13 | ========================= 9 passed, 1 warning in 2.75s ========================= |
| 16-Oct-2026 10:08:13 | ============================= test session starts ============================== |
| 16-Oct-2026 10:08:13 | platform linux -- Python 3.12.9, pytest-9.1.1, pluggy-1.7.0 -- /home/casatest/venv/bin/python3.12 |
| 16-Oct-2026 10:08:13 | cachedir: .pytest_cache |
| 16-Oct-2026 10:08:13 | rootdir: /home/casatest/casa6/casatestutils/nosedir/test_tool_synthesisutils |
| 16-Oct-2026 10:08:13 | configfile: pytest.ini |
| 16-Oct-2026 10:08:13 | collecting ... collected 13 items |
| 16-Oct-2026 10:08:13 | |
| 16-Oct-2026 10:08:13 | |
| 16-Oct-2026 10:08:13 | 2026-10-16 10:08:14 INFO image::_casaQuantityFromVar Will use values specified in major, minor, pa to set beam |
| 16-Oct-2026 10:08:13 | 2026-10-16 10:08:14 INFO BeamManipulator::set Setting (global) restoring beam. |
| 16-Oct-2026 10:08:13 | 2026-10-16 10:08:14 INFO BeamManipulator::set Beam parameters: Major : 1 arcsec |
| 16-Oct-2026 10:08:13 | 2026-10-16 10:08:14 INFO BeamManipulator::set+ Minor : 1 arcsec |
| 16-Oct-2026 10:08:13 | 2026-10-16 10:08:14 INFO BeamManipulator::set+ Position Angle : 0 deg |
| 16-Oct-2026 10:08:13 | 2026-10-16 10:08:14 INFO SIImageStore::Open existing Images SumWt does not exist. Proceeding only with PSF |
| 16-Oct-2026 10:08:13 | 2026-10-16 10:08:14 INFO SynthesisUtilMethods::fitPsfBeam Fitting PSF beam for Imagestore : su_fitpsfbeam_test_mfs |
| 16-Oct-2026 10:08:13 | 2026-10-16 10:08:14 INFO SIImageStore::getPSFGaussian Time to fit Gaussian to PSF 0.005234 |
| 16-Oct-2026 10:08:13 | 2026-10-16 10:08:14 INFO SIImageStore::printBeamSet Beam : 52.9301 arcsec, 49.1474 arcsec, -87.3942 deg |
| 16-Oct-2026 10:08:13 | test_tool_synthesisutils.py::fitpsfbeam_test::test_mfs |
| 16-Oct-2026 10:08:13 | Test that fitting of mfs psf works |
| 16-Oct-2026 10:08:13 | PASSED |
| 16-Oct-2026 10:08:13 | |
| 16-Oct-2026 10:08:14 | 2026-10-16 10:08:14 INFO image::_casaQuantityFromVar Will use values specified in major, minor, pa to set beam |
| 16-Oct-2026 10:08:14 | 2026-10-16 10:08:14 INFO BeamManipulator::set Setting (global) restoring beam. |
| 16-Oct-2026 10:08:14 | 2026-10-16 10:08:14 INFO BeamManipulator::set Beam parameters: Major : 1 arcsec |
| 16-Oct-2026 10:08:14 | 2026-10-16 10:08:14 INFO BeamManipulator::set+ Minor : 1 arcsec |
| 16-Oct-2026 10:08:14 | 2026-10-16 10:08:14 INFO BeamManipulator::set+ Position Angle : 0 deg |
| 16-Oct-2026 10:08:14 | 2026-10-16 10:08:14 INFO SIImageStore::Open existing Images SumWt does not exist. Proceeding only with PSF |
| 16-Oct-2026 10:08:14 | 2026-10-16 10:08:14 INFO SynthesisUtilMethods::fitPsfBeam Fitting PSF beam for Imagestore : su_fitpsfbeam_test_mfs |
| 16-Oct-2026 10:08:14 | 2026-10-16 10:08:14 INFO SIImageStore::getPSFGaussian Time to fit Gaussian to PSF 0.007002 |
| 16-Oct-2026 10:08:14 | 2026-10-16 10:08:14 INFO SIImageStore::printBeamSet Beam : 49.8956 arcsec, 46.8024 arcsec, -88.289 deg |
| 16-Oct-2026 10:08:14 | test_tool_synthesisutils.py::fitpsfbeam_test::test_mfs_largerpsfcutoff |
| 16-Oct-2026 10:08:14 | Test that psfcutoff with a valid (larger) number works |
| 16-Oct-2026 10:08:14 | PASSED |
| 16-Oct-2026 10:08:14 | |
| 16-Oct-2026 10:08:14 | test_tool_synthesisutils.py::fitpsfbeam_test::test_mfs_wrong_nterms |
| 16-Oct-2026 10:08:14 | Test that it catches if nterms is inconsistent with input psf (nterms=2, for a single term psf) |
| 16-Oct-2026 10:08:14 | PASSED |
| 16-Oct-2026 10:08:14 | |
| 16-Oct-2026 10:08:14 | 2026-10-16 10:08:14 WARN SynthesisUtilMethods::fitPsfBeam psfcutoff must be >0 and <1 |
| 16-Oct-2026 10:08:14 | 2026-10-16 10:08:14 WARN SynthesisUtilMethods::fitPsfBeam psfcutoff must be >0 and <1 |
| 16-Oct-2026 10:08:14 | test_tool_synthesisutils.py::fitpsfbeam_test::test_mfs_wrong_psfcutoff |
| 16-Oct-2026 10:08:14 | Test that psfcutoff is given outside the allowed range (1.0) |
| 16-Oct-2026 10:08:14 | PASSED |
| 16-Oct-2026 10:08:14 | |
| 16-Oct-2026 10:08:14 | 2026-10-16 10:08:14 INFO image::_casaQuantityFromVar Will use values specified in major, minor, pa to set beam |
| 16-Oct-2026 10:08:14 | 2026-10-16 10:08:14 INFO BeamManipulator::set Setting (global) restoring beam. |
| 16-Oct-2026 10:08:14 | 2026-10-16 10:08:14 INFO BeamManipulator::set Beam parameters: Major : 1 arcsec |
| 16-Oct-2026 10:08:14 | 2026-10-16 10:08:14 INFO BeamManipulator::set+ Minor : 1 arcsec |
| 16-Oct-2026 10:08:14 | 2026-10-16 10:08:14 INFO BeamManipulator::set+ Position Angle : 0 deg |
| 16-Oct-2026 10:08:14 | 2026-10-16 10:08:14 INFO SIImageStoreMultiTerm::Open existing Images SumWt.ttx do not exist. Proceeding only with PSFs |
| 16-Oct-2026 10:08:14 | 2026-10-16 10:08:14 INFO SynthesisUtilMethods::fitPsfBeam Fitting PSF beam for Imagestore : su_fitpsfbeam_test_mtmfs |
| 16-Oct-2026 10:08:14 | 2026-10-16 10:08:14 INFO SIImageStore::getPSFGaussian Time to fit Gaussian to PSF 0.004926 |
| 16-Oct-2026 10:08:14 | 2026-10-16 10:08:14 INFO SIImageStore::printBeamSet Beam : 52.9301 arcsec, 49.1474 arcsec, -87.3942 deg |
| 16-Oct-2026 10:08:14 | test_tool_synthesisutils.py::fitpsfbeam_test::test_mtmfs_nterms2 |
| 16-Oct-2026 10:08:14 | Test that fitting of multiterm psf works |
| 16-Oct-2026 10:08:14 | 2026-10-16 10:08:14 INFO name:: No table opened. |
| 16-Oct-2026 10:08:14 | 2026-10-16 10:08:14 INFO name:: No table opened. |
| 16-Oct-2026 10:08:14 | PASSED |
| 16-Oct-2026 10:08:14 | |
| 16-Oct-2026 10:08:14 | test_tool_synthesisutils.py::getoptimumsize_test::test_default |
| 16-Oct-2026 10:08:14 | Test default size |
| 16-Oct-2026 10:08:14 | PASSED |
| 16-Oct-2026 10:08:14 | |
| 16-Oct-2026 10:08:14 | test_tool_synthesisutils.py::getoptimumsize_test::test_evenimsize |
| 16-Oct-2026 10:08:14 | Test even non-optimal number |
| 16-Oct-2026 10:08:14 | PASSED |
| 16-Oct-2026 10:08:14 | |
| 16-Oct-2026 10:08:14 | test_tool_synthesisutils.py::getoptimumsize_test::test_oddimsize |
| 16-Oct-2026 10:08:14 | Test odd non-optimal number |
| 16-Oct-2026 10:08:14 | 2026-10-16 10:08:14 INFO name:: No table opened. |
| 16-Oct-2026 10:08:14 | 2026-10-16 10:08:14 INFO name:: No table opened. |
| 16-Oct-2026 10:08:14 | PASSED |
| 16-Oct-2026 10:08:14 | |
| 16-Oct-2026 10:08:17 | 2026-10-16 10:08:18 INFO msmetadata_cmpt.cc::open Performing internal consistency checks on twhya.short.ms... |
| 16-Oct-2026 10:08:17 | 2026-10-16 10:08:18 INFO msmetadata_cmpt.cc::open Performing internal consistency checks on twhya.short.ms... |
| 16-Oct-2026 10:08:18 | test_tool_synthesisutils.py::advisechansel_test::test_advisechanelsel_datasel |
| 16-Oct-2026 10:08:18 | Test that data selection parameters or given frequency range, etc is returned correctly |
| 16-Oct-2026 10:08:18 | PASSED |
| 16-Oct-2026 10:08:18 | |
| 16-Oct-2026 10:08:21 | test_tool_synthesisutils.py::advisechansel_test::test_advisechanelsel_datasel_ephem |
| 16-Oct-2026 10:08:21 | Test that data selection parameters for given frequency range,etc for ephemeris object is returned correctly |
| 16-Oct-2026 10:08:21 | PASSED |
| 16-Oct-2026 10:08:21 | |
| 16-Oct-2026 10:08:22 | 2026-10-16 10:08:22 SEVERE No MeasurementSet has been assigned, please give a valid ms in msname |
| 16-Oct-2026 10:08:22 | test_tool_synthesisutils.py::advisechansel_test::test_su_adivsechanel_defaults |
| 16-Oct-2026 10:08:22 | Test non specified parameter case for proper error/warning message |
| 16-Oct-2026 10:08:22 | PASSED |
| 16-Oct-2026 10:08:22 | |
| 16-Oct-2026 10:08:23 | test_tool_synthesisutils.py::advisechansel_test::test_su_adivsechansel_getfreqrange |
| 16-Oct-2026 10:08:23 | Test that frequency range for given data selections is returned correctly |
| 16-Oct-2026 10:08:23 | PASSED |
| 16-Oct-2026 10:08:23 | |
| 16-Oct-2026 10:08:24 | test_tool_synthesisutils.py::advisechansel_test::test_su_advisechansel_getfreqrange_ephem |
| 16-Oct-2026 10:08:24 | Test that frequency range for given data selections for an ephemeris object is returned correctly |
| 16-Oct-2026 10:08:24 | 2026-10-16 10:08:24 INFO name:: No table opened. |
| 16-Oct-2026 10:08:24 | 2026-10-16 10:08:24 INFO name:: No table opened. |
| 16-Oct-2026 10:08:24 | PASSED |
| 16-Oct-2026 10:08:24 | |
| 16-Oct-2026 10:08:24 | - generated xml file: /home/casatest/casa6/casatestutils/nosedir/xml/test_tool_synthesisutils/nose.xml - |
| 16-Oct-2026 10:08:24 | ======================== 13 passed, 1 warning in 11.03s ======================== |
| 16-Oct-2026 10:08:24 | |
| 16-Oct-2026 10:08:24 | |
| 16-Oct-2026 10:08:24 | Setting Working Directory: /home/casatest/casa6/casatestutils/nosedir/test_tool_ms_createmultims/ |
| 16-Oct-2026 10:08:24 | Test Directory: /home/casatest/casa6/casatestutils/nosedir/test_tool_ms_createmultims |
| 16-Oct-2026 10:08:24 | |
| 16-Oct-2026 10:08:24 | Running Command: pytest --junitxml=/home/casatest/casa6/casatestutils/nosedir/xml/test_tool_ms_createmultims/nose.xml -s --disable-pytest-warnings --verbose -ra --tb=short /home/casatest/casa6/casatestutils/nosedir/test_tool_ms_createmultims/ |
| 16-Oct-2026 10:08:24 | |
| 16-Oct-2026 10:08:24 | Setting Working Directory: /home/casatest/casa6/casatestutils/nosedir/test_tool_msmetadata/ |
| 16-Oct-2026 10:08:24 | Test Directory: /home/casatest/casa6/casatestutils/nosedir/test_tool_msmetadata |
| 16-Oct-2026 10:08:24 | |
| 16-Oct-2026 10:08:24 | Running Command: pytest --junitxml=/home/casatest/casa6/casatestutils/nosedir/xml/test_tool_msmetadata/nose.xml -s --disable-pytest-warnings --verbose -ra --tb=short /home/casatest/casa6/casatestutils/nosedir/test_tool_msmetadata/ |
| 16-Oct-2026 10:08:24 | |
| 16-Oct-2026 10:08:24 | Setting Working Directory: /home/casatest/casa6/casatestutils/nosedir/test_tool_image_deviation/ |
| 16-Oct-2026 10:08:24 | Test Directory: /home/casatest/casa6/casatestutils/nosedir/test_tool_image_deviation |
| 16-Oct-2026 10:08:24 | |
| 16-Oct-2026 10:08:24 | Running Command: pytest --junitxml=/home/casatest/casa6/casatestutils/nosedir/xml/test_tool_image_deviation/nose.xml -s --disable-pytest-warnings --verbose -ra --tb=short /home/casatest/casa6/casatestutils/nosedir/test_tool_image_deviation/ |
| 16-Oct-2026 10:08:24 | |
| 16-Oct-2026 10:08:24 | Setting Working Directory: /home/casatest/casa6/casatestutils/nosedir/test_tool_image_regrid/ |
| 16-Oct-2026 10:08:24 | Test Directory: /home/casatest/casa6/casatestutils/nosedir/test_tool_image_regrid |
| 16-Oct-2026 10:08:24 | |
| 16-Oct-2026 10:08:24 | Running Command: pytest --junitxml=/home/casatest/casa6/casatestutils/nosedir/xml/test_tool_image_regrid/nose.xml -s --disable-pytest-warnings --verbose -ra --tb=short /home/casatest/casa6/casatestutils/nosedir/test_tool_image_regrid/ |
| 16-Oct-2026 10:08:24 | |
| 16-Oct-2026 10:08:24 | Setting Working Directory: /home/casatest/casa6/casatestutils/nosedir/test_tool_image/ |
| 16-Oct-2026 10:08:24 | Test Directory: /home/casatest/casa6/casatestutils/nosedir/test_tool_image |
| 16-Oct-2026 10:08:24 | |
| 16-Oct-2026 10:08:24 | Running Command: pytest --junitxml=/home/casatest/casa6/casatestutils/nosedir/xml/test_tool_image/nose.xml -s --disable-pytest-warnings --verbose -ra --tb=short /home/casatest/casa6/casatestutils/nosedir/test_tool_image/ |
| 16-Oct-2026 10:08:24 | |
| 16-Oct-2026 10:08:24 | Setting Working Directory: /home/casatest/casa6/casatestutils/nosedir/test_tool_ms/ |
| 16-Oct-2026 10:08:24 | Test Directory: /home/casatest/casa6/casatestutils/nosedir/test_tool_ms |
| 16-Oct-2026 10:08:24 | |
| 16-Oct-2026 10:08:24 | Running Command: pytest --junitxml=/home/casatest/casa6/casatestutils/nosedir/xml/test_tool_ms/nose.xml -s --disable-pytest-warnings --verbose -ra --tb=short /home/casatest/casa6/casatestutils/nosedir/test_tool_ms/ |
| 16-Oct-2026 10:08:24 | |
| 16-Oct-2026 10:08:24 | Setting Working Directory: /home/casatest/casa6/casatestutils/nosedir/test_tool_ms_statwt/ |
| 16-Oct-2026 10:08:24 | Test Directory: /home/casatest/casa6/casatestutils/nosedir/test_tool_ms_statwt |
| 16-Oct-2026 10:08:24 | |
| 16-Oct-2026 10:08:24 | Running Command: pytest --junitxml=/home/casatest/casa6/casatestutils/nosedir/xml/test_tool_ms_statwt/nose.xml -s --disable-pytest-warnings --verbose -ra --tb=short /home/casatest/casa6/casatestutils/nosedir/test_tool_ms_statwt/ |
| 16-Oct-2026 10:08:24 | |
| 16-Oct-2026 10:08:24 | Setting Working Directory: /home/casatest/casa6/casatestutils/nosedir/test_tool_logsink/ |
| 16-Oct-2026 10:08:24 | Test Directory: /home/casatest/casa6/casatestutils/nosedir/test_tool_logsink |
| 16-Oct-2026 10:08:24 | |
| 16-Oct-2026 10:08:24 | Running Command: pytest --junitxml=/home/casatest/casa6/casatestutils/nosedir/xml/test_tool_logsink/nose.xml -s --disable-pytest-warnings --verbose -ra --tb=short /home/casatest/casa6/casatestutils/nosedir/test_tool_logsink/ |
| 16-Oct-2026 10:08:24 | |
| 16-Oct-2026 10:08:24 | Setting Working Directory: /home/casatest/casa6/casatestutils/nosedir/test_tool_calibrater/ |
| 16-Oct-2026 10:08:24 | Test Directory: /home/casatest/casa6/casatestutils/nosedir/test_tool_calibrater |
| 16-Oct-2026 10:08:24 | |
| 16-Oct-2026 10:08:24 | Running Command: pytest --junitxml=/home/casatest/casa6/casatestutils/nosedir/xml/test_tool_calibrater/nose.xml -s --disable-pytest-warnings --verbose -ra --tb=short /home/casatest/casa6/casatestutils/nosedir/test_tool_calibrater/ |
| 16-Oct-2026 10:08:24 | |
| 16-Oct-2026 10:08:24 | Setting Working Directory: /home/casatest/casa6/casatestutils/nosedir/test_tool_quanta/ |
| 16-Oct-2026 10:08:24 | Test Directory: /home/casatest/casa6/casatestutils/nosedir/test_tool_quanta |
| 16-Oct-2026 10:08:24 | |
| 16-Oct-2026 10:08:24 | Running Command: pytest --junitxml=/home/casatest/casa6/casatestutils/nosedir/xml/test_tool_quanta/nose.xml -s --disable-pytest-warnings --verbose -ra --tb=short /home/casatest/casa6/casatestutils/nosedir/test_tool_quanta/ |
| 16-Oct-2026 10:08:24 | |
| 16-Oct-2026 10:08:24 | Setting Working Directory: /home/casatest/casa6/casatestutils/nosedir/test_tool_image_subimage/ |
| 16-Oct-2026 10:08:24 | Test Directory: /home/casatest/casa6/casatestutils/nosedir/test_tool_image_subimage |
| 16-Oct-2026 10:08:24 | |
| 16-Oct-2026 10:08:24 | Running Command: pytest --junitxml=/home/casatest/casa6/casatestutils/nosedir/xml/test_tool_image_subimage/nose.xml -s --disable-pytest-warnings --verbose -ra --tb=short /home/casatest/casa6/casatestutils/nosedir/test_tool_image_subimage/ |
| 16-Oct-2026 10:08:24 | |
| 16-Oct-2026 10:08:24 | Setting Working Directory: /home/casatest/casa6/casatestutils/nosedir/test_tool_image_rebin/ |
| 16-Oct-2026 10:08:24 | Test Directory: /home/casatest/casa6/casatestutils/nosedir/test_tool_image_rebin |
| 16-Oct-2026 10:08:24 | |
| 16-Oct-2026 10:08:24 | Running Command: pytest --junitxml=/home/casatest/casa6/casatestutils/nosedir/xml/test_tool_image_rebin/nose.xml -s --disable-pytest-warnings --verbose -ra --tb=short /home/casatest/casa6/casatestutils/nosedir/test_tool_image_rebin/ |
| 16-Oct-2026 10:08:24 | |
| 16-Oct-2026 10:08:24 | Setting Working Directory: /home/casatest/casa6/casatestutils/nosedir/test_tool_msuvbinner/ |
| 16-Oct-2026 10:08:24 | Test Directory: /home/casatest/casa6/casatestutils/nosedir/test_tool_msuvbinner |
| 16-Oct-2026 10:08:24 | |
| 16-Oct-2026 10:08:24 | Running Command: pytest --junitxml=/home/casatest/casa6/casatestutils/nosedir/xml/test_tool_msuvbinner/nose.xml -s --disable-pytest-warnings --verbose -ra --tb=short /home/casatest/casa6/casatestutils/nosedir/test_tool_msuvbinner/ |
| 16-Oct-2026 10:08:24 | |
| 16-Oct-2026 10:08:24 | Setting Working Directory: /home/casatest/casa6/casatestutils/nosedir/test_tool_table/ |
| 16-Oct-2026 10:08:24 | Test Directory: /home/casatest/casa6/casatestutils/nosedir/test_tool_table |
| 16-Oct-2026 10:08:24 | |
| 16-Oct-2026 10:08:24 | Running Command: pytest --junitxml=/home/casatest/casa6/casatestutils/nosedir/xml/test_tool_table/nose.xml -s --disable-pytest-warnings --verbose -ra --tb=short /home/casatest/casa6/casatestutils/nosedir/test_tool_table/ |
| 16-Oct-2026 10:08:24 | |
| 16-Oct-2026 10:08:24 | Setting Working Directory: /home/casatest/casa6/casatestutils/nosedir/test_tool_image_fitprofile/ |
| 16-Oct-2026 10:08:24 | Test Directory: /home/casatest/casa6/casatestutils/nosedir/test_tool_image_fitprofile |
| 16-Oct-2026 10:08:24 | |
| 16-Oct-2026 10:08:24 | Running Command: pytest --junitxml=/home/casatest/casa6/casatestutils/nosedir/xml/test_tool_image_fitprofile/nose.xml -s --disable-pytest-warnings --verbose -ra --tb=short /home/casatest/casa6/casatestutils/nosedir/test_tool_image_fitprofile/ |
| 16-Oct-2026 10:08:24 | |
| 16-Oct-2026 10:08:24 | Setting Working Directory: /home/casatest/casa6/casatestutils/nosedir/test_tool_image_collapse/ |
| 16-Oct-2026 10:08:24 | Test Directory: /home/casatest/casa6/casatestutils/nosedir/test_tool_image_collapse |
| 16-Oct-2026 10:08:24 | |
| 16-Oct-2026 10:08:24 | Running Command: pytest --junitxml=/home/casatest/casa6/casatestutils/nosedir/xml/test_tool_image_collapse/nose.xml -s --disable-pytest-warnings --verbose -ra --tb=short /home/casatest/casa6/casatestutils/nosedir/test_tool_image_collapse/ |
| 16-Oct-2026 10:08:24 | |
| 16-Oct-2026 10:08:24 | Setting Working Directory: /home/casatest/casa6/casatestutils/nosedir/test_tool_image_pbcor/ |
| 16-Oct-2026 10:08:24 | Test Directory: /home/casatest/casa6/casatestutils/nosedir/test_tool_image_pbcor |
| 16-Oct-2026 10:08:24 | |
| 16-Oct-2026 10:08:24 | Running Command: pytest --junitxml=/home/casatest/casa6/casatestutils/nosedir/xml/test_tool_image_pbcor/nose.xml -s --disable-pytest-warnings --verbose -ra --tb=short /home/casatest/casa6/casatestutils/nosedir/test_tool_image_pbcor/ |
| 16-Oct-2026 10:08:24 | |
| 16-Oct-2026 10:08:24 | Setting Working Directory: /home/casatest/casa6/casatestutils/nosedir/test_tool_synthesisutils/ |
| 16-Oct-2026 10:08:24 | Test Directory: /home/casatest/casa6/casatestutils/nosedir/test_tool_synthesisutils |
| 16-Oct-2026 10:08:24 | |
| 16-Oct-2026 10:08:24 | Running Command: pytest --junitxml=/home/casatest/casa6/casatestutils/nosedir/xml/test_tool_synthesisutils/nose.xml -s --disable-pytest-warnings --verbose -ra --tb=short /home/casatest/casa6/casatestutils/nosedir/test_tool_synthesisutils/ |
| 16-Oct-2026 10:08:25 | total 291012 |
| 16-Oct-2026 10:08:25 | -rw-r--r-- 1 casaci 15001 161014 Oct 16 09:54 casatestutils-6.7.7.15-py3-none-any.whl |
| 16-Oct-2026 10:08:25 | -rw-r--r-- 1 casaci 15001 297661441 Oct 16 09:54 casatools-6.7.7.15-cp312-cp312-manylinux_2_28_x86_64.whl |
| 16-Oct-2026 10:08:25 | -rw-r--r-- 1 casaci root 4340 Oct 16 10:08 test_tool_agentflagger.xml |
| 16-Oct-2026 10:08:25 | -rw-r--r-- 1 casaci root 1006 Oct 16 10:08 test_tool_calanalysis.xml |
| 16-Oct-2026 10:08:25 | -rw-r--r-- 1 casaci root 2656 Oct 16 10:08 test_tool_calibrater.xml |
| 16-Oct-2026 10:08:25 | -rw-r--r-- 1 casaci root 687 Oct 16 10:08 test_tool_componentlist.xml |
| 16-Oct-2026 10:08:25 | -rw-r--r-- 1 casaci root 7467 Oct 16 10:08 test_tool_coordsys.xml |
| 16-Oct-2026 10:08:25 | -rw-r--r-- 1 casaci root 12935 Oct 16 10:08 test_tool_image.xml |
| 16-Oct-2026 10:08:25 | -rw-r--r-- 1 casaci root 2220 Oct 16 10:08 test_tool_image_collapse.xml |
| 16-Oct-2026 10:08:25 | -rw-r--r-- 1 casaci root 1048 Oct 16 10:08 test_tool_image_deviation.xml |
| 16-Oct-2026 10:08:25 | -rw-r--r-- 1 casaci root 2575 Oct 16 10:08 test_tool_image_fitprofile.xml |
| 16-Oct-2026 10:08:25 | -rw-r--r-- 1 casaci root 1178 Oct 16 10:08 test_tool_image_pbcor.xml |
| 16-Oct-2026 10:08:25 | -rw-r--r-- 1 casaci root 883 Oct 16 10:08 test_tool_image_pv.xml |
| 16-Oct-2026 10:08:25 | -rw-r--r-- 1 casaci root 1006 Oct 16 10:08 test_tool_image_rebin.xml |
| 16-Oct-2026 10:08:25 | -rw-r--r-- 1 casaci root 1336 Oct 16 10:08 test_tool_image_regrid.xml |
| 16-Oct-2026 10:08:25 | -rw-r--r-- 1 casaci root 1639 Oct 16 10:08 test_tool_image_statistics.xml |
| 16-Oct-2026 10:08:25 | -rw-r--r-- 1 casaci root 765 Oct 16 10:08 test_tool_image_subimage.xml |
| 16-Oct-2026 10:08:25 | -rw-r--r-- 1 casaci root 890 Oct 16 10:08 test_tool_image_transpose.xml |
| 16-Oct-2026 10:08:25 | -rw-r--r-- 1 casaci root 1966 Oct 16 10:08 test_tool_imagepol.xml |
| 16-Oct-2026 10:08:25 | -rw-r--r-- 1 casaci root 839 Oct 16 10:08 test_tool_linearmosaic.xml |
| 16-Oct-2026 10:08:25 | -rw-r--r-- 1 casaci root 669 Oct 16 10:08 test_tool_logsink.xml |
| 16-Oct-2026 10:08:25 | -rw-r--r-- 1 casaci root 549 Oct 16 10:08 test_tool_measures.xml |
| 16-Oct-2026 10:08:25 | -rw-r--r-- 1 casaci root 5224 Oct 16 10:08 test_tool_ms.xml |
| 16-Oct-2026 10:08:25 | -rw-r--r-- 1 casaci root 367 Oct 16 10:08 test_tool_ms_createmultims.xml |
| 16-Oct-2026 10:08:25 | -rw-r--r-- 1 casaci root 2095 Oct 16 10:08 test_tool_ms_statwt.xml |
| 16-Oct-2026 10:08:25 | -rw-r--r-- 1 casaci root 8633 Oct 16 10:08 test_tool_msmetadata.xml |
| 16-Oct-2026 10:08:25 | -rw-r--r-- 1 casaci root 359 Oct 16 10:08 test_tool_msuvbinner.xml |
| 16-Oct-2026 10:08:25 | -rw-r--r-- 1 casaci root 1171 Oct 16 10:08 test_tool_quanta.xml |
| 16-Oct-2026 10:08:25 | -rw-r--r-- 1 casaci root 3977 Oct 16 10:08 test_tool_regionmanager.xml |
| 16-Oct-2026 10:08:25 | -rw-r--r-- 1 casaci root 2072 Oct 16 10:08 test_tool_sdm.xml |
| 16-Oct-2026 10:08:25 | -rw-r--r-- 1 casaci root 2194 Oct 16 10:08 test_tool_sdm_toms.xml |
| 16-Oct-2026 10:08:25 | -rw-r--r-- 1 casaci root 670 Oct 16 10:08 test_tool_simulator.xml |
| 16-Oct-2026 10:08:25 | -rw-r--r-- 1 casaci root 1717 Oct 16 10:08 test_tool_synthesisutils.xml |
| 16-Oct-2026 10:08:25 | -rw-r--r-- 1 casaci root 1462 Oct 16 10:08 test_tool_table.xml |
| 16-Oct-2026 10:08:25 | -rw-r--r-- 1 casaci root 1717 Oct 16 10:08 test_tool_vpmanager.xml |
| 16-Oct-2026 10:08:25 | Finished task 'Test wheel' with result: Success |
| 16-Oct-2026 10:08:25 | Starting task 'Tar work directory' of type 'com.atlassian.bamboo.plugins.scripttask:task.builder.script' |
| 16-Oct-2026 10:08:25 | Beginning to execute external process for build 'CASASPECS - Master Test GPU 3.12 - Test Tools Many Linux 2.28 Rocky 8.10 Py3.12 #183 (CASASPECS-MASTERTESTGPUPY312-TTOMLPY312-183)' ... running command line: /export/cvpost134-nvme/casa/bamboohome/temp/CASASPECS-MASTERTESTGPUPY312-TTOMLPY312-183-ScriptBuildTask-6784186806953055527.sh ... in: /export/cvpost134-nvme/casa/bamboohome/xml-data/build-dir/CASASPECS-MASTERTESTGPUPY312-TTOMLPY312 |
| 16-Oct-2026 10:08:25 | Package working directory |
| 16-Oct-2026 10:08:25 | tar: work: Cannot stat: No such file or directory |
| 16-Oct-2026 10:08:25 | tar: Exiting with failure status due to previous errors |
| 16-Oct-2026 10:08:25 | total 291016 |
| 16-Oct-2026 10:08:25 | -rw-r--r-- 1 casaci 15001 161014 Oct 16 09:54 casatestutils-6.7.7.15-py3-none-any.whl |
| 16-Oct-2026 10:08:25 | -rw-r--r-- 1 casaci 15001 297661441 Oct 16 09:54 casatools-6.7.7.15-cp312-cp312-manylinux_2_28_x86_64.whl |
| 16-Oct-2026 10:08:25 | -rw-r--r-- 1 casaci root 4340 Oct 16 10:08 test_tool_agentflagger.xml |
| 16-Oct-2026 10:08:25 | -rw-r--r-- 1 casaci root 1006 Oct 16 10:08 test_tool_calanalysis.xml |
| 16-Oct-2026 10:08:25 | -rw-r--r-- 1 casaci root 2656 Oct 16 10:08 test_tool_calibrater.xml |
| 16-Oct-2026 10:08:25 | -rw-r--r-- 1 casaci root 687 Oct 16 10:08 test_tool_componentlist.xml |
| 16-Oct-2026 10:08:25 | -rw-r--r-- 1 casaci root 7467 Oct 16 10:08 test_tool_coordsys.xml |
| 16-Oct-2026 10:08:25 | -rw-r--r-- 1 casaci root 12935 Oct 16 10:08 test_tool_image.xml |
| 16-Oct-2026 10:08:25 | -rw-r--r-- 1 casaci root 2220 Oct 16 10:08 test_tool_image_collapse.xml |
| 16-Oct-2026 10:08:25 | -rw-r--r-- 1 casaci root 1048 Oct 16 10:08 test_tool_image_deviation.xml |
| 16-Oct-2026 10:08:25 | -rw-r--r-- 1 casaci root 2575 Oct 16 10:08 test_tool_image_fitprofile.xml |
| 16-Oct-2026 10:08:25 | -rw-r--r-- 1 casaci root 1178 Oct 16 10:08 test_tool_image_pbcor.xml |
| 16-Oct-2026 10:08:25 | -rw-r--r-- 1 casaci root 883 Oct 16 10:08 test_tool_image_pv.xml |
| 16-Oct-2026 10:08:25 | -rw-r--r-- 1 casaci root 1006 Oct 16 10:08 test_tool_image_rebin.xml |
| 16-Oct-2026 10:08:25 | -rw-r--r-- 1 casaci root 1336 Oct 16 10:08 test_tool_image_regrid.xml |
| 16-Oct-2026 10:08:25 | -rw-r--r-- 1 casaci root 1639 Oct 16 10:08 test_tool_image_statistics.xml |
| 16-Oct-2026 10:08:25 | -rw-r--r-- 1 casaci root 765 Oct 16 10:08 test_tool_image_subimage.xml |
| 16-Oct-2026 10:08:25 | -rw-r--r-- 1 casaci root 890 Oct 16 10:08 test_tool_image_transpose.xml |
| 16-Oct-2026 10:08:25 | -rw-r--r-- 1 casaci root 1966 Oct 16 10:08 test_tool_imagepol.xml |
| 16-Oct-2026 10:08:25 | -rw-r--r-- 1 casaci root 839 Oct 16 10:08 test_tool_linearmosaic.xml |
| 16-Oct-2026 10:08:25 | -rw-r--r-- 1 casaci root 669 Oct 16 10:08 test_tool_logsink.xml |
| 16-Oct-2026 10:08:25 | -rw-r--r-- 1 casaci root 549 Oct 16 10:08 test_tool_measures.xml |
| 16-Oct-2026 10:08:25 | -rw-r--r-- 1 casaci root 5224 Oct 16 10:08 test_tool_ms.xml |
| 16-Oct-2026 10:08:25 | -rw-r--r-- 1 casaci root 367 Oct 16 10:08 test_tool_ms_createmultims.xml |
| 16-Oct-2026 10:08:25 | -rw-r--r-- 1 casaci root 2095 Oct 16 10:08 test_tool_ms_statwt.xml |
| 16-Oct-2026 10:08:25 | -rw-r--r-- 1 casaci root 8633 Oct 16 10:08 test_tool_msmetadata.xml |
| 16-Oct-2026 10:08:25 | -rw-r--r-- 1 casaci root 359 Oct 16 10:08 test_tool_msuvbinner.xml |
| 16-Oct-2026 10:08:25 | -rw-r--r-- 1 casaci root 1171 Oct 16 10:08 test_tool_quanta.xml |
| 16-Oct-2026 10:08:25 | -rw-r--r-- 1 casaci root 3977 Oct 16 10:08 test_tool_regionmanager.xml |
| 16-Oct-2026 10:08:25 | -rw-r--r-- 1 casaci root 2072 Oct 16 10:08 test_tool_sdm.xml |
| 16-Oct-2026 10:08:25 | -rw-r--r-- 1 casaci root 2194 Oct 16 10:08 test_tool_sdm_toms.xml |
| 16-Oct-2026 10:08:25 | -rw-r--r-- 1 casaci root 670 Oct 16 10:08 test_tool_simulator.xml |
| 16-Oct-2026 10:08:25 | -rw-r--r-- 1 casaci root 1717 Oct 16 10:08 test_tool_synthesisutils.xml |
| 16-Oct-2026 10:08:25 | -rw-r--r-- 1 casaci root 1462 Oct 16 10:08 test_tool_table.xml |
| 16-Oct-2026 10:08:25 | -rw-r--r-- 1 casaci root 1717 Oct 16 10:08 test_tool_vpmanager.xml |
| 16-Oct-2026 10:08:25 | -rw-r--r-- 1 casaci root 45 Oct 16 10:08 work-manylinux_228_casatools-3.12.tar.gz |
| 16-Oct-2026 10:08:25 | Done packaging working directory |
| 16-Oct-2026 10:08:25 | Finished task 'Tar work directory' with result: Success |
| 16-Oct-2026 10:08:25 | Starting task 'Parse tests' of type 'com.atlassian.bamboo.plugins.testresultparser:task.testresultparser.junit' |
| 16-Oct-2026 10:08:25 | Parsing test results under /export/cvpost134-nvme/casa/bamboohome/xml-data/build-dir/CASASPECS-MASTERTESTGPUPY312-TTOMLPY312... |
| 16-Oct-2026 10:08:25 | Finished task 'Parse tests' with result: Success |
| 16-Oct-2026 10:08:25 | Starting task 'Cleanup' of type 'com.atlassian.bamboo.plugins.scripttask:task.builder.script' |
| 16-Oct-2026 10:08:25 | Beginning to execute external process for build 'CASASPECS - Master Test GPU 3.12 - Test Tools Many Linux 2.28 Rocky 8.10 Py3.12 #183 (CASASPECS-MASTERTESTGPUPY312-TTOMLPY312-183)' ... running command line: /export/cvpost134-nvme/casa/bamboohome/temp/CASASPECS-MASTERTESTGPUPY312-TTOMLPY312-183-ScriptBuildTask-12836092811462406503.sh ... in: /export/cvpost134-nvme/casa/bamboohome/xml-data/build-dir/CASASPECS-MASTERTESTGPUPY312-TTOMLPY312 |
| 16-Oct-2026 10:08:25 | Starting cleanup |
| 16-Oct-2026 10:08:35 | wheel-container-test |
| 16-Oct-2026 10:08:40 | wheel-container-test |
| 16-Oct-2026 10:08:40 | Cleanup complete |
| 16-Oct-2026 10:08:40 | Finished task 'Cleanup' with result: Success |
| 16-Oct-2026 10:08:40 | Running post build plugin 'Docker Container Cleanup' |
| 16-Oct-2026 10:08:40 | Running post build plugin 'NCover Results Collector' |
| 16-Oct-2026 10:08:40 | Running post build plugin 'Build Results Label Collector' |
| 16-Oct-2026 10:08:40 | Running post build plugin 'Clover Results Collector' |
| 16-Oct-2026 10:08:40 | Running post build plugin 'npm Cache Cleanup' |
| 16-Oct-2026 10:08:40 | Running post build plugin 'Artifact Copier' |
| 16-Oct-2026 10:08:40 | Publishing an artifact: Workdir |
| 16-Oct-2026 10:08:40 | Finished publishing of artifact Non required job artifact Http Compression On : [Workdir], patterns: [work*.tar.gz] anchored at: [wheeldirectory/] in 45.82 ms |
| 16-Oct-2026 10:08:40 | Publishing an artifact: Tests |
| 16-Oct-2026 10:08:40 | Finished publishing of artifact Non required job artifact Http Compression On : [Tests], patterns: [*.xml] anchored at: [wheeldirectory/] in 160.5 ms |
| 16-Oct-2026 10:08:40 | Publishing an artifact: xml Directories |
| 16-Oct-2026 10:08:40 | Finished publishing of artifact Non required job artifact Http Compression On : [xml Directories], patterns: [**/*.xml] anchored at: [wheeldirectory/] in 188.8 ms |
| 16-Oct-2026 10:08:40 | Finalising the build... |
| 16-Oct-2026 10:08:40 | Stopping timer. |
| 16-Oct-2026 10:08:40 | Build CASASPECS-MASTERTESTGPUPY312-TTOMLPY312-183 completed. |
| 16-Oct-2026 06:08:41 | Running on server: post build plugin 'Build Hanging Detection Configuration' |
| 16-Oct-2026 06:08:41 | Running on server: post build plugin 'NCover Results Collector' |
| 16-Oct-2026 06:08:41 | Running on server: post build plugin 'Build Labeller' |
| 16-Oct-2026 06:08:41 | Running on server: post build plugin 'Clover Delta Calculator' |
| 16-Oct-2026 06:08:41 | Running on server: post build plugin 'Maven Dependencies Postprocessor' |
| 16-Oct-2026 06:08:41 | All post build plugins have finished |
| 16-Oct-2026 06:08:41 | Generating build results summary... |
| 16-Oct-2026 06:08:41 | Saving build results to disk... |
| 16-Oct-2026 06:08:41 | Store variable context... |
| 16-Oct-2026 06:08:41 | Finished building CASASPECS-MASTERTESTGPUPY312-TTOMLPY312-183. |