Build: #183 failed Child of CASASPECS-MASTERBUILDCASALITHGPU-198
Build result summary
Details
- Completed
- Queue duration
- 4 seconds
- Duration
- 358 minutes
- Labels
- None
- Revisions
-
- CASA6
-
4a2f0283aedf0f0442dbedf93188527425d6bfb4
- OPEN-CASA-PKG
-
e5285e68467f01199807a1f1a978aec8a4781be7
- Total tests
- 4415
- Failing since
- #180 (Child of CASASPECS-MASTERBUILDCASALITHGPU-195 – )
Tests
- 0 New failures
- 2 Existing failures
- 0 Fixed
- 143 Quarantined / skipped
Responsible
-
Bob Garwood
Automatically assigned
-
Kumar Golap
Automatically assigned
Code commits
Tests
| Status | Test | Failing since | View job | Duration | |
|---|---|---|---|---|---|
|
test_task_tclean
test_widefield.test_widefield_awphpg_mtmfs_via_cube
|
Failing since build #180 (Child of CASASPECS-MASTERBUILDCASALITHGPU-195) | Test Tasks Many Linux 2.28 Rocky 8.10 Py3.12 | 22 secs | ||
AssertionError: False is not true
test_task_tclean.py:4514: in test_widefield_awphpg_mtmfs_via_cube
self.assertTrue(self.check_final(report))
E AssertionError: False is not true
|
|||||
|
test_task_tclean
test_wproject.test_wterm_awphpg
|
Failing since build #180 (Child of CASASPECS-MASTERBUILDCASALITHGPU-195) | Test Tasks Many Linux 2.28 Rocky 8.10 Py3.12 | 39 secs | ||
AssertionError: False is not true
test_task_tclean.py:4254: in test_wterm_awphpg
self.assertTrue(self.check_final(report))
E AssertionError: False is not true
|
|||||
Jira issues
| Issue | Description | Status | |
|---|---|---|---|
| Unknown Issue Type | CAS-7382 | Could not obtain issue details from Jira | |
| Unknown Issue Type | CAS-14767 | Could not obtain issue details from Jira | |