Build: #183 failed

Job: Test Tasks Many Linux 2.28 Rocky 8.10 Py3.12 failed

Build log

The build generated 66,153 lines of output.   The output is too long and has been truncated to the last 1,000 lines. Download or view full build log.

16-Oct-2026 15:47:11 2026-10-16 15:47:11        WARN        CTPatchedInterp::interpolate        In caltable doublecircletest_const.ms.sky (SDSKY_PS):
16-Oct-2026 15:47:11 2026-10-16 15:47:11        WARN        CTPatchedInterp::interpolate+         Insufficient solution channel sampling (nchan=1) for frequency-dependent LINEAR interpolation
16-Oct-2026 15:47:11 2026-10-16 15:47:11        WARN        CTPatchedInterp::interpolate+         of calibration for MS spw=1; using NEAREST instead.
16-Oct-2026 15:47:11 2026-10-16 15:47:11        WARN        CTPatchedInterp::interpolate        In caltable doublecircletest_const.ms.tsys (B TSYS):
16-Oct-2026 15:47:11 2026-10-16 15:47:11        WARN        CTPatchedInterp::interpolate+         Insufficient solution channel sampling (nchan=1) for frequency-dependent LINEAR interpolation
16-Oct-2026 15:47:11 2026-10-16 15:47:11        WARN        CTPatchedInterp::interpolate+         of calibration for MS spw=1; using NEAREST instead.
16-Oct-2026 15:47:16
16-Oct-2026 15:47:16 test_preapply03: both tsys and sky caltables are applied (resulting variable factor).
16-Oct-2026 15:47:16 [[0.9983687687153909]
16-Oct-2026 15:47:16 [0.9983687687153909]]
16-Oct-2026 15:47:16 [[0.9983687687153909]
16-Oct-2026 15:47:16 [0.9983687687153909]]
16-Oct-2026 15:47:16 PASSED
16-Oct-2026 15:47:16
16-Oct-2026 15:47:16 test_task_sdgaincal.py::sdgaincal_preapply_test::test_preapply04 2026-10-16 15:47:16        WARN        sdcal::calibrater::setvi(bool,bool)        Already using OLD VisibilityIterator.
16-Oct-2026 15:47:16 The following MS spws have no corresponding cal spws in doublecircletest_const.ms.tsys: 4 5 6 7
16-Oct-2026 15:47:16 The following MS spws have no corresponding cal spws in doublecircletest_const.ms.sky: 4 5 6 7
16-Oct-2026 15:47:25 2026-10-16 15:47:26        WARN        CTPatchedInterp::interpolate        In caltable doublecircletest_const.ms.sky (SDSKY_PS):
16-Oct-2026 15:47:25 2026-10-16 15:47:26        WARN        CTPatchedInterp::interpolate+         Insufficient solution channel sampling (nchan=1) for frequency-dependent LINEAR interpolation
16-Oct-2026 15:47:25 2026-10-16 15:47:26        WARN        CTPatchedInterp::interpolate+         of calibration for MS spw=0; using NEAREST instead.
16-Oct-2026 15:47:25 2026-10-16 15:47:26        WARN        CTPatchedInterp::interpolate        In caltable doublecircletest_const.ms.tsys (B TSYS):
16-Oct-2026 15:47:25 2026-10-16 15:47:26        WARN        CTPatchedInterp::interpolate+         Insufficient solution channel sampling (nchan=1) for frequency-dependent LINEAR interpolation
16-Oct-2026 15:47:25 2026-10-16 15:47:26        WARN        CTPatchedInterp::interpolate+         of calibration for MS spw=0 (mapped to CT spw=2); using NEAREST instead.
16-Oct-2026 15:47:30 2026-10-16 15:47:30        WARN        CTPatchedInterp::interpolate        In caltable doublecircletest_const.ms.sky (SDSKY_PS):
16-Oct-2026 15:47:30 2026-10-16 15:47:30        WARN        CTPatchedInterp::interpolate+         Insufficient solution channel sampling (nchan=1) for frequency-dependent LINEAR interpolation
16-Oct-2026 15:47:30 2026-10-16 15:47:30        WARN        CTPatchedInterp::interpolate+         of calibration for MS spw=1; using NEAREST instead.
16-Oct-2026 15:47:30 2026-10-16 15:47:30        WARN        CTPatchedInterp::interpolate        In caltable doublecircletest_const.ms.tsys (B TSYS):
16-Oct-2026 15:47:30 2026-10-16 15:47:30        WARN        CTPatchedInterp::interpolate+         Insufficient solution channel sampling (nchan=1) for frequency-dependent LINEAR interpolation
16-Oct-2026 15:47:30 2026-10-16 15:47:30        WARN        CTPatchedInterp::interpolate+         of calibration for MS spw=1 (mapped to CT spw=3); using NEAREST instead.
16-Oct-2026 15:47:35
16-Oct-2026 15:47:35 test_preapply04: transfer Tsys from [2,3] to [0,1].
16-Oct-2026 15:47:35 before  [0 1 0 1]
16-Oct-2026 15:47:35 after [2 3 2 3]
16-Oct-2026 15:47:35 [[0.9983687687153909]
16-Oct-2026 15:47:35 [0.9983687687153909]]
16-Oct-2026 15:47:35 [[0.9983687687153909]
16-Oct-2026 15:47:35 [0.9983687687153909]]
16-Oct-2026 15:47:35 PASSED
16-Oct-2026 15:47:35
16-Oct-2026 15:47:55 test_task_sdgaincal.py::sdgaincal_single_polarization_test::test_single_pol
16-Oct-2026 15:47:55 test_single_pol: test single-polarization calibration (YY).
16-Oct-2026 15:47:55 [[1.0]
16-Oct-2026 15:47:55 [--]]
16-Oct-2026 15:47:55 [[1.0]
16-Oct-2026 15:47:55 [--]]
16-Oct-2026 15:47:55 sdgaincal_single_polarization_test._verify_param_and_flag
16-Oct-2026 15:47:55 PASSED
16-Oct-2026 15:47:55
16-Oct-2026 15:47:55 - generated xml file: /home/casatest/casa6/casatestutils/nosedir/xml/test_task_sdgaincal/nose.xml -
16-Oct-2026 15:47:55 ================== 13 passed, 1 warning in 172.35s (0:02:52) ===================
16-Oct-2026 15:47:56 ============================= test session starts ==============================
16-Oct-2026 15:47:56 platform linux -- Python 3.12.9, pytest-9.1.1, pluggy-1.7.0 -- /home/casatest/venv/bin/python3.12
16-Oct-2026 15:47:56 cachedir: .pytest_cache
16-Oct-2026 15:47:56 rootdir: /home/casatest/casa6/casatestutils/nosedir/test_task_importnro
16-Oct-2026 15:47:56 configfile: pytest.ini
16-Oct-2026 15:47:57 collecting ... collected 4 items
16-Oct-2026 15:47:57
16-Oct-2026 15:47:57
16-Oct-2026 15:47:58 test_task_importnro.py::importnro_test::test_invaliddata casatools.platform.str_encode is deprecated and will be removed in a future release
16-Oct-2026 15:47:58 2026-10-16 15:47:58        SEVERE        importnro::::casa        Traceback (most recent call last):
16-Oct-2026 15:47:58 2026-10-16 15:47:58        SEVERE        importnro::::casa+                     ^^^^^^^^^^^^^^^^^^^^^
16-Oct-2026 15:47:58 2026-10-16 15:47:58        SEVERE        importnro::::casa+          File "/home/casatest/venv/lib/python3.12/site-packages/casatasks/private/task_importnro.py", line 33, in importnro
16-Oct-2026 15:47:58 2026-10-16 15:47:58        SEVERE        importnro::::casa+            raise RuntimeError('%s is not a valid NOSTAR data.' % (infile))
16-Oct-2026 15:47:58 2026-10-16 15:47:58        SEVERE        importnro::::casa+        RuntimeError: orixa.OrionKL.20151209212931.16.Y is not a valid NOSTAR data.
16-Oct-2026 15:47:58 2026-10-16 15:47:58        SEVERE        importnro::::casa        orixa.OrionKL.20151209212931.16.Y is not a valid NOSTAR data.
16-Oct-2026 15:47:58 2026-10-16 15:47:58        SEVERE        importnro::::casa        Task importnro raised an exception of class RuntimeError with the following message: orixa.OrionKL.20151209212931.16.Y is not a valid NOSTAR data.
16-Oct-2026 15:47:58
16-Oct-2026 15:47:58 test_invaliddata: Invalid data check.
16-Oct-2026 15:47:58 PASSED
16-Oct-2026 15:47:58
16-Oct-2026 15:48:01 test_task_importnro.py::importnro_test::test_normal
16-Oct-2026 15:48:01 test_normal: Normal data import.
16-Oct-2026 15:48:01 PRESSURE unit is hPa
16-Oct-2026 15:48:01 TEMPERATURE unit is K
16-Oct-2026 15:48:01 PASSED
16-Oct-2026 15:48:01
16-Oct-2026 15:48:02 test_task_importnro.py::importnro_test::test_overwrite 2026-10-16 15:48:02        SEVERE        importnro::::casa        Traceback (most recent call last):
16-Oct-2026 15:48:02 2026-10-16 15:48:02        SEVERE        importnro::::casa+                     ^^^^^^^^^^^^^^^^^^^^^
16-Oct-2026 15:48:02 2026-10-16 15:48:02        SEVERE        importnro::::casa+          File "/home/casatest/venv/lib/python3.12/site-packages/casatasks/private/task_importnro.py", line 30, in importnro
16-Oct-2026 15:48:02 2026-10-16 15:48:02        SEVERE        importnro::::casa+            raise RuntimeError('%s exists.' % (outputvis))
16-Oct-2026 15:48:02 2026-10-16 15:48:02        SEVERE        importnro::::casa+        RuntimeError: importnro_test.ms exists.
16-Oct-2026 15:48:02 2026-10-16 15:48:02        SEVERE        importnro::::casa        importnro_test.ms exists.
16-Oct-2026 15:48:02 2026-10-16 15:48:02        SEVERE        importnro::::casa        Task importnro raised an exception of class RuntimeError with the following message: importnro_test.ms exists.
16-Oct-2026 15:48:02
16-Oct-2026 15:48:02 test_overwrite: File existence check.
16-Oct-2026 15:48:02 PASSED
16-Oct-2026 15:48:02
16-Oct-2026 15:48:05 test_task_importnro.py::importnro_test::test_timestamp
16-Oct-2026 15:48:05 test_timestamp: Check if timestamp is properly converted to UTC.
16-Oct-2026 15:48:05 PASSED
16-Oct-2026 15:48:05
16-Oct-2026 15:48:05 - generated xml file: /home/casatest/casa6/casatestutils/nosedir/xml/test_task_importnro/nose.xml -
16-Oct-2026 15:48:05 ========================= 4 passed, 1 warning in 9.13s =========================
16-Oct-2026 15:48:05 ============================= test session starts ==============================
16-Oct-2026 15:48:05 platform linux -- Python 3.12.9, pytest-9.1.1, pluggy-1.7.0 -- /home/casatest/venv/bin/python3.12
16-Oct-2026 15:48:05 cachedir: .pytest_cache
16-Oct-2026 15:48:05 rootdir: /home/casatest/casa6/casatestutils/nosedir/test_task_setjy
16-Oct-2026 15:48:05 configfile: pytest.ini
16-Oct-2026 15:48:07 collecting ... setjy tests will use data from /opt/casa/data/casatestdata/unittest/setjy/
16-Oct-2026 15:48:07 collected 32 items
16-Oct-2026 15:48:07
16-Oct-2026 15:48:07
16-Oct-2026 15:48:10 test_task_setjy.py::test_SingleObservation::test1_SingleObservationOldModel
16-Oct-2026 15:48:10 Test vs an MS with a single observation using the Butler-JPL-Horizons 2010 model
16-Oct-2026 15:48:10
16-Oct-2026 15:48:10 Create a new local copy of the MS...
16-Oct-2026 15:48:10
16-Oct-2026 15:48:10 Running setjy(field='Titan').
16-Oct-2026 15:48:10
16-Oct-2026 15:48:10 Removing a local copy of MS from the previous test...
16-Oct-2026 15:48:10 PASSED
16-Oct-2026 15:48:10
16-Oct-2026 15:48:12 test_task_setjy.py::test_SingleObservation::test2_SingleObservationScaleByChan
16-Oct-2026 15:48:12 Test vs an MS with a single observation using the Butler-JPL-Horizons 2010 model and scalying by channel
16-Oct-2026 15:48:12
16-Oct-2026 15:48:12 Create a new local copy of the MS...
16-Oct-2026 15:48:12
16-Oct-2026 15:48:12 Running setjy(field='Titan').
16-Oct-2026 15:48:12
16-Oct-2026 15:48:12 Removing a local copy of MS from the previous test...
16-Oct-2026 15:48:12 PASSED
16-Oct-2026 15:48:12
16-Oct-2026 15:48:15 test_task_setjy.py::test_SingleObservation::test3_SingleObservationNewModel
16-Oct-2026 15:48:15 Test vs an MS with one single observation using the Butler-JPL-Horizons 2012 model
16-Oct-2026 15:48:15
16-Oct-2026 15:48:15 Create a new local copy of the MS...
16-Oct-2026 15:48:15
16-Oct-2026 15:48:15 Running setjy(field='Titan').
16-Oct-2026 15:48:15
16-Oct-2026 15:48:15 Removing a local copy of MS from the previous test...
16-Oct-2026 15:48:15 PASSED
16-Oct-2026 15:48:15
16-Oct-2026 15:48:18 test_task_setjy.py::test_SingleObservation::test4_SingleObservationSelectByIntent
16-Oct-2026 15:48:18 Test vs an MS with one single observation using the Butler-JPL-Horizons 2010 model with the selection by intent
16-Oct-2026 15:48:18
16-Oct-2026 15:48:18 Create a new local copy of the MS...
16-Oct-2026 15:48:18
16-Oct-2026 15:48:18 Running setjy(field='Titan').
16-Oct-2026 15:48:18
16-Oct-2026 15:48:18 Removing a local copy of MS from the previous test...
16-Oct-2026 15:48:18 PASSED
16-Oct-2026 15:48:18
16-Oct-2026 15:48:25 test_task_setjy.py::test_SingleObservation::test5_SingleObservationSelectByIntentNewModel 2026-10-16 15:48:25        WARN        ms::msselect        MSSelectionNullSelection : The selected table has zero rows.
16-Oct-2026 15:48:25 2026-10-16 15:48:25        WARN        ms::msselect        MSSelectionNullSelection : The selected table has zero rows.
16-Oct-2026 15:48:25 2026-10-16 15:48:25        WARN        ms::msselect        MSSelectionNullSelection : The selected table has zero rows.
16-Oct-2026 15:48:25 2026-10-16 15:48:25        WARN        ms::msselect        MSSelectionNullSelection : The selected table has zero rows.
16-Oct-2026 15:48:26
16-Oct-2026 15:48:26 Test vs an MS with one single observation using the Butler-JPL-Horizons 2012 model with the selection by intent
16-Oct-2026 15:48:26
16-Oct-2026 15:48:26 Create a new local copy of the MS...
16-Oct-2026 15:48:26
16-Oct-2026 15:48:26 Running setjy(field='Titan').
16-Oct-2026 15:48:26
16-Oct-2026 15:48:26 Removing a local copy of MS from the previous test...
16-Oct-2026 15:48:26 PASSED
16-Oct-2026 15:48:26
16-Oct-2026 15:48:27 test_task_setjy.py::test_MultipleObservations::test1_MultipleObservationOldModel
16-Oct-2026 15:48:27 Test vs an MS with multiple observations using the Butler-JPL-Horizons 2010 model
16-Oct-2026 15:48:27
16-Oct-2026 15:48:27 Create a new local copy of the MS...
16-Oct-2026 15:48:27
16-Oct-2026 15:48:27 Running setjy(field='Titan').
16-Oct-2026 15:48:27
16-Oct-2026 15:48:27 Removing a local copy of MS from the previous test...
16-Oct-2026 15:48:27 PASSED
16-Oct-2026 15:48:27
16-Oct-2026 15:48:27 test_task_setjy.py::test_MultipleObservations::test2_MultipleObservationNewModel 2026-10-16 15:48:28        WARN        ms::msselect        MSSelectionNullSelection : The selected table has zero rows.
16-Oct-2026 15:48:27 2026-10-16 15:48:28        WARN        ms::msselect        MSSelectionNullSelection : The selected table has zero rows.
16-Oct-2026 15:48:27
16-Oct-2026 15:48:27 Test vs an MS with multiple observations using the Butler-JPL-Horizons 2012 model
16-Oct-2026 15:48:27
16-Oct-2026 15:48:27 Create a new local copy of the MS...
16-Oct-2026 15:48:27
16-Oct-2026 15:48:27 Running setjy(field='Titan').
16-Oct-2026 15:48:27
16-Oct-2026 15:48:27 Removing a local copy of MS from the previous test...
16-Oct-2026 15:48:27 PASSED
16-Oct-2026 15:48:27
16-Oct-2026 15:48:36 test_task_setjy.py::test_ModImage::test1_UBandModelwithQBandMS
16-Oct-2026 15:48:36 Test U-Band model with Q-Band data to see impact of flux density scale 
16-Oct-2026 15:48:36
16-Oct-2026 15:48:36 Create a new local copy of the MS...
16-Oct-2026 15:48:36 Running multiple setjy with different parameters...
16-Oct-2026 15:48:36 !!!!! Run with standard="Perley-Butler 2010" !!!!!
16-Oct-2026 15:48:36 !!!!! Run with standard="Perley-Taylor 99" !!!!!
16-Oct-2026 15:48:36 !!!! Run with standard="manual", fluxdensity !!!!!
16-Oct-2026 15:48:36 !!!! Run with standard="manual", fluxdensity and spix !!!!!
16-Oct-2026 15:48:36
16-Oct-2026 15:48:36 Removing a local copy of MS from the previous test...
16-Oct-2026 15:48:36 PASSED
16-Oct-2026 15:48:36
16-Oct-2026 15:48:45 test_task_setjy.py::test_newStandards::test_PB2013
16-Oct-2026 15:48:45
16-Oct-2026 15:48:45 Create a new local copy of the MS...
16-Oct-2026 15:48:45 ret={'12': {'0': {'fluxd': array([0.99137115, 0.        , 0.        , 0.        ])}, '1': {'fluxd': array([0.99131727, 0.        , 0.        , 0.        ])}, 'fieldName': '0542+498_1'}, 'format': "{field Id: {spw Id: {fluxd: [I,Q,U,V] in Jy}, 'fieldName':field name }}"}
16-Oct-2026 15:48:45 PASSED
16-Oct-2026 15:48:45
16-Oct-2026 15:48:48 test_task_setjy.py::test_newStandards::test_PB2017
16-Oct-2026 15:48:48
16-Oct-2026 15:48:48 Create a new local copy of the MS...
16-Oct-2026 15:48:48 PASSED
16-Oct-2026 15:48:48
16-Oct-2026 15:48:49 test_task_setjy.py::test_newVLAmodelimages::test_3C138_KaBandModel
16-Oct-2026 15:48:49
16-Oct-2026 15:48:49 Create a new local copy of the MS...
16-Oct-2026 15:48:49
16-Oct-2026 15:48:49 Removing a local copy of MS from the previous test...
16-Oct-2026 15:48:49 PASSED
16-Oct-2026 15:48:49
16-Oct-2026 15:48:49 test_task_setjy.py::test_newVLAmodelimages::test_3C147_KaBandModel
16-Oct-2026 15:48:49
16-Oct-2026 15:48:49 Create a new local copy of the MS...
16-Oct-2026 15:48:49
16-Oct-2026 15:48:49 Removing a local copy of MS from the previous test...
16-Oct-2026 15:48:49 PASSED
16-Oct-2026 15:48:49
16-Oct-2026 15:48:50 test_task_setjy.py::test_newVLAmodelimages::test_3C286_KaBandModel
16-Oct-2026 15:48:50
16-Oct-2026 15:48:50 Create a new local copy of the MS...
16-Oct-2026 15:48:50
16-Oct-2026 15:48:50 Removing a local copy of MS from the previous test...
16-Oct-2026 15:48:50 PASSED
16-Oct-2026 15:48:50
16-Oct-2026 15:48:50 test_task_setjy.py::test_newVLAmodelimages::test_3C48_KaBandModel
16-Oct-2026 15:48:50
16-Oct-2026 15:48:50 Create a new local copy of the MS...
16-Oct-2026 15:48:50
16-Oct-2026 15:48:50 Removing a local copy of MS from the previous test...
16-Oct-2026 15:48:50 PASSED
16-Oct-2026 15:48:50
16-Oct-2026 15:49:09 test_task_setjy.py::test_newStandards_MMS::test_PB2013_MMS 2026-10-16 15:49:10        WARN        ms::msselect        MSSelectionNullSelection : The selected table has zero rows.
16-Oct-2026 15:49:09 2026-10-16 15:49:10        WARN        ms::msselect        MSSelectionNullSelection : The selected table has zero rows.
16-Oct-2026 15:49:10 2026-10-16 15:49:11        WARN        ms::msselect        MSSelectionNullSelection : The selected table has zero rows.
16-Oct-2026 15:49:10 2026-10-16 15:49:11        WARN        ms::msselect        MSSelectionNullSelection : The selected table has zero rows.
16-Oct-2026 15:49:10 2026-10-16 15:49:11        WARN        ms::msselect        MSSelectionNullSelection : The selected table has zero rows.
16-Oct-2026 15:49:10 2026-10-16 15:49:11        WARN        ms::msselect        MSSelectionNullSelection : The selected table has zero rows.
16-Oct-2026 15:49:10 2026-10-16 15:49:11        WARN        ms::msselect        MSSelectionNullSelection : The selected table has zero rows.
16-Oct-2026 15:49:11
16-Oct-2026 15:49:11
16-Oct-2026 15:49:11 Create a new local copy of the MS...
16-Oct-2026 15:49:11 ................. Creating test MMS ..................
16-Oct-2026 15:49:11
16-Oct-2026 15:49:11 Removing a local copy of MS from the previous test...
16-Oct-2026 15:49:11
16-Oct-2026 15:49:11 Removing a local copy of MMS from the previous test...
16-Oct-2026 15:49:11 PASSED
16-Oct-2026 15:49:11
16-Oct-2026 15:49:34 test_task_setjy.py::test_newStandards_MMS::test_PB2017_MMS 2026-10-16 15:49:35        WARN        ms::msselect        MSSelectionNullSelection : The selected table has zero rows.
16-Oct-2026 15:49:34 2026-10-16 15:49:35        WARN        ms::msselect        MSSelectionNullSelection : The selected table has zero rows.
16-Oct-2026 15:49:35 2026-10-16 15:49:35        WARN        ms::msselect        MSSelectionNullSelection : The selected table has zero rows.
16-Oct-2026 15:49:35 2026-10-16 15:49:35        WARN        ms::msselect        MSSelectionNullSelection : The selected table has zero rows.
16-Oct-2026 15:49:35 2026-10-16 15:49:35        WARN        ms::msselect        MSSelectionNullSelection : The selected table has zero rows.
16-Oct-2026 15:49:35 2026-10-16 15:49:35        WARN        ms::msselect        MSSelectionNullSelection : The selected table has zero rows.
16-Oct-2026 15:49:35 2026-10-16 15:49:35        WARN        ms::msselect        MSSelectionNullSelection : The selected table has zero rows.
16-Oct-2026 15:49:35
16-Oct-2026 15:49:35
16-Oct-2026 15:49:35 Create a new local copy of the MS...
16-Oct-2026 15:49:35 ................. Creating test MMS ..................
16-Oct-2026 15:49:35
16-Oct-2026 15:49:35 Removing a local copy of MS from the previous test...
16-Oct-2026 15:49:35
16-Oct-2026 15:49:35 Removing a local copy of MMS from the previous test...
16-Oct-2026 15:49:35 PASSED
16-Oct-2026 15:49:35
16-Oct-2026 15:49:35 test_task_setjy.py::test_inputs::test_listmodels
16-Oct-2026 15:49:35 Test listmodels mode 
16-Oct-2026 15:49:35
16-Oct-2026 15:49:35 Create a new local copy of the MS...
16-Oct-2026 15:49:35
16-Oct-2026 15:49:35 Running setjy in listmodels mode ....
16-Oct-2026 15:49:35 3C123_P.im
16-Oct-2026 15:49:35 3C138_A.im
16-Oct-2026 15:49:35 3C138_C.im
16-Oct-2026 15:49:35 3C138_K.im
16-Oct-2026 15:49:35 3C138_L.im
16-Oct-2026 15:49:35 3C138_P.im
16-Oct-2026 15:49:35 3C138_Q.im
16-Oct-2026 15:49:35 3C138_S.im
16-Oct-2026 15:49:35 3C138_U.im
16-Oct-2026 15:49:35 3C138_X.im
16-Oct-2026 15:49:35 3C147_A.im
16-Oct-2026 15:49:35 3C147_C.im
16-Oct-2026 15:49:35 3C147_K.im
16-Oct-2026 15:49:35 3C147_L.im
16-Oct-2026 15:49:35 3C147_P.im
16-Oct-2026 15:49:35 3C147_Q.im
16-Oct-2026 15:49:35 3C147_S.im
16-Oct-2026 15:49:35 3C147_U.im
16-Oct-2026 15:49:35 3C147_X.im
16-Oct-2026 15:49:35 3C196_P.im
16-Oct-2026 15:49:35 3C286_A.im
16-Oct-2026 15:49:35 3C286_C.im
16-Oct-2026 15:49:35 3C286_K.im
16-Oct-2026 15:49:35 3C286_L.im
16-Oct-2026 15:49:35 3C286_P.im
16-Oct-2026 15:49:35 3C286_Q.im
16-Oct-2026 15:49:35 3C286_S.im
16-Oct-2026 15:49:35 3C286_U.im
16-Oct-2026 15:49:35 3C286_X.im
16-Oct-2026 15:49:35 3C295_P.im
16-Oct-2026 15:49:35 3C380_P.im
16-Oct-2026 15:49:35 3C48_A.im
16-Oct-2026 15:49:35 3C48_C.im
16-Oct-2026 15:49:35 3C48_K.im
16-Oct-2026 15:49:35 3C48_L.im
16-Oct-2026 15:49:35 3C48_P.im
16-Oct-2026 15:49:35 3C48_Q.im
16-Oct-2026 15:49:35 3C48_S.im
16-Oct-2026 15:49:35 3C48_U.im
16-Oct-2026 15:49:35 3C48_X.im
16-Oct-2026 15:49:35 README
16-Oct-2026 15:49:35 PASSED
16-Oct-2026 15:49:35
16-Oct-2026 15:49:35 test_task_setjy.py::test_inputs::test_usescratchFalseForEphemObject 2026-10-16 15:49:36        SEVERE        setjy::::casa        Task setjy raised an exception of class RuntimeError with the following message: usescratch=False and standard=Butler-JPL-Horizons 2012. Virtual model can not be used for an ephemeris object calibrator. Use usescratch=True.
16-Oct-2026 15:49:35
16-Oct-2026 15:49:35 Test to catch usescratch=T when Butler-JPL-Horizons is used 
16-Oct-2026 15:49:35
16-Oct-2026 15:49:35 Create a new local copy of the MS...
16-Oct-2026 15:49:35
16-Oct-2026 15:49:35 Removing a local copy of MS from the previous test...
16-Oct-2026 15:49:35 PASSED
16-Oct-2026 15:49:35
16-Oct-2026 15:49:35 test_task_setjy.py::test_inputs::test_vischeck 2026-10-16 15:49:36        SEVERE        ms::open        Exception Reported: Table /home/casatest/casa6/casatestutils/nosedir/test_task_setjy/wrong.ms does not exist
16-Oct-2026 15:49:35 2026-10-16 15:49:36        SEVERE        ms::open        Exception Reported: Table /home/casatest/casa6/casatestutils/nosedir/test_task_setjy/wrong.ms does not exist
16-Oct-2026 15:49:35 2026-10-16 15:49:36        SEVERE        setjy::::casa        Task setjy raised an exception of class RuntimeError with the following message: Table /home/casatest/casa6/casatestutils/nosedir/test_task_setjy/wrong.ms does not exist
16-Oct-2026 15:49:35
16-Oct-2026 15:49:35 Test input vis check
16-Oct-2026 15:49:35
16-Oct-2026 15:49:35 Create a new local copy of the MS...
16-Oct-2026 15:49:35
16-Oct-2026 15:49:35 Running setjy with a non-existant vis
16-Oct-2026 15:49:35 PASSED
16-Oct-2026 15:49:35
16-Oct-2026 15:49:46 test_task_setjy.py::test_conesearch::test_searchByPosition
16-Oct-2026 15:49:46
16-Oct-2026 15:49:46 Create a new local copy of the MS...
16-Oct-2026 15:49:46
16-Oct-2026 15:49:46 Removing a local copy of MS from the previous test...
16-Oct-2026 15:49:46 PASSED
16-Oct-2026 15:49:46
16-Oct-2026 15:49:46 test_task_setjy.py::test_fluxscaleStandard::test_fluxscaleStandard1
16-Oct-2026 15:49:46 Test for accepting input fluxscale dictionary 
16-Oct-2026 15:49:46
16-Oct-2026 15:49:46 Create a new local copy of the MS...
16-Oct-2026 15:49:46
16-Oct-2026 15:49:46 Removing a local copy of MS from the previous test...
16-Oct-2026 15:49:46 PASSED
16-Oct-2026 15:49:46
16-Oct-2026 15:49:49 test_task_setjy.py::test_setpol::test_setpol1
16-Oct-2026 15:49:49 Test for multi-term spix (alpha and beta) 
16-Oct-2026 15:49:49
16-Oct-2026 15:49:49 Create a new local copy of the MS...
16-Oct-2026 15:49:49
16-Oct-2026 15:49:49 Removing a local copy of MS from the previous test...
16-Oct-2026 15:49:49 PASSED
16-Oct-2026 15:49:49
16-Oct-2026 15:49:51 test_task_setjy.py::test_setpol::test_setpol2
16-Oct-2026 15:49:51 Test for constant polindex and polangle with I flux density   
16-Oct-2026 15:49:51
16-Oct-2026 15:49:51 Create a new local copy of the MS...
16-Oct-2026 15:49:51
16-Oct-2026 15:49:51 Removing a local copy of MS from the previous test...
16-Oct-2026 15:49:51 PASSED
16-Oct-2026 15:49:51
16-Oct-2026 15:49:53 test_task_setjy.py::test_setpol::test_setpol3
16-Oct-2026 15:49:53 Test for frequency-dependent polindex (2 terms)   
16-Oct-2026 15:49:53
16-Oct-2026 15:49:53 Create a new local copy of the MS...
16-Oct-2026 15:49:53
16-Oct-2026 15:49:53 Removing a local copy of MS from the previous test...
16-Oct-2026 15:49:53 PASSED
16-Oct-2026 15:49:53
16-Oct-2026 15:49:56 test_task_setjy.py::test_setpol::test_setpol4
16-Oct-2026 15:49:56 Test for frequency-dependent polangle (2 terms)   
16-Oct-2026 15:49:56
16-Oct-2026 15:49:56 Create a new local copy of the MS...
16-Oct-2026 15:49:56
16-Oct-2026 15:49:56 Removing a local copy of MS from the previous test...
16-Oct-2026 15:49:56 PASSED
16-Oct-2026 15:49:56
16-Oct-2026 15:49:58 test_task_setjy.py::test_setpol::test_setpol_wrongspix 2026-10-16 15:49:58        SEVERE        setjy::::casa        Task setjy raised an exception of class Exception with the following message: The spectral index is less than -10! Please check the spix parameter.
16-Oct-2026 15:49:58 2026-10-16 15:49:58        SEVERE        setjy::::casa        Task setjy raised an exception of class Exception with the following message: The spectral index is greater than 10! Please check the spix parameter.
16-Oct-2026 15:49:58
16-Oct-2026 15:49:58 Test for wrong spix value   
16-Oct-2026 15:49:58
16-Oct-2026 15:49:58 Create a new local copy of the MS...
16-Oct-2026 15:49:58
16-Oct-2026 15:49:58 Removing a local copy of MS from the previous test...
16-Oct-2026 15:49:58 PASSED
16-Oct-2026 15:49:58
16-Oct-2026 15:49:59 test_task_setjy.py::test_setpol::testr5
16-Oct-2026 15:49:59 Test for rotation measure (with constant polindex and polangle) 
16-Oct-2026 15:49:59
16-Oct-2026 15:49:59 Create a new local copy of the MS...
16-Oct-2026 15:49:59
16-Oct-2026 15:49:59 Removing a local copy of MS from the previous test...
16-Oct-2026 15:49:59 PASSED
16-Oct-2026 15:49:59
16-Oct-2026 15:50:01 test_task_setjy.py::test_setpol::testr6
16-Oct-2026 15:50:01 Test for spectral index with curvature and frequnecy-dependent polindex and polangle with rotmeas 
16-Oct-2026 15:50:01
16-Oct-2026 15:50:01 Create a new local copy of the MS...
16-Oct-2026 15:50:01
16-Oct-2026 15:50:01 Removing a local copy of MS from the previous test...
16-Oct-2026 15:50:01 PASSED
16-Oct-2026 15:50:01
16-Oct-2026 15:50:05 test_task_setjy.py::test_ephemtbl::test_ephemtbl1
16-Oct-2026 15:50:05 Test for Titan with the ephemeris table in J2000 
16-Oct-2026 15:50:05
16-Oct-2026 15:50:05 Create a new local copy of the MS...
16-Oct-2026 15:50:05 Checking returned flux densities...
16-Oct-2026 15:50:05 Checking values of  model amplitudes near 1st null ...
16-Oct-2026 15:50:05 Checking values of model phases transition of 1st null (shuold see phase 0 deg -> 180 deg)...
16-Oct-2026 15:50:05
16-Oct-2026 15:50:05 Removing a local copy of MS from the previous test...
16-Oct-2026 15:50:05 PASSED
16-Oct-2026 15:50:05
16-Oct-2026 15:50:07 test_task_setjy.py::test_ephemtbl::test_ephemtbl2 2026-10-16 15:50:07        WARN        setjy::::casa        Processing 4 spw(s) and at least some of them are a few 1000 channels or more. This may take                             many minutes (>3min per spw for 3840 channels) in some cases. Please be patient.
16-Oct-2026 15:50:21
16-Oct-2026 15:50:21 Test for Uranus with the ephemeris table with the positions in ICRS 
16-Oct-2026 15:50:21
16-Oct-2026 15:50:21 Create a new local copy of the MS...
16-Oct-2026 15:50:21 Checking returned flux densities...
16-Oct-2026 15:50:21 Checking values of mean model amplitudes
16-Oct-2026 15:50:21 Checking values of mean model phases
16-Oct-2026 15:50:21
16-Oct-2026 15:50:21 Removing a local copy of MS from the previous test...
16-Oct-2026 15:50:21 PASSED
16-Oct-2026 15:50:21
16-Oct-2026 15:50:35 test_task_setjy.py::test_tpmAsteroid::test1_tpm
16-Oct-2026 15:50:35 Test Thermo physical models for asteroid flux densities
16-Oct-2026 15:50:35
16-Oct-2026 15:50:35 Create a new local copy of the MS...
16-Oct-2026 15:50:35
16-Oct-2026 15:50:35 Removing a local copy of MS from the previous test...
16-Oct-2026 15:50:35 PASSED
16-Oct-2026 15:50:35
16-Oct-2026 15:50:35 test_task_setjy.py::test_NullSelection::test_empty_sel_handled 2026-10-16 15:50:36        WARN        ms::msselect        MSSelectionNullSelection : The selected table has zero rows.
16-Oct-2026 15:50:35
16-Oct-2026 15:50:35 setjy with null selection produces False (and not None or empty dictionary) 
16-Oct-2026 15:50:35
16-Oct-2026 15:50:35 Create a new local copy of the MS...
16-Oct-2026 15:50:35
16-Oct-2026 15:50:35 Removing a local copy of MS from the previous test...
16-Oct-2026 15:50:36 PASSED
16-Oct-2026 15:50:36
16-Oct-2026 15:50:36 - generated xml file: /home/casatest/casa6/casatestutils/nosedir/xml/test_task_setjy/nose.xml -
16-Oct-2026 15:50:36 ================== 32 passed, 7 warnings in 150.22s (0:02:30) ==================
16-Oct-2026 15:50:36 ============================= test session starts ==============================
16-Oct-2026 15:50:36 platform linux -- Python 3.12.9, pytest-9.1.1, pluggy-1.7.0 -- /home/casatest/venv/bin/python3.12
16-Oct-2026 15:50:36 cachedir: .pytest_cache
16-Oct-2026 15:50:36 rootdir: /home/casatest/casa6/casatestutils/nosedir/test_task_importvla
16-Oct-2026 15:50:36 configfile: pytest.ini
16-Oct-2026 15:50:38 collecting ... collected 6 items
16-Oct-2026 15:50:38
16-Oct-2026 15:50:38
16-Oct-2026 15:50:45 test_task_importvla.py::importvla_test_1::test_bandSel 2026-10-16 15:50:45        WARN        importvla::VLAFiller::fill        No data appended to the measurement set
16-Oct-2026 15:50:45 2026-10-16 15:50:45        WARN        importvla::VLAFiller::fill+        There may be a problem with your data selection criteria
16-Oct-2026 15:50:45
16-Oct-2026 15:50:45 test_bandSel: test bandname selection, U data from the 3C129 regression test data
16-Oct-2026 15:50:45 PASSED
16-Oct-2026 15:50:45
16-Oct-2026 15:50:47 test_task_importvla.py::importvla_test_1::test_checkms
16-Oct-2026 15:50:47 Internal test of checkms function, this should never fail.
16-Oct-2026 15:50:47 internal checkms test, the following printed status messages are expected here and are not test errors.
16-Oct-2026 15:50:47 __dummy__.ms does not exist or is not a directory
16-Oct-2026 15:50:47 impvla_3c129_test.ms has an unexpected number of rows.  49842 != 49843
16-Oct-2026 15:50:47 impvla_3c129_test.ms has an unexpected number of autocorrelation rows. 0 != 1
16-Oct-2026 15:50:47 impvla_3c129_test.ms is missing the NotATable table : impvla_3c129_test.ms/NotATable
16-Oct-2026 15:50:47 One or more of the ANTENNA names in impvla_3c129_test.ms does not follow the expected naming scheme (old).
16-Oct-2026 15:50:47 The FLAG_CMD table in impvla_3c129_test.ms has an unexpected number of rows. 0 != 1
16-Oct-2026 15:50:47 PASSED
16-Oct-2026 15:50:47
16-Oct-2026 15:51:06 test_task_importvla.py::importvla_test_1::test_defaults
16-Oct-2026 15:51:06 Test defaults: default values, checks for expected tables with expected sizes,
16-Oct-2026 15:51:06 DATA, MODEL_DATA, and CORRECTED_DATA columns all exist in MAIN,
16-Oct-2026 15:51:06 The SCAN column contains the expected set of scans,
16-Oct-2026 15:51:06 the ANTENNA NAME values follow the "new" scheme: VAxx where xx are digits
16-Oct-2026 15:51:06 PASSED
16-Oct-2026 15:51:06
16-Oct-2026 15:51:07 test_task_importvla.py::importvla_test_1::test_timeTsys 2026-10-16 15:51:08        WARN        importvla::VLAFiller::fill        No data appended to the measurement set
16-Oct-2026 15:51:07 2026-10-16 15:51:08        WARN        importvla::VLAFiller::fill+        There may be a problem with your data selection criteria
16-Oct-2026 15:51:07 2026-10-16 15:51:08        WARN        importvla::VLAFiller::fill        No data appended to the measurement set
16-Oct-2026 15:51:07 2026-10-16 15:51:08        WARN        importvla::VLAFiller::fill+        There may be a problem with your data selection criteria
16-Oct-2026 15:51:09 2026-10-16 15:51:09        WARN        importvla::VLAFiller::fill        No data appended to the measurement set
16-Oct-2026 15:51:09 2026-10-16 15:51:09        WARN        importvla::VLAFiller::fill+        There may be a problem with your data selection criteria
16-Oct-2026 15:51:09 2026-10-16 15:51:09        WARN        importvla::VLAFiller::fill        No data appended to the measurement set
16-Oct-2026 15:51:09 2026-10-16 15:51:09        WARN        importvla::VLAFiller::fill+        There may be a problem with your data selection criteria
16-Oct-2026 15:51:09
16-Oct-2026 15:51:09 test_timeTsys: time selection, 'old' antnamescheme, tests applytsys=False
16-Oct-2026 15:51:09 PASSED
16-Oct-2026 15:51:09
16-Oct-2026 15:51:09 test_task_importvla.py::importvla_test_2::test_autocorr 2026-10-16 15:51:10        WARN        importvla::VLAFiller::fill        Unsupported observing mode: IR interferometer reference pointing mode
16-Oct-2026 15:51:11 2026-10-16 15:51:11        WARN        importvla::VLAFiller::fill        Unsupported observing mode: IR interferometer reference pointing mode
16-Oct-2026 15:51:12
16-Oct-2026 15:51:12 test_autocorr: test autocorr parameter
16-Oct-2026 15:51:12 PASSED
16-Oct-2026 15:51:12
16-Oct-2026 15:51:13 test_task_importvla.py::importvla_test_2::test_freqtol 2026-10-16 15:51:13        WARN        importvla::VLAFiller::fill        Unsupported observing mode: IR interferometer reference pointing mode
16-Oct-2026 15:51:16 2026-10-16 15:51:16        WARN        importvla::VLAFiller::fill        Unsupported observing mode: TE tipping curve
16-Oct-2026 15:51:17 2026-10-16 15:51:18        WARN        importvla::VLAFiller::fill        Unsupported observing mode: IR interferometer reference pointing mode
16-Oct-2026 15:51:20 2026-10-16 15:51:20        WARN        importvla::VLAFiller::fill        Unsupported observing mode: TE tipping curve
16-Oct-2026 15:51:20
16-Oct-2026 15:51:20 test_freqtol: test frequency tolerance parameter
16-Oct-2026 15:51:20 PASSED
16-Oct-2026 15:51:20
16-Oct-2026 15:51:20 - generated xml file: /home/casatest/casa6/casatestutils/nosedir/xml/test_task_importvla/nose.xml -
16-Oct-2026 15:51:20 ======================== 6 passed, 3 warnings in 44.35s ========================
16-Oct-2026 15:51:21 ============================= test session starts ==============================
16-Oct-2026 15:51:21 platform linux -- Python 3.12.9, pytest-9.1.1, pluggy-1.7.0 -- /home/casatest/venv/bin/python3.12
16-Oct-2026 15:51:21 cachedir: .pytest_cache
16-Oct-2026 15:51:21 rootdir: /home/casatest/casa6/casatestutils/nosedir/test_task_specsmooth
16-Oct-2026 15:51:21 configfile: pytest.ini
16-Oct-2026 15:51:22 collecting ... collected 2 items
16-Oct-2026 15:51:22
16-Oct-2026 15:51:22
16-Oct-2026 15:51:22 test_task_specsmooth.py::specsmooth_test::test_general 2026-10-16 15:51:23        SEVERE        specsmooth::image::hanning        Exception Reported: Exception: The selected region of the image must have at least 3 pixels along the axis to be smoothed..
16-Oct-2026 15:51:22 2026-10-16 15:51:23        SEVERE        specsmooth::image::hanning+        ... thrown by std::shared_ptr<casacore::ImageInterface<T> > casa::Image1DSmoother<T>::smooth() const [with T = float] at File: /source/casainstall/include/casacpp/imageanalysis/ImageAnalysis/Image1DSmoother.tcc, line: 39
16-Oct-2026 15:51:22 2026-10-16 15:51:23        SEVERE        specsmooth::::casa        Task specsmooth raised an exception of class RuntimeError with the following message: Exception: The selected region of the image must have at least 3 pixels along the axis to be smoothed..
16-Oct-2026 15:51:22 2026-10-16 15:51:23        SEVERE        specsmooth::::casa+        ... thrown by std::shared_ptr<casacore::ImageInterface<T> > casa::Image1DSmoother<T>::smooth() const [with T = float] at File: /source/casainstall/include/casacpp/imageanalysis/ImageAnalysis/Image1DSmoother.tcc, line: 39
16-Oct-2026 15:51:22 2026-10-16 15:51:23        SEVERE        specsmooth::image::hanning        Exception Reported: Exception: The selected region of the image must have at least 3 pixels along the axis to be smoothed..
16-Oct-2026 15:51:22 2026-10-16 15:51:23        SEVERE        specsmooth::image::hanning+        ... thrown by std::shared_ptr<casacore::ImageInterface<T> > casa::Image1DSmoother<T>::smooth() const [with T = float] at File: /source/casainstall/include/casacpp/imageanalysis/ImageAnalysis/Image1DSmoother.tcc, line: 39
16-Oct-2026 15:51:22 2026-10-16 15:51:23        SEVERE        specsmooth::::casa        Task specsmooth raised an exception of class RuntimeError with the following message: Exception: The selected region of the image must have at least 3 pixels along the axis to be smoothed..
16-Oct-2026 15:51:22 2026-10-16 15:51:23        SEVERE        specsmooth::::casa+        ... thrown by std::shared_ptr<casacore::ImageInterface<T> > casa::Image1DSmoother<T>::smooth() const [with T = float] at File: /source/casainstall/include/casacpp/imageanalysis/ImageAnalysis/Image1DSmoother.tcc, line: 39
16-Oct-2026 15:51:24
16-Oct-2026 15:51:24 Test general behavior
16-Oct-2026 15:51:24 PASSED
16-Oct-2026 15:51:24
16-Oct-2026 15:51:24 test_task_specsmooth.py::specsmooth_test::test_history 2026-10-16 15:51:24        WARN        image::open (file src/tools/image/image_cmpt.cc, line 4208)        Another image is already open, closing first
16-Oct-2026 15:51:24
16-Oct-2026 15:51:24 Test history records are written
16-Oct-2026 15:51:24 PASSED
16-Oct-2026 15:51:24
16-Oct-2026 15:51:24 - generated xml file: /home/casatest/casa6/casatestutils/nosedir/xml/test_task_specsmooth/nose.xml -
16-Oct-2026 15:51:24 ========================= 2 passed, 1 warning in 3.11s =========================
16-Oct-2026 15:51:24 ============================= test session starts ==============================
16-Oct-2026 15:51:24 platform linux -- Python 3.12.9, pytest-9.1.1, pluggy-1.7.0 -- /home/casatest/venv/bin/python3.12
16-Oct-2026 15:51:24 cachedir: .pytest_cache
16-Oct-2026 15:51:24 rootdir: /home/casatest/casa6/casatestutils/nosedir/test_task_delmod
16-Oct-2026 15:51:24 configfile: pytest.ini
16-Oct-2026 15:51:26 collecting ... collected 4 items
16-Oct-2026 15:51:26
16-Oct-2026 15:51:26
16-Oct-2026 15:51:26 test_task_delmod.py::delmod_test::test_mesSet 2026-10-16 15:51:26        WARN        calibrater::setvi(bool,bool)        Forcing use of OLD VisibilityIterator.
16-Oct-2026 15:51:26
16-Oct-2026 15:51:26 test_messet
16-Oct-2026 15:51:26 -----------------
16-Oct-2026 15:51:26
16-Oct-2026 15:51:26 Checks that only a valid MS is accept as input
16-Oct-2026 15:51:26
16-Oct-2026 15:51:26 The first assert checks that no severe errors appear in the log when preforming the task on a valid MS
16-Oct-2026 15:51:26 The second assert checks that a severe error is raised when the provided MS does not exist
16-Oct-2026 15:51:26 TABLE IS BEING REMOVED
16-Oct-2026 15:51:26 PASSED
16-Oct-2026 15:51:26
16-Oct-2026 15:51:26 test_task_delmod.py::delmod_test::test_removefield 2026-10-16 15:51:27        WARN        calibrater::setvi(bool,bool)        Forcing use of OLD VisibilityIterator.
16-Oct-2026 15:51:27 2026-10-16 15:51:27        WARN        ft::FTMachine::initMaps        No overlap in frequency between image channels and selected data found for this FTMachine
16-Oct-2026 15:51:27 2026-10-16 15:51:27        WARN        ft::FTMachine::initMaps+         Check your data selection and image parameters if you end up with a blank image
16-Oct-2026 15:51:27
16-Oct-2026 15:51:27 test_removefield
16-Oct-2026 15:51:27 ----------------------
16-Oct-2026 15:51:27
16-Oct-2026 15:51:27 Check that the field selection paramter works as intended
16-Oct-2026 15:51:27
16-Oct-2026 15:51:27 This test checks that the field selection removes the proper FIELD_ID from the MS
16-Oct-2026 15:51:27
16-Oct-2026 15:51:27 The field is deleted and then table tools are used to open and check for the existence of the removed FIELD_ID
16-Oct-2026 15:51:27
16-Oct-2026 15:51:27 The assertion checks that the specified FIELD_ID is no longer present in the MS
16-Oct-2026 15:51:27 TABLE IS BEING REMOVED
16-Oct-2026 15:51:27 PASSED
16-Oct-2026 15:51:27
16-Oct-2026 15:51:27 test_task_delmod.py::delmod_test::test_removeotf 2026-10-16 15:51:28        WARN        calibrater::setvi(bool,bool)        Forcing use of OLD VisibilityIterator.
16-Oct-2026 15:51:28 2026-10-16 15:51:28        WARN        ft::FTMachine::initMaps        No overlap in frequency between image channels and selected data found for this FTMachine
16-Oct-2026 15:51:28 2026-10-16 15:51:28        WARN        ft::FTMachine::initMaps+         Check your data selection and image parameters if you end up with a blank image
16-Oct-2026 15:51:28
16-Oct-2026 15:51:28 test_removeotf
16-Oct-2026 15:51:28 ------------------
16-Oct-2026 15:51:28
16-Oct-2026 15:51:28 Checks that the vitual model is removed when the parameter otf=True
16-Oct-2026 15:51:28
16-Oct-2026 15:51:28 The first assert statment checks that the model does exist initially (this may be unnessisary)
16-Oct-2026 15:51:28
16-Oct-2026 15:51:28 The second assertion checks that the virtual model no longer exists
16-Oct-2026 15:51:28 TABLE IS BEING REMOVED
16-Oct-2026 15:51:28 PASSED
16-Oct-2026 15:51:28
16-Oct-2026 15:51:28 test_task_delmod.py::delmod_test::test_removescr 2026-10-16 15:51:28        WARN        calibrater::setvi(bool,bool)        Forcing use of OLD VisibilityIterator.
16-Oct-2026 15:51:28 2026-10-16 15:51:29        SEVERE        getcol::MODEL_DATA        Exception Reported: TableProxy::getColumn: column MODEL_DATA does not exist
16-Oct-2026 15:51:28
16-Oct-2026 15:51:28 test_removescr
16-Oct-2026 15:51:28 -----------------------
16-Oct-2026 15:51:28
16-Oct-2026 15:51:28 Checks that the scratch column is removed when using the parameer scr=True
16-Oct-2026 15:51:28
16-Oct-2026 15:51:28 The assert checks that table tools cannot access the scratch column after delmod has been performed
16-Oct-2026 15:51:28 TABLE IS BEING REMOVED
16-Oct-2026 15:51:28 PASSED
16-Oct-2026 15:51:28
16-Oct-2026 15:51:28 - generated xml file: /home/casatest/casa6/casatestutils/nosedir/xml/test_task_delmod/nose.xml -
16-Oct-2026 15:51:28 ========================= 4 passed, 1 warning in 4.04s =========================
16-Oct-2026 15:51:29
16-Oct-2026 15:51:29
16-Oct-2026 15:51:29 Setting Working Directory: /home/casatest/casa6/casatestutils/nosedir/test_task_cvel2/
16-Oct-2026 15:51:29 Test Directory: /home/casatest/casa6/casatestutils/nosedir/test_task_cvel2
16-Oct-2026 15:51:29
16-Oct-2026 15:51:29 Running Command: pytest --junitxml=/home/casatest/casa6/casatestutils/nosedir/xml/test_task_cvel2/nose.xml -s --disable-pytest-warnings --verbose -ra --tb=short /home/casatest/casa6/casatestutils/nosedir/test_task_cvel2/
16-Oct-2026 15:51:29
16-Oct-2026 15:51:29 Setting Working Directory: /home/casatest/casa6/casatestutils/nosedir/test_task_initweights/
16-Oct-2026 15:51:29 Test Directory: /home/casatest/casa6/casatestutils/nosedir/test_task_initweights
16-Oct-2026 15:51:29
16-Oct-2026 15:51:29 Running Command: pytest --junitxml=/home/casatest/casa6/casatestutils/nosedir/xml/test_task_initweights/nose.xml -s --disable-pytest-warnings --verbose -ra --tb=short /home/casatest/casa6/casatestutils/nosedir/test_task_initweights/
16-Oct-2026 15:51:29
16-Oct-2026 15:51:29 Setting Working Directory: /home/casatest/casa6/casatestutils/nosedir/test_task_splattotable/
16-Oct-2026 15:51:29 Test Directory: /home/casatest/casa6/casatestutils/nosedir/test_task_splattotable
16-Oct-2026 15:51:29
16-Oct-2026 15:51:29 Running Command: pytest --junitxml=/home/casatest/casa6/casatestutils/nosedir/xml/test_task_splattotable/nose.xml -s --disable-pytest-warnings --verbose -ra --tb=short /home/casatest/casa6/casatestutils/nosedir/test_task_splattotable/
16-Oct-2026 15:51:29
16-Oct-2026 15:51:29 Setting Working Directory: /home/casatest/casa6/casatestutils/nosedir/test_task_sdcal/
16-Oct-2026 15:51:29 Test Directory: /home/casatest/casa6/casatestutils/nosedir/test_task_sdcal
16-Oct-2026 15:51:29
16-Oct-2026 15:51:29 Running Command: pytest --junitxml=/home/casatest/casa6/casatestutils/nosedir/xml/test_task_sdcal/nose.xml -s --disable-pytest-warnings --verbose -ra --tb=short /home/casatest/casa6/casatestutils/nosedir/test_task_sdcal/
16-Oct-2026 15:51:29
16-Oct-2026 15:51:29 Setting Working Directory: /home/casatest/casa6/casatestutils/nosedir/test_task_uvmodelfit/
16-Oct-2026 15:51:29 Test Directory: /home/casatest/casa6/casatestutils/nosedir/test_task_uvmodelfit
16-Oct-2026 15:51:29
16-Oct-2026 15:51:29 Running Command: pytest --junitxml=/home/casatest/casa6/casatestutils/nosedir/xml/test_task_uvmodelfit/nose.xml -s --disable-pytest-warnings --verbose -ra --tb=short /home/casatest/casa6/casatestutils/nosedir/test_task_uvmodelfit/
16-Oct-2026 15:51:29
16-Oct-2026 15:51:29 Setting Working Directory: /home/casatest/casa6/casatestutils/nosedir/test_task_zenithdelaycal/
16-Oct-2026 15:51:29 Test Directory: /home/casatest/casa6/casatestutils/nosedir/test_task_zenithdelaycal
16-Oct-2026 15:51:29
16-Oct-2026 15:51:29 Running Command: pytest --junitxml=/home/casatest/casa6/casatestutils/nosedir/xml/test_task_zenithdelaycal/nose.xml -s --disable-pytest-warnings --verbose -ra --tb=short /home/casatest/casa6/casatestutils/nosedir/test_task_zenithdelaycal/
16-Oct-2026 15:51:29
16-Oct-2026 15:51:29 Setting Working Directory: /home/casatest/casa6/casatestutils/nosedir/test_task_imregrid/
16-Oct-2026 15:51:29 Test Directory: /home/casatest/casa6/casatestutils/nosedir/test_task_imregrid
16-Oct-2026 15:51:29
16-Oct-2026 15:51:29 Running Command: pytest --junitxml=/home/casatest/casa6/casatestutils/nosedir/xml/test_task_imregrid/nose.xml -s --disable-pytest-warnings --verbose -ra --tb=short /home/casatest/casa6/casatestutils/nosedir/test_task_imregrid/
16-Oct-2026 15:51:29
16-Oct-2026 15:51:29 Setting Working Directory: /home/casatest/casa6/casatestutils/nosedir/test_task_listsdm/
16-Oct-2026 15:51:29 Test Directory: /home/casatest/casa6/casatestutils/nosedir/test_task_listsdm
16-Oct-2026 15:51:29
16-Oct-2026 15:51:29 Running Command: pytest --junitxml=/home/casatest/casa6/casatestutils/nosedir/xml/test_task_listsdm/nose.xml -s --disable-pytest-warnings --verbose -ra --tb=short /home/casatest/casa6/casatestutils/nosedir/test_task_listsdm/
16-Oct-2026 15:51:29
16-Oct-2026 15:51:29 Setting Working Directory: /home/casatest/casa6/casatestutils/nosedir/test_task_sdbaseline/
16-Oct-2026 15:51:29 Test Directory: /home/casatest/casa6/casatestutils/nosedir/test_task_sdbaseline
16-Oct-2026 15:51:29
16-Oct-2026 15:51:29 Running Command: pytest --junitxml=/home/casatest/casa6/casatestutils/nosedir/xml/test_task_sdbaseline/nose.xml -s --disable-pytest-warnings --verbose -ra --tb=short /home/casatest/casa6/casatestutils/nosedir/test_task_sdbaseline/
16-Oct-2026 15:51:29
16-Oct-2026 15:51:29 Setting Working Directory: /home/casatest/casa6/casatestutils/nosedir/test_task_imhistory/
16-Oct-2026 15:51:29 Test Directory: /home/casatest/casa6/casatestutils/nosedir/test_task_imhistory
16-Oct-2026 15:51:29
16-Oct-2026 15:51:29 Running Command: pytest --junitxml=/home/casatest/casa6/casatestutils/nosedir/xml/test_task_imhistory/nose.xml -s --disable-pytest-warnings --verbose -ra --tb=short /home/casatest/casa6/casatestutils/nosedir/test_task_imhistory/
16-Oct-2026 15:51:29
16-Oct-2026 15:51:29 Setting Working Directory: /home/casatest/casa6/casatestutils/nosedir/test_task_clearcal/
16-Oct-2026 15:51:29 Test Directory: /home/casatest/casa6/casatestutils/nosedir/test_task_clearcal
16-Oct-2026 15:51:29
16-Oct-2026 15:51:29 Running Command: pytest --junitxml=/home/casatest/casa6/casatestutils/nosedir/xml/test_task_clearcal/nose.xml -s --disable-pytest-warnings --verbose -ra --tb=short /home/casatest/casa6/casatestutils/nosedir/test_task_clearcal/
16-Oct-2026 15:51:29
16-Oct-2026 15:51:29 Setting Working Directory: /home/casatest/casa6/casatestutils/nosedir/test_task_gencal/
16-Oct-2026 15:51:29 Test Directory: /home/casatest/casa6/casatestutils/nosedir/test_task_gencal
16-Oct-2026 15:51:29
16-Oct-2026 15:51:29 Running Command: pytest --junitxml=/home/casatest/casa6/casatestutils/nosedir/xml/test_task_gencal/nose.xml -s --disable-pytest-warnings --verbose -ra --tb=short /home/casatest/casa6/casatestutils/nosedir/test_task_gencal/
16-Oct-2026 15:51:29
16-Oct-2026 15:51:29 Setting Working Directory: /home/casatest/casa6/casatestutils/nosedir/test_task_simobserve/
16-Oct-2026 15:51:29 Test Directory: /home/casatest/casa6/casatestutils/nosedir/test_task_simobserve
16-Oct-2026 15:51:29
16-Oct-2026 15:51:29 Running Command: pytest --junitxml=/home/casatest/casa6/casatestutils/nosedir/xml/test_task_simobserve/nose.xml -s --disable-pytest-warnings --verbose -ra --tb=short /home/casatest/casa6/casatestutils/nosedir/test_task_simobserve/
16-Oct-2026 15:51:29
16-Oct-2026 15:51:29 Setting Working Directory: /home/casatest/casa6/casatestutils/nosedir/test_task_sdgaincal/
16-Oct-2026 15:51:29 Test Directory: /home/casatest/casa6/casatestutils/nosedir/test_task_sdgaincal
16-Oct-2026 15:51:29
16-Oct-2026 15:51:29 Running Command: pytest --junitxml=/home/casatest/casa6/casatestutils/nosedir/xml/test_task_sdgaincal/nose.xml -s --disable-pytest-warnings --verbose -ra --tb=short /home/casatest/casa6/casatestutils/nosedir/test_task_sdgaincal/
16-Oct-2026 15:51:29
16-Oct-2026 15:51:29 Setting Working Directory: /home/casatest/casa6/casatestutils/nosedir/test_task_importnro/
16-Oct-2026 15:51:29 Test Directory: /home/casatest/casa6/casatestutils/nosedir/test_task_importnro
16-Oct-2026 15:51:29
16-Oct-2026 15:51:29 Running Command: pytest --junitxml=/home/casatest/casa6/casatestutils/nosedir/xml/test_task_importnro/nose.xml -s --disable-pytest-warnings --verbose -ra --tb=short /home/casatest/casa6/casatestutils/nosedir/test_task_importnro/
16-Oct-2026 15:51:29
16-Oct-2026 15:51:29 Setting Working Directory: /home/casatest/casa6/casatestutils/nosedir/test_task_setjy/
16-Oct-2026 15:51:29 Test Directory: /home/casatest/casa6/casatestutils/nosedir/test_task_setjy
16-Oct-2026 15:51:29
16-Oct-2026 15:51:29 Running Command: pytest --junitxml=/home/casatest/casa6/casatestutils/nosedir/xml/test_task_setjy/nose.xml -s --disable-pytest-warnings --verbose -ra --tb=short /home/casatest/casa6/casatestutils/nosedir/test_task_setjy/
16-Oct-2026 15:51:29
16-Oct-2026 15:51:29 Setting Working Directory: /home/casatest/casa6/casatestutils/nosedir/test_task_importvla/
16-Oct-2026 15:51:29 Test Directory: /home/casatest/casa6/casatestutils/nosedir/test_task_importvla
16-Oct-2026 15:51:29
16-Oct-2026 15:51:29 Running Command: pytest --junitxml=/home/casatest/casa6/casatestutils/nosedir/xml/test_task_importvla/nose.xml -s --disable-pytest-warnings --verbose -ra --tb=short /home/casatest/casa6/casatestutils/nosedir/test_task_importvla/
16-Oct-2026 15:51:29
16-Oct-2026 15:51:29 Setting Working Directory: /home/casatest/casa6/casatestutils/nosedir/test_task_specsmooth/
16-Oct-2026 15:51:29 Test Directory: /home/casatest/casa6/casatestutils/nosedir/test_task_specsmooth
16-Oct-2026 15:51:29
16-Oct-2026 15:51:29 Running Command: pytest --junitxml=/home/casatest/casa6/casatestutils/nosedir/xml/test_task_specsmooth/nose.xml -s --disable-pytest-warnings --verbose -ra --tb=short /home/casatest/casa6/casatestutils/nosedir/test_task_specsmooth/
16-Oct-2026 15:51:29
16-Oct-2026 15:51:29 Setting Working Directory: /home/casatest/casa6/casatestutils/nosedir/test_task_delmod/
16-Oct-2026 15:51:29 Test Directory: /home/casatest/casa6/casatestutils/nosedir/test_task_delmod
16-Oct-2026 15:51:29
16-Oct-2026 15:51:29 Running Command: pytest --junitxml=/home/casatest/casa6/casatestutils/nosedir/xml/test_task_delmod/nose.xml -s --disable-pytest-warnings --verbose -ra --tb=short /home/casatest/casa6/casatestutils/nosedir/test_task_delmod/
16-Oct-2026 15:51:30 total 297928
16-Oct-2026 15:51:30 -rw-r--r-- 1 casaci 15001   1935263 Oct 16 10:10 casatasks-6.7.7.15-py3-none-any.whl
16-Oct-2026 15:51:30 -rw-r--r-- 1 casaci root    4553163 Oct 16 15:51 casatasks_test.log
16-Oct-2026 15:51:30 -rw-r--r-- 1 casaci 15001    161014 Oct 16 10:10 casatestutils-6.7.7.15-py3-none-any.whl
16-Oct-2026 15:51:30 -rw-r--r-- 1 casaci 15001 297661441 Oct 16 10:10 casatools-6.7.7.15-cp312-cp312-manylinux_2_28_x86_64.whl
16-Oct-2026 15:51:30 -rw-r--r-- 1 casaci root        863 Oct 16 15:51 requirements.txt
16-Oct-2026 15:51:30 -rw-r--r-- 1 casaci root       1822 Oct 16 15:51 test_task_accor.xml
16-Oct-2026 15:51:30 -rw-r--r-- 1 casaci root        999 Oct 16 15:51 test_task_appendantab.xml
16-Oct-2026 15:51:30 -rw-r--r-- 1 casaci root       3271 Oct 16 15:51 test_task_applycal.xml
16-Oct-2026 15:51:30 -rw-r--r-- 1 casaci root        655 Oct 16 15:51 test_task_asdmsummary.xml
16-Oct-2026 15:51:30 -rw-r--r-- 1 casaci root        831 Oct 16 15:51 test_task_bandpass.xml
16-Oct-2026 15:51:30 -rw-r--r-- 1 casaci root       1748 Oct 16 15:51 test_task_blcal.xml
16-Oct-2026 15:51:30 -rw-r--r-- 1 casaci root        880 Oct 16 15:51 test_task_calstat.xml
16-Oct-2026 15:51:30 -rw-r--r-- 1 casaci root        998 Oct 16 15:51 test_task_clearcal.xml
16-Oct-2026 15:51:30 -rw-r--r-- 1 casaci root        689 Oct 16 15:51 test_task_clearstat.xml
16-Oct-2026 15:51:30 -rw-r--r-- 1 casaci root       2017 Oct 16 15:51 test_task_concat.xml
16-Oct-2026 15:51:30 -rw-r--r-- 1 casaci root       1367 Oct 16 15:51 test_task_conjugatevis.xml
16-Oct-2026 15:51:30 -rw-r--r-- 1 casaci root       7425 Oct 16 15:51 test_task_cvel.xml
16-Oct-2026 15:51:30 -rw-r--r-- 1 casaci root       5054 Oct 16 15:51 test_task_cvel2.xml
16-Oct-2026 15:51:30 -rw-r--r-- 1 casaci root      15738 Oct 16 15:51 test_task_deconvolve.xml
16-Oct-2026 15:51:30 -rw-r--r-- 1 casaci root        944 Oct 16 15:51 test_task_defintent.xml
16-Oct-2026 15:51:30 -rw-r--r-- 1 casaci root        612 Oct 16 15:51 test_task_delmod.xml
16-Oct-2026 15:51:30 -rw-r--r-- 1 casaci root       1798 Oct 16 15:51 test_task_exportasdm.xml
16-Oct-2026 15:51:30 -rw-r--r-- 1 casaci root        359 Oct 16 15:51 test_task_exportfits.xml
16-Oct-2026 15:51:30 -rw-r--r-- 1 casaci root       1863 Oct 16 15:51 test_task_exportuvfits.xml
16-Oct-2026 15:51:30 -rw-r--r-- 1 casaci root       1087 Oct 16 15:51 test_task_feather.xml
16-Oct-2026 15:51:30 -rw-r--r-- 1 casaci root       1977 Oct 16 15:51 test_task_fixplanets.xml
16-Oct-2026 15:51:30 -rw-r--r-- 1 casaci root       1469 Oct 16 15:51 test_task_fixvis.xml
16-Oct-2026 15:51:30 -rw-r--r-- 1 casaci root       4627 Oct 16 15:51 test_task_flagcmd.xml
16-Oct-2026 15:51:30 -rw-r--r-- 1 casaci root      28030 Oct 16 15:51 test_task_flagdata.xml
16-Oct-2026 15:51:30 -rw-r--r-- 1 casaci root        966 Oct 16 15:51 test_task_flagmanager.xml
16-Oct-2026 15:51:30 -rw-r--r-- 1 casaci root       2358 Oct 16 15:51 test_task_fluxscale.xml
16-Oct-2026 15:51:30 -rw-r--r-- 1 casaci root       1677 Oct 16 15:51 test_task_fringefit.xml
16-Oct-2026 15:51:30 -rw-r--r-- 1 casaci root       2373 Oct 16 15:51 test_task_ft.xml
16-Oct-2026 15:51:30 -rw-r--r-- 1 casaci root       4057 Oct 16 15:51 test_task_gaincal.xml
16-Oct-2026 15:51:30 -rw-r--r-- 1 casaci root       3172 Oct 16 15:51 test_task_gencal.xml
16-Oct-2026 15:51:30 -rw-r--r-- 1 casaci root        684 Oct 16 15:51 test_task_getantposalma.xml
16-Oct-2026 15:51:30 -rw-r--r-- 1 casaci root        685 Oct 16 15:51 test_task_getcalmodvla.xml
16-Oct-2026 15:51:30 -rw-r--r-- 1 casaci root       1162 Oct 16 15:51 test_task_getephemtable.xml
16-Oct-2026 15:51:30 -rw-r--r-- 1 casaci root       1329 Oct 16 15:51 test_task_getjyperkalma.xml
16-Oct-2026 15:51:30 -rw-r--r-- 1 casaci root       2607 Oct 16 15:51 test_task_hanningsmooth.xml
16-Oct-2026 15:51:30 -rw-r--r-- 1 casaci root      29162 Oct 16 15:51 test_task_imbaseline.xml
16-Oct-2026 15:51:30 -rw-r--r-- 1 casaci root       2220 Oct 16 15:51 test_task_imcollapse.xml
16-Oct-2026 15:51:30 -rw-r--r-- 1 casaci root       1223 Oct 16 15:51 test_task_imcontsub.xml
16-Oct-2026 15:51:30 -rw-r--r-- 1 casaci root       1767 Oct 16 15:51 test_task_imdev.xml
16-Oct-2026 15:51:30 -rw-r--r-- 1 casaci root       3192 Oct 16 15:51 test_task_imfit.xml
16-Oct-2026 15:51:30 -rw-r--r-- 1 casaci root       2135 Oct 16 15:51 test_task_imhead.xml
16-Oct-2026 15:51:30 -rw-r--r-- 1 casaci root       1175 Oct 16 15:51 test_task_imhistory.xml
16-Oct-2026 15:51:30 -rw-r--r-- 1 casaci root       3055 Oct 16 15:51 test_task_immath.xml
16-Oct-2026 15:51:30 -rw-r--r-- 1 casaci root       1668 Oct 16 15:51 test_task_immoments.xml
16-Oct-2026 15:51:30 -rw-r--r-- 1 casaci root       1129 Oct 16 15:51 test_task_impbcor.xml
16-Oct-2026 15:51:30 -rw-r--r-- 1 casaci root        752 Oct 16 15:51 test_task_importasap.xml
16-Oct-2026 15:51:30 -rw-r--r-- 1 casaci root       4131 Oct 16 15:51 test_task_importasdm.xml
16-Oct-2026 15:51:30 -rw-r--r-- 1 casaci root        352 Oct 16 15:51 test_task_importatca.xml
16-Oct-2026 15:51:30 -rw-r--r-- 1 casaci root       1483 Oct 16 15:51 test_task_importfitsidi.xml
16-Oct-2026 15:51:30 -rw-r--r-- 1 casaci root        358 Oct 16 15:51 test_task_importmiriad.xml
16-Oct-2026 15:51:30 -rw-r--r-- 1 casaci root        639 Oct 16 15:51 test_task_importnro.xml
16-Oct-2026 15:51:30 -rw-r--r-- 1 casaci root       1818 Oct 16 15:51 test_task_importuvfits.xml
16-Oct-2026 15:51:30 -rw-r--r-- 1 casaci root        833 Oct 16 15:51 test_task_importvla.xml
16-Oct-2026 15:51:30 -rw-r--r-- 1 casaci root       1839 Oct 16 15:51 test_task_impv.xml
16-Oct-2026 15:51:30 -rw-r--r-- 1 casaci root       2115 Oct 16 15:51 test_task_imrebin.xml
16-Oct-2026 15:51:30 -rw-r--r-- 1 casaci root        830 Oct 16 15:51 test_task_imreframe.xml
16-Oct-2026 15:51:30 -rw-r--r-- 1 casaci root       2342 Oct 16 15:51 test_task_imregrid.xml
16-Oct-2026 15:51:30 -rw-r--r-- 1 casaci root       1462 Oct 16 15:51 test_task_imsmooth.xml
16-Oct-2026 15:51:30 -rw-r--r-- 1 casaci root       1440 Oct 16 15:51 test_task_imstat.xml
16-Oct-2026 15:51:30 -rw-r--r-- 1 casaci root        734 Oct 16 15:51 test_task_imsubimage.xml
16-Oct-2026 15:51:30 -rw-r--r-- 1 casaci root        804 Oct 16 15:51 test_task_imtrans.xml
16-Oct-2026 15:51:30 -rw-r--r-- 1 casaci root       3129 Oct 16 15:51 test_task_imval.xml
16-Oct-2026 15:51:30 -rw-r--r-- 1 casaci root       3796 Oct 16 15:51 test_task_initweights.xml
16-Oct-2026 15:51:30 -rw-r--r-- 1 casaci root       1685 Oct 16 15:51 test_task_listcal.xml
16-Oct-2026 15:51:30 -rw-r--r-- 1 casaci root        512 Oct 16 15:51 test_task_listfits.xml
16-Oct-2026 15:51:30 -rw-r--r-- 1 casaci root        752 Oct 16 15:51 test_task_listhistory.xml
16-Oct-2026 15:51:30 -rw-r--r-- 1 casaci root       8581 Oct 16 15:51 test_task_listobs.xml
16-Oct-2026 15:51:30 -rw-r--r-- 1 casaci root       1520 Oct 16 15:51 test_task_listpartition.xml
16-Oct-2026 15:51:30 -rw-r--r-- 1 casaci root        525 Oct 16 15:51 test_task_listsdm.xml
16-Oct-2026 15:51:30 -rw-r--r-- 1 casaci root        754 Oct 16 15:51 test_task_listvis.xml
16-Oct-2026 15:51:30 -rw-r--r-- 1 casaci root       2663 Oct 16 15:51 test_task_makemask.xml
16-Oct-2026 15:51:30 -rw-r--r-- 1 casaci root      34488 Oct 16 15:51 test_task_mstransform.xml
16-Oct-2026 15:51:30 -rw-r--r-- 1 casaci root       5847 Oct 16 15:51 test_task_mstransform_mms.xml
16-Oct-2026 15:51:30 -rw-r--r-- 1 casaci root       1113 Oct 16 15:51 test_task_msuvbinflag.xml
16-Oct-2026 15:51:30 -rw-r--r-- 1 casaci root        782 Oct 16 15:51 test_task_nrobeamaverage.xml
16-Oct-2026 15:51:30 -rw-r--r-- 1 casaci root       3467 Oct 16 15:51 test_task_partition.xml
16-Oct-2026 15:51:30 -rw-r--r-- 1 casaci root       2360 Oct 16 15:51 test_task_pccor.xml
16-Oct-2026 15:51:30 -rw-r--r-- 1 casaci root       3403 Oct 16 15:51 test_task_phaseshift.xml
16-Oct-2026 15:51:30 -rw-r--r-- 1 casaci root       1095 Oct 16 15:51 test_task_plotants.xml
16-Oct-2026 15:51:30 -rw-r--r-- 1 casaci root       3883 Oct 16 15:51 test_task_plotbandpass.xml
16-Oct-2026 15:51:30 -rw-r--r-- 1 casaci root       1795 Oct 16 15:51 test_task_plotprofilemap.xml
16-Oct-2026 15:51:30 -rw-r--r-- 1 casaci root       1175 Oct 16 15:51 test_task_plotweather.xml
16-Oct-2026 15:51:30 -rw-r--r-- 1 casaci root       3088 Oct 16 15:51 test_task_polcal.xml
16-Oct-2026 15:51:30 -rw-r--r-- 1 casaci root        358 Oct 16 15:51 test_task_polfromgain.xml
16-Oct-2026 15:51:30 -rw-r--r-- 1 casaci root       1217 Oct 16 15:51 test_task_predictcomp.xml
16-Oct-2026 15:51:30 -rw-r--r-- 1 casaci root        973 Oct 16 15:51 test_task_rerefant.xml
16-Oct-2026 15:51:30 -rw-r--r-- 1 casaci root       1207 Oct 16 15:51 test_task_rmfit.xml
16-Oct-2026 15:51:30 -rw-r--r-- 1 casaci root        810 Oct 16 15:51 test_task_rmtables.xml
16-Oct-2026 15:51:30 -rw-r--r-- 1 casaci root       5029 Oct 16 15:51 test_task_sdatmcor.xml
16-Oct-2026 15:51:30 -rw-r--r-- 1 casaci root      18290 Oct 16 15:51 test_task_sdbaseline.xml
16-Oct-2026 15:51:30 -rw-r--r-- 1 casaci root       6646 Oct 16 15:51 test_task_sdcal.xml
16-Oct-2026 15:51:30 -rw-r--r-- 1 casaci root       4176 Oct 16 15:51 test_task_sdfit.xml
16-Oct-2026 15:51:30 -rw-r--r-- 1 casaci root       1862 Oct 16 15:51 test_task_sdfixscan.xml
16-Oct-2026 15:51:30 -rw-r--r-- 1 casaci root       1589 Oct 16 15:51 test_task_sdgaincal.xml
16-Oct-2026 15:51:30 -rw-r--r-- 1 casaci root       2718 Oct 16 15:51 test_task_sdintimaging.xml
16-Oct-2026 15:51:30 -rw-r--r-- 1 casaci root        585 Oct 16 15:51 test_task_sdpolaverage.xml
16-Oct-2026 15:51:30 -rw-r--r-- 1 casaci root       2453 Oct 16 15:51 test_task_sdsidebandsplit.xml
16-Oct-2026 15:51:30 -rw-r--r-- 1 casaci root       3947 Oct 16 15:51 test_task_sdsmooth.xml
16-Oct-2026 15:51:30 -rw-r--r-- 1 casaci root       4399 Oct 16 15:51 test_task_sdtimeaverage.xml
16-Oct-2026 15:51:30 -rw-r--r-- 1 casaci root       3452 Oct 16 15:51 test_task_setjy.xml
16-Oct-2026 15:51:30 -rw-r--r-- 1 casaci root       1715 Oct 16 15:51 test_task_simanalyze.xml
16-Oct-2026 15:51:30 -rw-r--r-- 1 casaci root      14295 Oct 16 15:51 test_task_simobserve.xml
16-Oct-2026 15:51:30 -rw-r--r-- 1 casaci root       1511 Oct 16 15:51 test_task_slsearch.xml
16-Oct-2026 15:51:30 -rw-r--r-- 1 casaci root       1388 Oct 16 15:51 test_task_smoothcal.xml
16-Oct-2026 15:51:30 -rw-r--r-- 1 casaci root       1949 Oct 16 15:51 test_task_specfit.xml
16-Oct-2026 15:51:30 -rw-r--r-- 1 casaci root        716 Oct 16 15:51 test_task_specflux.xml
16-Oct-2026 15:51:30 -rw-r--r-- 1 casaci root        453 Oct 16 15:51 test_task_specsmooth.xml
16-Oct-2026 15:51:30 -rw-r--r-- 1 casaci root        468 Oct 16 15:51 test_task_splattotable.xml
16-Oct-2026 15:51:30 -rw-r--r-- 1 casaci root      17902 Oct 16 15:51 test_task_split.xml
16-Oct-2026 15:51:30 -rw-r--r-- 1 casaci root        706 Oct 16 15:51 test_task_spxfit.xml
16-Oct-2026 15:51:30 -rw-r--r-- 1 casaci root       2409 Oct 16 15:51 test_task_statwt.xml
16-Oct-2026 15:51:30 -rw-r--r-- 1 casaci root      38945 Oct 16 15:51 test_task_tclean.xml
16-Oct-2026 15:51:30 -rw-r--r-- 1 casaci root        700 Oct 16 15:51 test_task_testconcat.xml
16-Oct-2026 15:51:30 -rw-r--r-- 1 casaci root      24766 Oct 16 15:51 test_task_tsdimaging.xml
16-Oct-2026 15:51:30 -rw-r--r-- 1 casaci root       4555 Oct 16 15:51 test_task_uvcontsub.xml
16-Oct-2026 15:51:30 -rw-r--r-- 1 casaci root        843 Oct 16 15:51 test_task_uvcontsub_old.xml
16-Oct-2026 15:51:30 -rw-r--r-- 1 casaci root       1522 Oct 16 15:51 test_task_uvmodelfit.xml
16-Oct-2026 15:51:30 -rw-r--r-- 1 casaci root       1483 Oct 16 15:51 test_task_virtualconcat.xml
16-Oct-2026 15:51:30 -rw-r--r-- 1 casaci root       1096 Oct 16 15:51 test_task_vishead.xml
16-Oct-2026 15:51:30 -rw-r--r-- 1 casaci root       3288 Oct 16 15:51 test_task_visstat.xml
16-Oct-2026 15:51:30 -rw-r--r-- 1 casaci root       1984 Oct 16 15:51 test_task_wvrgcal.xml
16-Oct-2026 15:51:30 -rw-r--r-- 1 casaci root       1841 Oct 16 15:51 test_task_zenithdelaycal.xml
16-Oct-2026 15:51:30 Finished task 'Test wheel' with result: Success
16-Oct-2026 15:51:30 Starting task 'Inject is_641' of type 'com.atlassian.bamboo.plugins.bamboo-variable-inject-plugin:inject'
16-Oct-2026 15:51:30 Injected variable bamboo.inject.is_641=False in LOCAL scope
16-Oct-2026 15:51:30 Finished task 'Inject is_641' with result: Success
16-Oct-2026 15:51:30
Substituting variable: ${bamboo.planRepository.branchName} with master
16-Oct-2026 15:51:30 Starting task 'Tar work directory' of type 'com.atlassian.bamboo.plugins.scripttask:task.builder.script'
16-Oct-2026 15:51:30
Beginning to execute external process for build 'CASASPECS - Master Test GPU 3.12 - Test Tasks Many Linux 2.28 Rocky 8.10 Py3.12 #183 (CASASPECS-MASTERTESTGPUPY312-TTM228PY312-183)'
... running command line:
/export/cvpost134-nvme/casa/bamboohome/temp/CASASPECS-MASTERTESTGPUPY312-TTM228PY312-183-ScriptBuildTask-4587848599109502492.sh
... in: /export/cvpost134-nvme/casa/bamboohome/xml-data/build-dir/CASASPECS-MASTERTESTGPUPY312-TTM228PY312
16-Oct-2026 15:51:30 Package working directory
16-Oct-2026 15:51:30 tar: work: Cannot stat: No such file or directory
16-Oct-2026 15:51:30 tar: Exiting with failure status due to previous errors
16-Oct-2026 15:51:30 total 297932
16-Oct-2026 15:51:30 -rw-r--r-- 1 casaci 15001   1935263 Oct 16 10:10 casatasks-6.7.7.15-py3-none-any.whl
16-Oct-2026 15:51:30 -rw-r--r-- 1 casaci root    4553163 Oct 16 15:51 casatasks_test.log
16-Oct-2026 15:51:30 -rw-r--r-- 1 casaci 15001    161014 Oct 16 10:10 casatestutils-6.7.7.15-py3-none-any.whl
16-Oct-2026 15:51:30 -rw-r--r-- 1 casaci 15001 297661441 Oct 16 10:10 casatools-6.7.7.15-cp312-cp312-manylinux_2_28_x86_64.whl
16-Oct-2026 15:51:30 -rw-r--r-- 1 casaci root        863 Oct 16 15:51 requirements.txt
16-Oct-2026 15:51:30 -rw-r--r-- 1 casaci root       1822 Oct 16 15:51 test_task_accor.xml
16-Oct-2026 15:51:30 -rw-r--r-- 1 casaci root        999 Oct 16 15:51 test_task_appendantab.xml
16-Oct-2026 15:51:30 -rw-r--r-- 1 casaci root       3271 Oct 16 15:51 test_task_applycal.xml
16-Oct-2026 15:51:30 -rw-r--r-- 1 casaci root        655 Oct 16 15:51 test_task_asdmsummary.xml
16-Oct-2026 15:51:30 -rw-r--r-- 1 casaci root        831 Oct 16 15:51 test_task_bandpass.xml
16-Oct-2026 15:51:30 -rw-r--r-- 1 casaci root       1748 Oct 16 15:51 test_task_blcal.xml
16-Oct-2026 15:51:30 -rw-r--r-- 1 casaci root        880 Oct 16 15:51 test_task_calstat.xml
16-Oct-2026 15:51:30 -rw-r--r-- 1 casaci root        998 Oct 16 15:51 test_task_clearcal.xml
16-Oct-2026 15:51:30 -rw-r--r-- 1 casaci root        689 Oct 16 15:51 test_task_clearstat.xml
16-Oct-2026 15:51:30 -rw-r--r-- 1 casaci root       2017 Oct 16 15:51 test_task_concat.xml
16-Oct-2026 15:51:30 -rw-r--r-- 1 casaci root       1367 Oct 16 15:51 test_task_conjugatevis.xml
16-Oct-2026 15:51:30 -rw-r--r-- 1 casaci root       7425 Oct 16 15:51 test_task_cvel.xml
16-Oct-2026 15:51:30 -rw-r--r-- 1 casaci root       5054 Oct 16 15:51 test_task_cvel2.xml
16-Oct-2026 15:51:30 -rw-r--r-- 1 casaci root      15738 Oct 16 15:51 test_task_deconvolve.xml
16-Oct-2026 15:51:30 -rw-r--r-- 1 casaci root        944 Oct 16 15:51 test_task_defintent.xml
16-Oct-2026 15:51:30 -rw-r--r-- 1 casaci root        612 Oct 16 15:51 test_task_delmod.xml
16-Oct-2026 15:51:30 -rw-r--r-- 1 casaci root       1798 Oct 16 15:51 test_task_exportasdm.xml
16-Oct-2026 15:51:30 -rw-r--r-- 1 casaci root        359 Oct 16 15:51 test_task_exportfits.xml
16-Oct-2026 15:51:30 -rw-r--r-- 1 casaci root       1863 Oct 16 15:51 test_task_exportuvfits.xml
16-Oct-2026 15:51:30 -rw-r--r-- 1 casaci root       1087 Oct 16 15:51 test_task_feather.xml
16-Oct-2026 15:51:30 -rw-r--r-- 1 casaci root       1977 Oct 16 15:51 test_task_fixplanets.xml
16-Oct-2026 15:51:30 -rw-r--r-- 1 casaci root       1469 Oct 16 15:51 test_task_fixvis.xml
16-Oct-2026 15:51:30 -rw-r--r-- 1 casaci root       4627 Oct 16 15:51 test_task_flagcmd.xml
16-Oct-2026 15:51:30 -rw-r--r-- 1 casaci root      28030 Oct 16 15:51 test_task_flagdata.xml
16-Oct-2026 15:51:30 -rw-r--r-- 1 casaci root        966 Oct 16 15:51 test_task_flagmanager.xml
16-Oct-2026 15:51:30 -rw-r--r-- 1 casaci root       2358 Oct 16 15:51 test_task_fluxscale.xml
16-Oct-2026 15:51:30 -rw-r--r-- 1 casaci root       1677 Oct 16 15:51 test_task_fringefit.xml
16-Oct-2026 15:51:30 -rw-r--r-- 1 casaci root       2373 Oct 16 15:51 test_task_ft.xml
16-Oct-2026 15:51:30 -rw-r--r-- 1 casaci root       4057 Oct 16 15:51 test_task_gaincal.xml
16-Oct-2026 15:51:30 -rw-r--r-- 1 casaci root       3172 Oct 16 15:51 test_task_gencal.xml
16-Oct-2026 15:51:30 -rw-r--r-- 1 casaci root        684 Oct 16 15:51 test_task_getantposalma.xml
16-Oct-2026 15:51:30 -rw-r--r-- 1 casaci root        685 Oct 16 15:51 test_task_getcalmodvla.xml
16-Oct-2026 15:51:30 -rw-r--r-- 1 casaci root       1162 Oct 16 15:51 test_task_getephemtable.xml
16-Oct-2026 15:51:30 -rw-r--r-- 1 casaci root       1329 Oct 16 15:51 test_task_getjyperkalma.xml
16-Oct-2026 15:51:30 -rw-r--r-- 1 casaci root       2607 Oct 16 15:51 test_task_hanningsmooth.xml
16-Oct-2026 15:51:30 -rw-r--r-- 1 casaci root      29162 Oct 16 15:51 test_task_imbaseline.xml
16-Oct-2026 15:51:30 -rw-r--r-- 1 casaci root       2220 Oct 16 15:51 test_task_imcollapse.xml
16-Oct-2026 15:51:30 -rw-r--r-- 1 casaci root       1223 Oct 16 15:51 test_task_imcontsub.xml
16-Oct-2026 15:51:30 -rw-r--r-- 1 casaci root       1767 Oct 16 15:51 test_task_imdev.xml
16-Oct-2026 15:51:30 -rw-r--r-- 1 casaci root       3192 Oct 16 15:51 test_task_imfit.xml
16-Oct-2026 15:51:30 -rw-r--r-- 1 casaci root       2135 Oct 16 15:51 test_task_imhead.xml
16-Oct-2026 15:51:30 -rw-r--r-- 1 casaci root       1175 Oct 16 15:51 test_task_imhistory.xml
16-Oct-2026 15:51:30 -rw-r--r-- 1 casaci root       3055 Oct 16 15:51 test_task_immath.xml
16-Oct-2026 15:51:30 -rw-r--r-- 1 casaci root       1668 Oct 16 15:51 test_task_immoments.xml
16-Oct-2026 15:51:30 -rw-r--r-- 1 casaci root       1129 Oct 16 15:51 test_task_impbcor.xml
16-Oct-2026 15:51:30 -rw-r--r-- 1 casaci root        752 Oct 16 15:51 test_task_importasap.xml
16-Oct-2026 15:51:30 -rw-r--r-- 1 casaci root       4131 Oct 16 15:51 test_task_importasdm.xml
16-Oct-2026 15:51:30 -rw-r--r-- 1 casaci root        352 Oct 16 15:51 test_task_importatca.xml
16-Oct-2026 15:51:30 -rw-r--r-- 1 casaci root       1483 Oct 16 15:51 test_task_importfitsidi.xml
16-Oct-2026 15:51:30 -rw-r--r-- 1 casaci root        358 Oct 16 15:51 test_task_importmiriad.xml
16-Oct-2026 15:51:30 -rw-r--r-- 1 casaci root        639 Oct 16 15:51 test_task_importnro.xml
16-Oct-2026 15:51:30 -rw-r--r-- 1 casaci root       1818 Oct 16 15:51 test_task_importuvfits.xml
16-Oct-2026 15:51:30 -rw-r--r-- 1 casaci root        833 Oct 16 15:51 test_task_importvla.xml
16-Oct-2026 15:51:30 -rw-r--r-- 1 casaci root       1839 Oct 16 15:51 test_task_impv.xml
16-Oct-2026 15:51:30 -rw-r--r-- 1 casaci root       2115 Oct 16 15:51 test_task_imrebin.xml
16-Oct-2026 15:51:30 -rw-r--r-- 1 casaci root        830 Oct 16 15:51 test_task_imreframe.xml
16-Oct-2026 15:51:30 -rw-r--r-- 1 casaci root       2342 Oct 16 15:51 test_task_imregrid.xml
16-Oct-2026 15:51:30 -rw-r--r-- 1 casaci root       1462 Oct 16 15:51 test_task_imsmooth.xml
16-Oct-2026 15:51:30 -rw-r--r-- 1 casaci root       1440 Oct 16 15:51 test_task_imstat.xml
16-Oct-2026 15:51:30 -rw-r--r-- 1 casaci root        734 Oct 16 15:51 test_task_imsubimage.xml
16-Oct-2026 15:51:30 -rw-r--r-- 1 casaci root        804 Oct 16 15:51 test_task_imtrans.xml
16-Oct-2026 15:51:30 -rw-r--r-- 1 casaci root       3129 Oct 16 15:51 test_task_imval.xml
16-Oct-2026 15:51:30 -rw-r--r-- 1 casaci root       3796 Oct 16 15:51 test_task_initweights.xml
16-Oct-2026 15:51:30 -rw-r--r-- 1 casaci root       1685 Oct 16 15:51 test_task_listcal.xml
16-Oct-2026 15:51:30 -rw-r--r-- 1 casaci root        512 Oct 16 15:51 test_task_listfits.xml
16-Oct-2026 15:51:30 -rw-r--r-- 1 casaci root        752 Oct 16 15:51 test_task_listhistory.xml
16-Oct-2026 15:51:30 -rw-r--r-- 1 casaci root       8581 Oct 16 15:51 test_task_listobs.xml
16-Oct-2026 15:51:30 -rw-r--r-- 1 casaci root       1520 Oct 16 15:51 test_task_listpartition.xml
16-Oct-2026 15:51:30 -rw-r--r-- 1 casaci root        525 Oct 16 15:51 test_task_listsdm.xml
16-Oct-2026 15:51:30 -rw-r--r-- 1 casaci root        754 Oct 16 15:51 test_task_listvis.xml
16-Oct-2026 15:51:30 -rw-r--r-- 1 casaci root       2663 Oct 16 15:51 test_task_makemask.xml
16-Oct-2026 15:51:30 -rw-r--r-- 1 casaci root      34488 Oct 16 15:51 test_task_mstransform.xml
16-Oct-2026 15:51:30 -rw-r--r-- 1 casaci root       5847 Oct 16 15:51 test_task_mstransform_mms.xml
16-Oct-2026 15:51:30 -rw-r--r-- 1 casaci root       1113 Oct 16 15:51 test_task_msuvbinflag.xml
16-Oct-2026 15:51:30 -rw-r--r-- 1 casaci root        782 Oct 16 15:51 test_task_nrobeamaverage.xml
16-Oct-2026 15:51:30 -rw-r--r-- 1 casaci root       3467 Oct 16 15:51 test_task_partition.xml
16-Oct-2026 15:51:30 -rw-r--r-- 1 casaci root       2360 Oct 16 15:51 test_task_pccor.xml
16-Oct-2026 15:51:30 -rw-r--r-- 1 casaci root       3403 Oct 16 15:51 test_task_phaseshift.xml
16-Oct-2026 15:51:30 -rw-r--r-- 1 casaci root       1095 Oct 16 15:51 test_task_plotants.xml
16-Oct-2026 15:51:30 -rw-r--r-- 1 casaci root       3883 Oct 16 15:51 test_task_plotbandpass.xml
16-Oct-2026 15:51:30 -rw-r--r-- 1 casaci root       1795 Oct 16 15:51 test_task_plotprofilemap.xml
16-Oct-2026 15:51:30 -rw-r--r-- 1 casaci root       1175 Oct 16 15:51 test_task_plotweather.xml
16-Oct-2026 15:51:30 -rw-r--r-- 1 casaci root       3088 Oct 16 15:51 test_task_polcal.xml
16-Oct-2026 15:51:30 -rw-r--r-- 1 casaci root        358 Oct 16 15:51 test_task_polfromgain.xml
16-Oct-2026 15:51:30 -rw-r--r-- 1 casaci root       1217 Oct 16 15:51 test_task_predictcomp.xml
16-Oct-2026 15:51:30 -rw-r--r-- 1 casaci root        973 Oct 16 15:51 test_task_rerefant.xml
16-Oct-2026 15:51:30 -rw-r--r-- 1 casaci root       1207 Oct 16 15:51 test_task_rmfit.xml
16-Oct-2026 15:51:30 -rw-r--r-- 1 casaci root        810 Oct 16 15:51 test_task_rmtables.xml
16-Oct-2026 15:51:30 -rw-r--r-- 1 casaci root       5029 Oct 16 15:51 test_task_sdatmcor.xml
16-Oct-2026 15:51:30 -rw-r--r-- 1 casaci root      18290 Oct 16 15:51 test_task_sdbaseline.xml
16-Oct-2026 15:51:30 -rw-r--r-- 1 casaci root       6646 Oct 16 15:51 test_task_sdcal.xml
16-Oct-2026 15:51:30 -rw-r--r-- 1 casaci root       4176 Oct 16 15:51 test_task_sdfit.xml
16-Oct-2026 15:51:30 -rw-r--r-- 1 casaci root       1862 Oct 16 15:51 test_task_sdfixscan.xml
16-Oct-2026 15:51:30 -rw-r--r-- 1 casaci root       1589 Oct 16 15:51 test_task_sdgaincal.xml
16-Oct-2026 15:51:30 -rw-r--r-- 1 casaci root       2718 Oct 16 15:51 test_task_sdintimaging.xml
16-Oct-2026 15:51:30 -rw-r--r-- 1 casaci root        585 Oct 16 15:51 test_task_sdpolaverage.xml
16-Oct-2026 15:51:30 -rw-r--r-- 1 casaci root       2453 Oct 16 15:51 test_task_sdsidebandsplit.xml
16-Oct-2026 15:51:30 -rw-r--r-- 1 casaci root       3947 Oct 16 15:51 test_task_sdsmooth.xml
16-Oct-2026 15:51:30 -rw-r--r-- 1 casaci root       4399 Oct 16 15:51 test_task_sdtimeaverage.xml
16-Oct-2026 15:51:30 -rw-r--r-- 1 casaci root       3452 Oct 16 15:51 test_task_setjy.xml
16-Oct-2026 15:51:30 -rw-r--r-- 1 casaci root       1715 Oct 16 15:51 test_task_simanalyze.xml
16-Oct-2026 15:51:30 -rw-r--r-- 1 casaci root      14295 Oct 16 15:51 test_task_simobserve.xml
16-Oct-2026 15:51:30 -rw-r--r-- 1 casaci root       1511 Oct 16 15:51 test_task_slsearch.xml
16-Oct-2026 15:51:30 -rw-r--r-- 1 casaci root       1388 Oct 16 15:51 test_task_smoothcal.xml
16-Oct-2026 15:51:30 -rw-r--r-- 1 casaci root       1949 Oct 16 15:51 test_task_specfit.xml
16-Oct-2026 15:51:30 -rw-r--r-- 1 casaci root        716 Oct 16 15:51 test_task_specflux.xml
16-Oct-2026 15:51:30 -rw-r--r-- 1 casaci root        453 Oct 16 15:51 test_task_specsmooth.xml
16-Oct-2026 15:51:30 -rw-r--r-- 1 casaci root        468 Oct 16 15:51 test_task_splattotable.xml
16-Oct-2026 15:51:30 -rw-r--r-- 1 casaci root      17902 Oct 16 15:51 test_task_split.xml
16-Oct-2026 15:51:30 -rw-r--r-- 1 casaci root        706 Oct 16 15:51 test_task_spxfit.xml
16-Oct-2026 15:51:30 -rw-r--r-- 1 casaci root       2409 Oct 16 15:51 test_task_statwt.xml
16-Oct-2026 15:51:30 -rw-r--r-- 1 casaci root      38945 Oct 16 15:51 test_task_tclean.xml
16-Oct-2026 15:51:30 -rw-r--r-- 1 casaci root        700 Oct 16 15:51 test_task_testconcat.xml
16-Oct-2026 15:51:30 -rw-r--r-- 1 casaci root      24766 Oct 16 15:51 test_task_tsdimaging.xml
16-Oct-2026 15:51:30 -rw-r--r-- 1 casaci root       4555 Oct 16 15:51 test_task_uvcontsub.xml
16-Oct-2026 15:51:30 -rw-r--r-- 1 casaci root        843 Oct 16 15:51 test_task_uvcontsub_old.xml
16-Oct-2026 15:51:30 -rw-r--r-- 1 casaci root       1522 Oct 16 15:51 test_task_uvmodelfit.xml
16-Oct-2026 15:51:30 -rw-r--r-- 1 casaci root       1483 Oct 16 15:51 test_task_virtualconcat.xml
16-Oct-2026 15:51:30 -rw-r--r-- 1 casaci root       1096 Oct 16 15:51 test_task_vishead.xml
16-Oct-2026 15:51:30 -rw-r--r-- 1 casaci root       3288 Oct 16 15:51 test_task_visstat.xml
16-Oct-2026 15:51:30 -rw-r--r-- 1 casaci root       1984 Oct 16 15:51 test_task_wvrgcal.xml
16-Oct-2026 15:51:30 -rw-r--r-- 1 casaci root       1841 Oct 16 15:51 test_task_zenithdelaycal.xml
16-Oct-2026 15:51:30 -rw-r--r-- 1 casaci root         45 Oct 16 15:51 work-manylinux_228_casatasks-3.12.tar.gz
16-Oct-2026 15:51:30 Done packaging working directory
16-Oct-2026 15:51:30 Finished task 'Tar work directory' with result: Success
16-Oct-2026 15:51:30 Starting task 'Parse tests' of type 'com.atlassian.bamboo.plugins.testresultparser:task.testresultparser.junit'
16-Oct-2026 15:51:30 Parsing test results under /export/cvpost134-nvme/casa/bamboohome/xml-data/build-dir/CASASPECS-MASTERTESTGPUPY312-TTM228PY312...
16-Oct-2026 15:51:30 Failing task since 2 failing test cases were found.
16-Oct-2026 15:51:30 Finished task 'Parse tests' with result: Failed
16-Oct-2026 15:51:30 Starting task 'Cleanup' of type 'com.atlassian.bamboo.plugins.scripttask:task.builder.script'
16-Oct-2026 15:51:30
Beginning to execute external process for build 'CASASPECS - Master Test GPU 3.12 - Test Tasks Many Linux 2.28 Rocky 8.10 Py3.12 #183 (CASASPECS-MASTERTESTGPUPY312-TTM228PY312-183)'
... running command line:
/export/cvpost134-nvme/casa/bamboohome/temp/CASASPECS-MASTERTESTGPUPY312-TTM228PY312-183-ScriptBuildTask-10776340061066878983.sh
... in: /export/cvpost134-nvme/casa/bamboohome/xml-data/build-dir/CASASPECS-MASTERTESTGPUPY312-TTM228PY312
16-Oct-2026 15:51:30 Starting cleanup
16-Oct-2026 15:51:41 wheel-container-test
16-Oct-2026 15:51:45 wheel-container-test
16-Oct-2026 15:51:45 Cleanup complete
16-Oct-2026 15:51:45 Finished task 'Cleanup' with result: Success
16-Oct-2026 15:51:45 Running post build plugin 'Docker Container Cleanup'
16-Oct-2026 15:51:45 Running post build plugin 'NCover Results Collector'
16-Oct-2026 15:51:45 Running post build plugin 'Build Results Label Collector'
16-Oct-2026 15:51:45 Running post build plugin 'Clover Results Collector'
16-Oct-2026 15:51:45 Running post build plugin 'npm Cache Cleanup'
16-Oct-2026 15:51:45 Running post build plugin 'Artifact Copier'
16-Oct-2026 15:51:45 Publishing an artifact: XML Directories
16-Oct-2026 15:51:47 Finished publishing of artifact Non required job artifact Http Compression On : [XML Directories], patterns: [**/*.xml] anchored at: [wheeldirectory/] in 1.214 s
16-Oct-2026 15:51:47 Publishing an artifact: requirements.txt
16-Oct-2026 15:51:47 Finished publishing of artifact Non required job artifact Http Compression On : [requirements.txt], patterns: [requirements.txt] anchored at: [wheeldirectory/] in 19.64 ms
16-Oct-2026 15:51:47 Finalising the build...
16-Oct-2026 15:51:47 Stopping timer.
16-Oct-2026 15:51:47 Build CASASPECS-MASTERTESTGPUPY312-TTM228PY312-183 completed.
16-Oct-2026 11:51:47 Running on server: post build plugin 'Build Hanging Detection Configuration'
16-Oct-2026 11:51:47 Running on server: post build plugin 'NCover Results Collector'
16-Oct-2026 11:51:47 Running on server: post build plugin 'Build Labeller'
16-Oct-2026 11:51:47 Running on server: post build plugin 'Clover Delta Calculator'
16-Oct-2026 11:51:47 Running on server: post build plugin 'Maven Dependencies Postprocessor'
16-Oct-2026 11:51:47 All post build plugins have finished
16-Oct-2026 11:51:47 Generating build results summary...
16-Oct-2026 11:51:48 Saving build results to disk...
16-Oct-2026 11:51:49 Store variable context...
16-Oct-2026 11:51:49 Finished building CASASPECS-MASTERTESTGPUPY312-TTM228PY312-183.