Build: #190 failed

Job: Test Tasks Many Linux 2.28 Rocky 8.10 Py3.12 failed

Build log

The build generated 468 lines of output. Download or view full build log.

28-Oct-2026 07:11:26 Build CASASPECS - Master Test GPU 3.12 - Test Tasks Many Linux 2.28 Rocky 8.10 Py3.12 #190 (CASASPECS-MASTERTESTGPUPY312-TTM228PY312-190) is being prepared for building on agent cvpost134.cv.nrao.edu, bamboo version: 9.6.26
28-Oct-2026 07:11:26 Remote agent on host cvpost134.cv.nrao.edu
28-Oct-2026 07:11:26 Build working directory is /export/cvpost134-nvme/casa/bamboohome/xml-data/build-dir/CASASPECS-MASTERTESTGPUPY312-TTM228PY312
28-Oct-2026 07:11:27 Executing build CASASPECS - Master Test GPU 3.12 - Test Tasks Many Linux 2.28 Rocky 8.10 Py3.12 #190 (CASASPECS-MASTERTESTGPUPY312-TTM228PY312-190)
28-Oct-2026 07:11:27 Starting task 'Source Code Checkout' of type 'com.atlassian.bamboo.plugins.vcs:task.vcs.checkout'
28-Oct-2026 07:11:27 Build always requires a clean checkout
28-Oct-2026 07:11:27 Cleaning build directory '/export/cvpost134-nvme/casa/bamboohome/xml-data/build-dir/CASASPECS-MASTERTESTGPUPY312-TTM228PY312'
28-Oct-2026 07:11:28 Checking out into /export/cvpost134-nvme/casa/bamboohome/xml-data/build-dir/CASASPECS-MASTERTESTGPUPY312-TTM228PY312
28-Oct-2026 07:11:28 Updating source code to revision: 188b64ce030a360ced17720a68d5af3bbcffaf87
28-Oct-2026 07:11:28 Fetching 'refs/heads/master' from 'ssh://git@open-bitbucket.nrao.edu:7999/casa/casa6.git'.
28-Oct-2026 07:11:28 Warning: Permanently added '[127.0.0.1]:33159' (RSA) to the list of known hosts.
28-Oct-2026 07:11:28 X11 forwarding request failed on channel 0
28-Oct-2026 07:11:28 Checking out revision 188b64ce030a360ced17720a68d5af3bbcffaf87.
28-Oct-2026 07:11:28 Creating local git repository in '/export/cvpost134-nvme/casa/bamboohome/xml-data/build-dir/CASASPECS-MASTERTESTGPUPY312-TTM228PY312/.git'.
28-Oct-2026 07:11:28 Cloning into '/export/cvpost134-nvme/casa/bamboohome/xml-data/build-dir/CASASPECS-MASTERTESTGPUPY312-TTM228PY312'...
28-Oct-2026 07:11:29 done.
28-Oct-2026 07:11:36 Already on 'master'
28-Oct-2026 07:11:36 Your branch is up to date with 'origin/master'.
28-Oct-2026 07:11:36 Submodule 'casatools/casacore' (https://github.com/casacore/casacore.git) registered for path 'casatools/casacore'
28-Oct-2026 07:11:36 Submodule 'casatools/grpc-source' (https://github.com/grpc/grpc) registered for path 'casatools/grpc-source'
28-Oct-2026 07:11:36 Cloning into '/export/cvpost134-nvme/casa/bamboohome/xml-data/build-dir/CASASPECS-MASTERTESTGPUPY312-TTM228PY312/casatools/casacore'...
28-Oct-2026 07:11:47 Cloning into '/export/cvpost134-nvme/casa/bamboohome/xml-data/build-dir/CASASPECS-MASTERTESTGPUPY312-TTM228PY312/casatools/grpc-source'...
28-Oct-2026 07:12:14 Submodule path 'casatools/casacore': checked out 'aaf72eb7edd5a5fecefa78ca04713233b7b6ffd6'
28-Oct-2026 07:12:14 Submodule path 'casatools/grpc-source': checked out 'cca868ac8f3641df4003a82b7fc54c921e14f765'
28-Oct-2026 07:12:14 Submodule 'third_party/abseil-cpp' (https://github.com/abseil/abseil-cpp) registered for path 'casatools/grpc-source/third_party/abseil-cpp'
28-Oct-2026 07:12:14 Submodule 'third_party/benchmark' (https://github.com/google/benchmark) registered for path 'casatools/grpc-source/third_party/benchmark'
28-Oct-2026 07:12:14 Submodule 'third_party/bloaty' (https://github.com/google/bloaty.git) registered for path 'casatools/grpc-source/third_party/bloaty'
28-Oct-2026 07:12:14 Submodule 'third_party/boringssl' (https://github.com/google/boringssl.git) registered for path 'casatools/grpc-source/third_party/boringssl'
28-Oct-2026 07:12:14 Submodule 'third_party/boringssl-with-bazel' (https://github.com/google/boringssl.git) registered for path 'casatools/grpc-source/third_party/boringssl-with-bazel'
28-Oct-2026 07:12:14 Submodule 'third_party/cares/cares' (https://github.com/c-ares/c-ares.git) registered for path 'casatools/grpc-source/third_party/cares/cares'
28-Oct-2026 07:12:14 Submodule 'third_party/gflags' (https://github.com/gflags/gflags.git) registered for path 'casatools/grpc-source/third_party/gflags'
28-Oct-2026 07:12:14 Submodule 'third_party/googletest' (https://github.com/google/googletest.git) registered for path 'casatools/grpc-source/third_party/googletest'
28-Oct-2026 07:12:14 Submodule 'third_party/protobuf' (https://github.com/google/protobuf.git) registered for path 'casatools/grpc-source/third_party/protobuf'
28-Oct-2026 07:12:14 Submodule 'third_party/zlib' (https://github.com/madler/zlib) registered for path 'casatools/grpc-source/third_party/zlib'
28-Oct-2026 07:12:14 Cloning into '/export/cvpost134-nvme/casa/bamboohome/xml-data/build-dir/CASASPECS-MASTERTESTGPUPY312-TTM228PY312/casatools/grpc-source/third_party/abseil-cpp'...
28-Oct-2026 07:12:16 Cloning into '/export/cvpost134-nvme/casa/bamboohome/xml-data/build-dir/CASASPECS-MASTERTESTGPUPY312-TTM228PY312/casatools/grpc-source/third_party/benchmark'...
28-Oct-2026 07:12:16 Cloning into '/export/cvpost134-nvme/casa/bamboohome/xml-data/build-dir/CASASPECS-MASTERTESTGPUPY312-TTM228PY312/casatools/grpc-source/third_party/bloaty'...
28-Oct-2026 07:12:17 Cloning into '/export/cvpost134-nvme/casa/bamboohome/xml-data/build-dir/CASASPECS-MASTERTESTGPUPY312-TTM228PY312/casatools/grpc-source/third_party/boringssl'...
28-Oct-2026 07:12:30 Cloning into '/export/cvpost134-nvme/casa/bamboohome/xml-data/build-dir/CASASPECS-MASTERTESTGPUPY312-TTM228PY312/casatools/grpc-source/third_party/boringssl-with-bazel'...
28-Oct-2026 07:12:43 Cloning into '/export/cvpost134-nvme/casa/bamboohome/xml-data/build-dir/CASASPECS-MASTERTESTGPUPY312-TTM228PY312/casatools/grpc-source/third_party/cares/cares'...
28-Oct-2026 07:12:44 Cloning into '/export/cvpost134-nvme/casa/bamboohome/xml-data/build-dir/CASASPECS-MASTERTESTGPUPY312-TTM228PY312/casatools/grpc-source/third_party/gflags'...
28-Oct-2026 07:12:44 Cloning into '/export/cvpost134-nvme/casa/bamboohome/xml-data/build-dir/CASASPECS-MASTERTESTGPUPY312-TTM228PY312/casatools/grpc-source/third_party/googletest'...
28-Oct-2026 07:12:45 Cloning into '/export/cvpost134-nvme/casa/bamboohome/xml-data/build-dir/CASASPECS-MASTERTESTGPUPY312-TTM228PY312/casatools/grpc-source/third_party/protobuf'...
28-Oct-2026 07:12:56 Cloning into '/export/cvpost134-nvme/casa/bamboohome/xml-data/build-dir/CASASPECS-MASTERTESTGPUPY312-TTM228PY312/casatools/grpc-source/third_party/zlib'...
28-Oct-2026 07:12:56 Submodule path 'casatools/grpc-source/third_party/abseil-cpp': checked out 'cc4bed2d74f7c8717e31f9579214ab52a9c9c610'
28-Oct-2026 07:12:56 Submodule path 'casatools/grpc-source/third_party/benchmark': checked out '5b7683f49e1e9223cf9927b24f6fd3d6bd82e3f8'
28-Oct-2026 07:12:56 Submodule path 'casatools/grpc-source/third_party/bloaty': checked out '73594cde8c9a52a102c4341c244c833aa61b9c06'
28-Oct-2026 07:12:56 Submodule 'third_party/googletest' (https://github.com/google/googletest.git) registered for path 'casatools/grpc-source/third_party/bloaty/third_party/googletest'
28-Oct-2026 07:12:56 Submodule 'third_party/libFuzzer' (https://chromium.googlesource.com/chromium/llvm-project/llvm/lib/Fuzzer) registered for path 'casatools/grpc-source/third_party/bloaty/third_party/libFuzzer'
28-Oct-2026 07:12:56 Submodule 'third_party/re2' (https://github.com/google/re2) registered for path 'casatools/grpc-source/third_party/bloaty/third_party/re2'
28-Oct-2026 07:12:56 Cloning into '/export/cvpost134-nvme/casa/bamboohome/xml-data/build-dir/CASASPECS-MASTERTESTGPUPY312-TTM228PY312/casatools/grpc-source/third_party/bloaty/third_party/googletest'...
28-Oct-2026 07:12:58 Cloning into '/export/cvpost134-nvme/casa/bamboohome/xml-data/build-dir/CASASPECS-MASTERTESTGPUPY312-TTM228PY312/casatools/grpc-source/third_party/bloaty/third_party/libFuzzer'...
28-Oct-2026 07:12:58 Cloning into '/export/cvpost134-nvme/casa/bamboohome/xml-data/build-dir/CASASPECS-MASTERTESTGPUPY312-TTM228PY312/casatools/grpc-source/third_party/bloaty/third_party/re2'...
28-Oct-2026 07:12:58 Submodule path 'casatools/grpc-source/third_party/bloaty/third_party/googletest': checked out 'a2b8a8e07628e5fd60644b6dd99c1b5e7d7f1f47'
28-Oct-2026 07:12:58 Submodule path 'casatools/grpc-source/third_party/bloaty/third_party/libFuzzer': checked out '1b543d6e5073b56be214394890c9193979a3d7e1'
28-Oct-2026 07:12:58 Submodule path 'casatools/grpc-source/third_party/bloaty/third_party/re2': checked out 'c964d9b07816f9b52ca692e23b8b3dba33beec54'
28-Oct-2026 07:12:59 Submodule path 'casatools/grpc-source/third_party/boringssl': checked out 'be2ee342d3781ddb954f91f8a7e660c6f59e87e5'
28-Oct-2026 07:12:59 Submodule path 'casatools/grpc-source/third_party/boringssl-with-bazel': checked out '886e7d75368e3f4fab3f4d0d3584e4abfc557755'
28-Oct-2026 07:12:59 Submodule path 'casatools/grpc-source/third_party/cares/cares': checked out '3be1924221e1326df520f8498d704a5c4c8d0cce'
28-Oct-2026 07:12:59 Submodule path 'casatools/grpc-source/third_party/gflags': checked out '30dbc81fb5ffdc98ea9b14b1918bfe4e8779b26e'
28-Oct-2026 07:12:59 Submodule 'doc' (https://github.com/gflags/gflags.git) registered for path 'casatools/grpc-source/third_party/gflags/doc'
28-Oct-2026 07:12:59 Cloning into '/export/cvpost134-nvme/casa/bamboohome/xml-data/build-dir/CASASPECS-MASTERTESTGPUPY312-TTM228PY312/casatools/grpc-source/third_party/gflags/doc'...
28-Oct-2026 07:13:00 Submodule path 'casatools/grpc-source/third_party/gflags/doc': checked out '971dd2a4fadac9cdab174c523c22df79efd63aa5'
28-Oct-2026 07:13:00 Submodule path 'casatools/grpc-source/third_party/googletest': checked out 'ec44c6c1675c25b9827aacd08c02433cccde7780'
28-Oct-2026 07:13:00 Submodule path 'casatools/grpc-source/third_party/protobuf': checked out '2761122b810fe8861004ae785cc3ab39f384d342'
28-Oct-2026 07:13:00 Submodule 'third_party/benchmark' (https://github.com/google/benchmark.git) registered for path 'casatools/grpc-source/third_party/protobuf/third_party/benchmark'
28-Oct-2026 07:13:00 Cloning into '/export/cvpost134-nvme/casa/bamboohome/xml-data/build-dir/CASASPECS-MASTERTESTGPUPY312-TTM228PY312/casatools/grpc-source/third_party/protobuf/third_party/benchmark'...
28-Oct-2026 07:13:01 Submodule path 'casatools/grpc-source/third_party/protobuf/third_party/benchmark': checked out '360e66c1c4777c99402cf8cd535aa510fee16573'
28-Oct-2026 07:13:01 Submodule path 'casatools/grpc-source/third_party/zlib': checked out 'cacf7f1d4e3d44d871b605da3b647f07d718623f'
28-Oct-2026 07:13:01 Updated source code to revision: 188b64ce030a360ced17720a68d5af3bbcffaf87
28-Oct-2026 07:13:01 Finished task 'Source Code Checkout' with result: Success
28-Oct-2026 07:13:01 Running pre-build action: Build Log Labeller Pre Build Action
28-Oct-2026 07:13:01 Running pre-build action: VCS Version Collector
28-Oct-2026 07:13:01 Build CASASPECS - Master Test GPU 3.12 - Test Tasks Many Linux 2.28 Rocky 8.10 Py3.12 #190 (CASASPECS-MASTERTESTGPUPY312-TTM228PY312-190) started building on agent 'cvpost134.cv.nrao.edu' (Remote agent on host cvpost134.cv.nrao.edu)
28-Oct-2026 07:13:01 Starting task 'Update data' of type 'com.atlassian.bamboo.plugins.scripttask:task.builder.script'
28-Oct-2026 07:13:01
Beginning to execute external process for build 'CASASPECS - Master Test GPU 3.12 - Test Tasks Many Linux 2.28 Rocky 8.10 Py3.12 #190 (CASASPECS-MASTERTESTGPUPY312-TTM228PY312-190)'
... running command line:
/export/cvpost134-nvme/casa/bamboohome/temp/CASASPECS-MASTERTESTGPUPY312-TTM228PY312-190-ScriptBuildTask-1414154094928907771.sh
... in: /export/cvpost134-nvme/casa/bamboohome/xml-data/build-dir/CASASPECS-MASTERTESTGPUPY312-TTM228PY312
28-Oct-2026 07:13:01 /export/cvpost134-nvme/casa/bamboohome/temp/CASASPECS-MASTERTESTGPUPY312-TTM228PY312-190-ScriptBuildTask-1414154094928907771.sh: line 1: cd: /opt/casa/data/master: No such file or directory
28-Oct-2026 07:13:01 /export/cvpost134-nvme/casa/bamboohome/temp/CASASPECS-MASTERTESTGPUPY312-TTM228PY312-190-ScriptBuildTask-1414154094928907771.sh: line 2: cd: /opt/casa/data/casa-data-req: No such file or directory
28-Oct-2026 07:13:01 /export/cvpost134-nvme/casa/bamboohome/temp/CASASPECS-MASTERTESTGPUPY312-TTM228PY312-190-ScriptBuildTask-1414154094928907771.sh: line 3: cd: /opt/casa/data/casatestdata: No such file or directory
28-Oct-2026 07:13:01 Data update complete
28-Oct-2026 07:13:01 Finished task 'Update data' with result: Success
28-Oct-2026 07:13:01
Substituting variable: ${bamboo.repository.branch.name} with master
28-Oct-2026 07:13:01 Starting task 'Create wheeldirectory' of type 'com.atlassian.bamboo.plugins.scripttask:task.builder.script'
28-Oct-2026 07:13:01
Beginning to execute external process for build 'CASASPECS - Master Test GPU 3.12 - Test Tasks Many Linux 2.28 Rocky 8.10 Py3.12 #190 (CASASPECS-MASTERTESTGPUPY312-TTM228PY312-190)'
... running command line:
/export/cvpost134-nvme/casa/bamboohome/temp/CASASPECS-MASTERTESTGPUPY312-TTM228PY312-190-ScriptBuildTask-8453598310508768845.sh
... in: /export/cvpost134-nvme/casa/bamboohome/xml-data/build-dir/CASASPECS-MASTERTESTGPUPY312-TTM228PY312
28-Oct-2026 07:13:01 Finished task 'Create wheeldirectory' with result: Success
28-Oct-2026 07:13:01 Starting task 'Get wheel from parent build plan' of type 'com.atlassian.bamboo.plugins.bamboo-artifact-downloader-plugin:artifactdownloadertask'
28-Oct-2026 07:13:01 Preparing to download plan result CASASPECS-MASTERBUILDCASALITHGPU-203 artifact: Non required shared artifact Http Compression On : [ManyLinux228 Python 3.12 Task wheel], patterns: [casatasks*.whl] anchored at: [source/wheels]
28-Oct-2026 07:13:01 Retrieving artifact ManyLinux228 Python 3.12 Task wheel for CASASPECS-MASTERBUILDCASALITHGPU-203 using Bamboo server artifact handler
28-Oct-2026 07:13:01 Artifact [ManyLinux228 Python 3.12 Task wheel] downloaded successfully in 161.8 ms to wheeldirectory/
28-Oct-2026 07:13:01 Preparing to download plan result CASASPECS-MASTERBUILDCASALITHGPU-203 artifact: Required shared artifact Http Compression On : [ManyLinux228 3.12 Casatestutils], patterns: [casatestutils*.whl] anchored at: [source/wheels]
28-Oct-2026 07:13:01 Retrieving artifact ManyLinux228 3.12 Casatestutils for CASASPECS-MASTERBUILDCASALITHGPU-203 using Bamboo server artifact handler
28-Oct-2026 07:13:01 Artifact [ManyLinux228 3.12 Casatestutils] downloaded successfully in 14.51 ms to wheeldirectory/
28-Oct-2026 07:13:01 Preparing to download plan result CASASPECS-MASTERBUILDCASALITHGPU-203 artifact: Non required shared artifact Http Compression On : [ManyLinux228 Python 3.12 Tool wheel], patterns: [casatools*.whl] anchored at: [source/wheels]
28-Oct-2026 07:13:01 Retrieving artifact ManyLinux228 Python 3.12 Tool wheel for CASASPECS-MASTERBUILDCASALITHGPU-203 using Bamboo server artifact handler
28-Oct-2026 07:13:11 Artifact [ManyLinux228 Python 3.12 Tool wheel] downloaded successfully in 9.587 s to wheeldirectory/
28-Oct-2026 07:13:11 Finished task 'Get wheel from parent build plan' with result: Success
28-Oct-2026 07:13:11 Starting task 'Stop and remove running wheel-container-test' of type 'com.atlassian.bamboo.plugins.scripttask:task.builder.script'
28-Oct-2026 07:13:11
Beginning to execute external process for build 'CASASPECS - Master Test GPU 3.12 - Test Tasks Many Linux 2.28 Rocky 8.10 Py3.12 #190 (CASASPECS-MASTERTESTGPUPY312-TTM228PY312-190)'
... running command line:
/export/cvpost134-nvme/casa/bamboohome/temp/CASASPECS-MASTERTESTGPUPY312-TTM228PY312-190-ScriptBuildTask-9116514442924474770.sh
... in: /export/cvpost134-nvme/casa/bamboohome/xml-data/build-dir/CASASPECS-MASTERTESTGPUPY312-TTM228PY312
28-Oct-2026 07:13:11 Error response from daemon: No such container: wheel-container-test
28-Oct-2026 07:13:11 Error response from daemon: No such container: wheel-container-test
28-Oct-2026 07:13:11 Removed wheel-container-test
28-Oct-2026 07:13:11 Finished task 'Stop and remove running wheel-container-test' with result: Success
28-Oct-2026 07:13:11
Substituting variable: ${bamboo.capability.hostname} with cvpost134
28-Oct-2026 07:13:11
Substituting variable: ${bamboo.capability.hostname} with cvpost134
28-Oct-2026 07:13:11
Substituting variable: ${bamboo.capability.hostname} with cvpost134
28-Oct-2026 07:13:11
Substituting variable: ${bamboo.working.directory} with /export/cvpost134-nvme/casa/bamboohome/xml-data/build-dir/CASASPECS-MASTERTESTGPUPY312-TTM228PY312
28-Oct-2026 07:13:11 Starting task 'start docker with conditional arguments' of type 'com.atlassian.bamboo.plugins.scripttask:task.builder.script'
28-Oct-2026 07:13:11
Beginning to execute external process for build 'CASASPECS - Master Test GPU 3.12 - Test Tasks Many Linux 2.28 Rocky 8.10 Py3.12 #190 (CASASPECS-MASTERTESTGPUPY312-TTM228PY312-190)'
... running command line:
/export/cvpost134-nvme/casa/bamboohome/temp/CASASPECS-MASTERTESTGPUPY312-TTM228PY312-190-ScriptBuildTask-11959582992486139331.sh
... in: /export/cvpost134-nvme/casa/bamboohome/xml-data/build-dir/CASASPECS-MASTERTESTGPUPY312-TTM228PY312
28-Oct-2026 07:13:11 Already up to date.
28-Oct-2026 07:13:11 Already up to date.
28-Oct-2026 07:13:11 Data update complete
28-Oct-2026 07:13:33 f07beb2ea8b12ac998d8ecf48cef230c10f755cc65a29a835c9747e93c8bc6b4
28-Oct-2026 07:13:37 CONTAINER ID   IMAGE                                              COMMAND               CREATED          STATUS                   PORTS     NAMES
28-Oct-2026 07:13:37 f07beb2ea8b1   casa-docker.nrao.edu:5000/casa-test-rocky-8.10:4   "tail -f /dev/null"   26 seconds ago   Up Less than a second              wheel-container-test
28-Oct-2026 07:13:37 e3f4c92a1c32   hello-world                                        "/hello"              3 weeks ago      Exited (0) 3 weeks ago             suspicious_northcutt
28-Oct-2026 07:13:38 Wed Oct 28 07:13:38 2026       
28-Oct-2026 07:13:38 +-----------------------------------------------------------------------------------------+
28-Oct-2026 07:13:38 | NVIDIA-SMI 555.42.06              Driver Version: 555.42.06      CUDA Version: 12.5     |
28-Oct-2026 07:13:38 |-----------------------------------------+------------------------+----------------------+
28-Oct-2026 07:13:38 | GPU  Name                 Persistence-M | Bus-Id          Disp.A | Volatile Uncorr. ECC |
28-Oct-2026 07:13:38 | Fan  Temp   Perf          Pwr:Usage/Cap |           Memory-Usage | GPU-Util  Compute M. |
28-Oct-2026 07:13:38 |                                         |                        |               MIG M. |
28-Oct-2026 07:13:38 |=========================================+========================+======================|
28-Oct-2026 07:13:38 |   0  NVIDIA L4                      Off |   00000000:3B:00.0 Off |                    0 |
28-Oct-2026 07:13:38 | N/A   47C    P0             28W /   72W |       1MiB /  23034MiB |      1%      Default |
28-Oct-2026 07:13:38 |                                         |                        |                  N/A |
28-Oct-2026 07:13:38 +-----------------------------------------+------------------------+----------------------+
28-Oct-2026 07:13:38                                                                                          
28-Oct-2026 07:13:38 +-----------------------------------------------------------------------------------------+
28-Oct-2026 07:13:38 | Processes:                                                                              |
28-Oct-2026 07:13:38 |  GPU   GI   CI        PID   Type   Process name                              GPU Memory |
28-Oct-2026 07:13:38 |        ID   ID                                                               Usage      |
28-Oct-2026 07:13:38 |=========================================================================================|
28-Oct-2026 07:13:38 |  No running processes found                                                             |
28-Oct-2026 07:13:38 +-----------------------------------------------------------------------------------------+
28-Oct-2026 07:13:39 Finished task 'start docker with conditional arguments' with result: Success
28-Oct-2026 07:13:39
Substituting variable: ${bamboo.planRepository.branchName} with master
28-Oct-2026 07:13:39 Starting task 'Test wheel' of type 'com.atlassian.bamboo.plugins.scripttask:task.builder.script'
28-Oct-2026 07:13:39
Beginning to execute external process for build 'CASASPECS - Master Test GPU 3.12 - Test Tasks Many Linux 2.28 Rocky 8.10 Py3.12 #190 (CASASPECS-MASTERTESTGPUPY312-TTM228PY312-190)'
... running command line:
/export/cvpost134-nvme/casa/bamboohome/temp/CASASPECS-MASTERTESTGPUPY312-TTM228PY312-190-ScriptBuildTask-11603851217368826958.sh
... in: /export/cvpost134-nvme/casa/bamboohome/xml-data/build-dir/CASASPECS-MASTERTESTGPUPY312-TTM228PY312
28-Oct-2026 07:13:39 branch: master
28-Oct-2026 07:13:39 Python version: 3.12
28-Oct-2026 07:13:39   % Total    % Received % Xferd  Average Speed   Time    Time     Time  Current
28-Oct-2026 07:13:39                                  Dload  Upload   Total   Spent    Left  Speed
28-Oct-2026 07:13:39
28-Oct-2026 07:13:39   0     0    0     0    0     0      0      0 --:--:-- --:--:-- --:--:--     0
28-Oct-2026 07:13:39 100 6002k  100 6002k    0     0  68.9M      0 --:--:-- --:--:-- --:--:-- 68.9M
28-Oct-2026 07:13:39 bamboo_jira_components:''
28-Oct-2026 07:13:39 bamboo_testlist:''
28-Oct-2026 07:13:39 [4020928] Failed to execute script 'atlutil' due to unhandled exception!
28-Oct-2026 07:13:39 Traceback (most recent call last):
28-Oct-2026 07:13:39   File "atlutil.py", line 194, in <module>
28-Oct-2026 07:13:39   File "atlutil.py", line 112, in get_ticket_components
28-Oct-2026 07:13:39 KeyError: 'fields'
28-Oct-2026 07:13:39 Ticket components:  -j ""
28-Oct-2026 07:13:39 datapath=[ "/opt/casa/data/master", "/opt/casa/data/casatestdata" ]
28-Oct-2026 07:13:39 measurespath="/opt/casa/data/master"
28-Oct-2026 07:13:39 measures_auto_update=False
28-Oct-2026 07:13:39 data_auto_update=False
28-Oct-2026 07:13:40 [4021000] Failed to execute script 'atlutil' due to unhandled exception!
28-Oct-2026 07:13:40 Traceback (most recent call last):
28-Oct-2026 07:13:40   File "atlutil.py", line 200, in <module>
28-Oct-2026 07:13:40   File "atlutil.py", line 165, in has_fix_version
28-Oct-2026 07:13:40 KeyError: 'fields'
28-Oct-2026 07:13:40 datapath=[ "/opt/casa/data/master", "/opt/casa/data/casatestdata" ]
28-Oct-2026 07:13:40 measurespath="/opt/casa/data/master"
28-Oct-2026 07:13:40 measures_auto_update=False
28-Oct-2026 07:13:40 data_auto_update=False
28-Oct-2026 07:13:43 Requirement already satisfied: pip in /home/casatest/venv/lib/python3.12/site-packages (24.3.1)
28-Oct-2026 07:13:43 Collecting pip
28-Oct-2026 07:13:43   Downloading pip-26.2.2-py3-none-any.whl.metadata (4.6 kB)
28-Oct-2026 07:13:43 Collecting numpy
28-Oct-2026 07:13:43   Downloading numpy-2.5.4-cp312-cp312-manylinux_2_27_x86_64.manylinux_2_28_x86_64.whl.metadata (6.6 kB)
28-Oct-2026 07:13:43 Collecting matplotlib
28-Oct-2026 07:13:43   Downloading matplotlib-3.11.2-cp312-cp312-manylinux2014_x86_64.manylinux_2_17_x86_64.whl.metadata (80 kB)
28-Oct-2026 07:13:43 Collecting scipy
28-Oct-2026 07:13:43   Downloading scipy-1.18.1-cp312-cp312-manylinux_2_27_x86_64.manylinux_2_28_x86_64.whl.metadata (62 kB)
28-Oct-2026 07:13:44 Collecting setuptools
28-Oct-2026 07:13:44   Downloading setuptools-84.2.1-py3-none-any.whl.metadata (6.6 kB)
28-Oct-2026 07:13:44 Collecting contourpy>=1.0.1 (from matplotlib)
28-Oct-2026 07:13:44   Downloading contourpy-1.4.0-cp312-cp312-manylinux_2_27_x86_64.manylinux_2_28_x86_64.whl.metadata (3.8 kB)
28-Oct-2026 07:13:44 Collecting cycler>=0.10 (from matplotlib)
28-Oct-2026 07:13:44   Downloading cycler-0.12.1-py3-none-any.whl.metadata (3.8 kB)
28-Oct-2026 07:13:44 Collecting fonttools>=4.28.2 (from matplotlib)
28-Oct-2026 07:13:44   Downloading fonttools-4.68.0-cp312-cp312-manylinux2014_x86_64.manylinux_2_17_x86_64.whl.metadata (139 kB)
28-Oct-2026 07:13:44 Collecting kiwisolver>=1.3.1 (from matplotlib)
28-Oct-2026 07:13:44   Downloading kiwisolver-1.5.1-cp312-cp312-manylinux2014_x86_64.manylinux_2_17_x86_64.whl.metadata (5.2 kB)
28-Oct-2026 07:13:44 Collecting packaging>=20.0 (from matplotlib)
28-Oct-2026 07:13:44   Downloading packaging-26.3-py3-none-any.whl.metadata (3.5 kB)
28-Oct-2026 07:13:45 Collecting pillow>=9 (from matplotlib)
28-Oct-2026 07:13:45   Downloading pillow-13.0.0-cp312-cp312-manylinux_2_27_x86_64.manylinux_2_28_x86_64.whl.metadata (9.1 kB)
28-Oct-2026 07:13:45 Collecting pyparsing>=3 (from matplotlib)
28-Oct-2026 07:13:45   Downloading pyparsing-3.3.3-py3-none-any.whl.metadata (5.9 kB)
28-Oct-2026 07:13:45 Collecting python-dateutil>=2.7 (from matplotlib)
28-Oct-2026 07:13:45   Downloading python_dateutil-3.0.0-py2.py3-none-any.whl.metadata (8.2 kB)
28-Oct-2026 07:13:45 Collecting six>=1.6 (from python-dateutil>=2.7->matplotlib)
28-Oct-2026 07:13:45   Downloading six-1.17.0-py2.py3-none-any.whl.metadata (1.7 kB)
28-Oct-2026 07:13:45 Collecting tzdata (from python-dateutil>=2.7->matplotlib)
28-Oct-2026 07:13:45   Downloading tzdata-2026.5-py2.py3-none-any.whl.metadata (1.4 kB)
28-Oct-2026 07:13:45 Downloading pip-26.2.2-py3-none-any.whl (1.8 MB)
28-Oct-2026 07:13:45    ━━━━━━━━━━━━━━━━━━━━━━━━━━━━━━━━━━━━━━━━ 1.8/1.8 MB 46.1 MB/s eta 0:00:00
28-Oct-2026 07:13:45 Downloading numpy-2.5.4-cp312-cp312-manylinux_2_27_x86_64.manylinux_2_28_x86_64.whl (16.7 MB)
28-Oct-2026 07:13:45    ━━━━━━━━━━━━━━━━━━━━━━━━━━━━━━━━━━━━━━━━ 16.7/16.7 MB 76.5 MB/s eta 0:00:00
28-Oct-2026 07:13:45 Downloading matplotlib-3.11.2-cp312-cp312-manylinux2014_x86_64.manylinux_2_17_x86_64.whl (9.9 MB)
28-Oct-2026 07:13:45    ━━━━━━━━━━━━━━━━━━━━━━━━━━━━━━━━━━━━━━━━ 9.9/9.9 MB 74.8 MB/s eta 0:00:00
28-Oct-2026 07:13:45 Downloading scipy-1.18.1-cp312-cp312-manylinux_2_27_x86_64.manylinux_2_28_x86_64.whl (35.3 MB)
28-Oct-2026 07:13:46    ━━━━━━━━━━━━━━━━━━━━━━━━━━━━━━━━━━━━━━━━ 35.3/35.3 MB 97.3 MB/s eta 0:00:00
28-Oct-2026 07:13:46 Downloading setuptools-84.2.1-py3-none-any.whl (876 kB)
28-Oct-2026 07:13:46    ━━━━━━━━━━━━━━━━━━━━━━━━━━━━━━━━━━━━━━━━ 876.3/876.3 kB 19.7 MB/s eta 0:00:00
28-Oct-2026 07:13:46 Downloading contourpy-1.4.0-cp312-cp312-manylinux_2_27_x86_64.manylinux_2_28_x86_64.whl (383 kB)
28-Oct-2026 07:13:46 Downloading cycler-0.12.1-py3-none-any.whl (8.3 kB)
28-Oct-2026 07:13:46 Downloading fonttools-4.68.0-cp312-cp312-manylinux2014_x86_64.manylinux_2_17_x86_64.whl (5.4 MB)
28-Oct-2026 07:13:46    ━━━━━━━━━━━━━━━━━━━━━━━━━━━━━━━━━━━━━━━━ 5.4/5.4 MB 76.4 MB/s eta 0:00:00
28-Oct-2026 07:13:46 Downloading kiwisolver-1.5.1-cp312-cp312-manylinux2014_x86_64.manylinux_2_17_x86_64.whl (1.5 MB)
28-Oct-2026 07:13:46    ━━━━━━━━━━━━━━━━━━━━━━━━━━━━━━━━━━━━━━━━ 1.5/1.5 MB 35.4 MB/s eta 0:00:00
28-Oct-2026 07:13:46 Downloading packaging-26.3-py3-none-any.whl (129 kB)
28-Oct-2026 07:13:46 Downloading pillow-13.0.0-cp312-cp312-manylinux_2_27_x86_64.manylinux_2_28_x86_64.whl (7.1 MB)
28-Oct-2026 07:13:46    ━━━━━━━━━━━━━━━━━━━━━━━━━━━━━━━━━━━━━━━━ 7.1/7.1 MB 81.3 MB/s eta 0:00:00
28-Oct-2026 07:13:46 Downloading pyparsing-3.3.3-py3-none-any.whl (126 kB)
28-Oct-2026 07:13:46 Downloading python_dateutil-3.0.0-py2.py3-none-any.whl (94 kB)
28-Oct-2026 07:13:46 Downloading six-1.17.0-py2.py3-none-any.whl (11 kB)
28-Oct-2026 07:13:46 Downloading tzdata-2026.5-py2.py3-none-any.whl (347 kB)
28-Oct-2026 07:13:46 Installing collected packages: tzdata, six, setuptools, pyparsing, pip, pillow, packaging, numpy, kiwisolver, fonttools, cycler, scipy, python-dateutil, contourpy, matplotlib
28-Oct-2026 07:13:47   Attempting uninstall: pip
28-Oct-2026 07:13:47     Found existing installation: pip 24.3.1
28-Oct-2026 07:13:47     Uninstalling pip-24.3.1:
28-Oct-2026 07:13:47       Successfully uninstalled pip-24.3.1
28-Oct-2026 07:13:59 Successfully installed contourpy-1.4.0 cycler-0.12.1 fonttools-4.68.0 kiwisolver-1.5.1 matplotlib-3.11.2 numpy-2.5.4 packaging-26.3 pillow-13.0.0 pip-26.2.2 pyparsing-3.3.3 python-dateutil-3.0.0 scipy-1.18.1 setuptools-84.2.1 six-1.17.0 tzdata-2026.5
28-Oct-2026 07:13:59 Processing ./casatestutils-6.8.0.2-py3-none-any.whl
28-Oct-2026 07:13:59 Collecting pytest>=6.0 (from casatestutils==6.8.0.2)
28-Oct-2026 07:13:59   Downloading pytest-9.2.0-py3-none-any.whl.metadata (7.9 kB)
28-Oct-2026 07:14:00 Collecting astropy (from casatestutils==6.8.0.2)
28-Oct-2026 07:14:00   Downloading astropy-8.0.2-cp311-abi3-manylinux2014_x86_64.manylinux_2_17_x86_64.manylinux_2_28_x86_64.whl.metadata (11 kB)
28-Oct-2026 07:14:00 Collecting iniconfig>=2 (from pytest>=6.0->casatestutils==6.8.0.2)
28-Oct-2026 07:14:00   Downloading iniconfig-2.3.1-py3-none-any.whl.metadata (2.8 kB)
28-Oct-2026 07:14:00 Requirement already satisfied: packaging>=24 in /home/casatest/venv/lib/python3.12/site-packages (from pytest>=6.0->casatestutils==6.8.0.2) (26.3)
28-Oct-2026 07:14:00 Collecting pluggy<2,>=1.6 (from pytest>=6.0->casatestutils==6.8.0.2)
28-Oct-2026 07:14:00   Downloading pluggy-1.7.0-py3-none-any.whl.metadata (5.0 kB)
28-Oct-2026 07:14:00 Collecting pygments>=2.15 (from pytest>=6.0->casatestutils==6.8.0.2)
28-Oct-2026 07:14:00   Downloading pygments-2.21.0-py3-none-any.whl.metadata (2.5 kB)
28-Oct-2026 07:14:00 Collecting astropy-iers-data>=0.2026.9.28.0.59.37 (from astropy->casatestutils==6.8.0.2)
28-Oct-2026 07:14:00   Downloading astropy_iers_data-0.2026.10.19.0.52.1-py3-none-any.whl.metadata (3.4 kB)
28-Oct-2026 07:14:00 Requirement already satisfied: numpy>=2.0 in /home/casatest/venv/lib/python3.12/site-packages (from astropy->casatestutils==6.8.0.2) (2.5.4)
28-Oct-2026 07:14:00 Collecting pyerfa>=2.0.1.3 (from astropy->casatestutils==6.8.0.2)
28-Oct-2026 07:14:00   Downloading pyerfa-2.0.1.5-cp39-abi3-manylinux_2_17_x86_64.manylinux2014_x86_64.whl.metadata (5.7 kB)
28-Oct-2026 07:14:00 Collecting PyYAML>=6.0.0 (from astropy->casatestutils==6.8.0.2)
28-Oct-2026 07:14:00   Downloading pyyaml-6.0.3-cp312-cp312-manylinux2014_x86_64.manylinux_2_17_x86_64.manylinux_2_28_x86_64.whl.metadata (2.4 kB)
28-Oct-2026 07:14:00 Downloading pytest-9.2.0-py3-none-any.whl (411 kB)
28-Oct-2026 07:14:00 Downloading pluggy-1.7.0-py3-none-any.whl (27 kB)
28-Oct-2026 07:14:00 Downloading iniconfig-2.3.1-py3-none-any.whl (7.6 kB)
28-Oct-2026 07:14:00 Downloading pygments-2.21.0-py3-none-any.whl (1.3 MB)
28-Oct-2026 07:14:00    ━━━━━━━━━━━━━━━━━━━━━━━━━━━━━━━━━━━━━━━━ 1.3/1.3 MB 34.4 MB/s  0:00:00
28-Oct-2026 07:14:00 Downloading astropy-8.0.2-cp311-abi3-manylinux2014_x86_64.manylinux_2_17_x86_64.manylinux_2_28_x86_64.whl (10.4 MB)
28-Oct-2026 07:14:00    ━━━━━━━━━━━━━━━━━━━━━━━━━━━━━━━━━━━━━━━━ 10.4/10.4 MB 48.4 MB/s  0:00:00
28-Oct-2026 07:14:00 Downloading astropy_iers_data-0.2026.10.19.0.52.1-py3-none-any.whl (2.0 MB)
28-Oct-2026 07:14:00    ━━━━━━━━━━━━━━━━━━━━━━━━━━━━━━━━━━━━━━━━ 2.0/2.0 MB 34.5 MB/s  0:00:00
28-Oct-2026 07:14:00 Downloading pyerfa-2.0.1.5-cp39-abi3-manylinux_2_17_x86_64.manylinux2014_x86_64.whl (738 kB)
28-Oct-2026 07:14:00    ━━━━━━━━━━━━━━━━━━━━━━━━━━━━━━━━━━━━━━━━ 738.7/738.7 kB 12.6 MB/s  0:00:00
28-Oct-2026 07:14:00 Downloading pyyaml-6.0.3-cp312-cp312-manylinux2014_x86_64.manylinux_2_17_x86_64.manylinux_2_28_x86_64.whl (807 kB)
28-Oct-2026 07:14:01    ━━━━━━━━━━━━━━━━━━━━━━━━━━━━━━━━━━━━━━━━ 807.9/807.9 kB 15.6 MB/s  0:00:00
28-Oct-2026 07:14:01 Installing collected packages: PyYAML, pygments, pyerfa, pluggy, iniconfig, astropy-iers-data, pytest, astropy, casatestutils
28-Oct-2026 07:14:05
28-Oct-2026 07:14:05 Successfully installed PyYAML-6.0.3 astropy-8.0.2 astropy-iers-data-0.2026.10.19.0.52.1 casatestutils-6.8.0.2 iniconfig-2.3.1 pluggy-1.7.0 pyerfa-2.0.1.5 pygments-2.21.0 pytest-9.2.0
28-Oct-2026 07:14:06 Processing ./casatools-6.8.0.2-cp312-cp312-manylinux_2_28_x86_64.whl
28-Oct-2026 07:14:06 Requirement already satisfied: numpy in /home/casatest/venv/lib/python3.12/site-packages (from casatools==6.8.0.2) (2.5.4)
28-Oct-2026 07:14:06 Collecting casaconfig (from casatools==6.8.0.2)
28-Oct-2026 07:14:06   Downloading casaconfig-1.5.2-py3-none-any.whl.metadata (4.0 kB)
28-Oct-2026 07:14:06 Collecting certifi>=2023.5.7 (from casaconfig->casatools==6.8.0.2)
28-Oct-2026 07:14:06   Downloading certifi-2026.10.23-py3-none-any.whl.metadata (2.5 kB)
28-Oct-2026 07:14:06 Downloading casaconfig-1.5.2-py3-none-any.whl (77 kB)
28-Oct-2026 07:14:07 Downloading certifi-2026.10.23-py3-none-any.whl (135 kB)
28-Oct-2026 07:14:07 Installing collected packages: certifi, casaconfig, casatools
28-Oct-2026 07:14:11
28-Oct-2026 07:14:11 Successfully installed casaconfig-1.5.2 casatools-6.8.0.2 certifi-2026.10.23
28-Oct-2026 07:14:12 Processing ./casatasks-6.8.0.2-py3-none-any.whl
28-Oct-2026 07:14:12 Requirement already satisfied: casatools==6.8.0.2 in /home/casatest/venv/lib/python3.12/site-packages (from casatasks==6.8.0.2) (6.8.0.2)
28-Oct-2026 07:14:12 Requirement already satisfied: matplotlib in /home/casatest/venv/lib/python3.12/site-packages (from casatasks==6.8.0.2) (3.11.2)
28-Oct-2026 07:14:12 Requirement already satisfied: scipy in /home/casatest/venv/lib/python3.12/site-packages (from casatasks==6.8.0.2) (1.18.1)
28-Oct-2026 07:14:12 Requirement already satisfied: certifi in /home/casatest/venv/lib/python3.12/site-packages (from casatasks==6.8.0.2) (2026.10.23)
28-Oct-2026 07:14:12 Requirement already satisfied: pyerfa in /home/casatest/venv/lib/python3.12/site-packages (from casatasks==6.8.0.2) (2.0.1.5)
28-Oct-2026 07:14:12 Requirement already satisfied: numpy in /home/casatest/venv/lib/python3.12/site-packages (from casatools==6.8.0.2->casatasks==6.8.0.2) (2.5.4)
28-Oct-2026 07:14:12 Requirement already satisfied: casaconfig in /home/casatest/venv/lib/python3.12/site-packages (from casatools==6.8.0.2->casatasks==6.8.0.2) (1.5.2)
28-Oct-2026 07:14:12 Requirement already satisfied: contourpy>=1.0.1 in /home/casatest/venv/lib/python3.12/site-packages (from matplotlib->casatasks==6.8.0.2) (1.4.0)
28-Oct-2026 07:14:12 Requirement already satisfied: cycler>=0.10 in /home/casatest/venv/lib/python3.12/site-packages (from matplotlib->casatasks==6.8.0.2) (0.12.1)
28-Oct-2026 07:14:12 Requirement already satisfied: fonttools>=4.28.2 in /home/casatest/venv/lib/python3.12/site-packages (from matplotlib->casatasks==6.8.0.2) (4.68.0)
28-Oct-2026 07:14:12 Requirement already satisfied: kiwisolver>=1.3.1 in /home/casatest/venv/lib/python3.12/site-packages (from matplotlib->casatasks==6.8.0.2) (1.5.1)
28-Oct-2026 07:14:12 Requirement already satisfied: packaging>=20.0 in /home/casatest/venv/lib/python3.12/site-packages (from matplotlib->casatasks==6.8.0.2) (26.3)
28-Oct-2026 07:14:12 Requirement already satisfied: pillow>=9 in /home/casatest/venv/lib/python3.12/site-packages (from matplotlib->casatasks==6.8.0.2) (13.0.0)
28-Oct-2026 07:14:12 Requirement already satisfied: pyparsing>=3 in /home/casatest/venv/lib/python3.12/site-packages (from matplotlib->casatasks==6.8.0.2) (3.3.3)
28-Oct-2026 07:14:12 Requirement already satisfied: python-dateutil>=2.7 in /home/casatest/venv/lib/python3.12/site-packages (from matplotlib->casatasks==6.8.0.2) (3.0.0)
28-Oct-2026 07:14:12 Requirement already satisfied: six>=1.6 in /home/casatest/venv/lib/python3.12/site-packages (from python-dateutil>=2.7->matplotlib->casatasks==6.8.0.2) (1.17.0)
28-Oct-2026 07:14:12 Requirement already satisfied: tzdata in /home/casatest/venv/lib/python3.12/site-packages (from python-dateutil>=2.7->matplotlib->casatasks==6.8.0.2) (2026.5)
28-Oct-2026 07:14:12 Installing collected packages: casatasks
28-Oct-2026 07:14:13 Successfully installed casatasks-6.8.0.2
28-Oct-2026 07:14:13 Runtest command: python3.12 runtest.py --ignore_list 'test_casampi,test_task_msview,test_task_imview,test_task_plotms' -t /home/casatest/casa6/casatasks/tests/tasks -e /home/casatest/casa6/casatestutils/casatestutils/component_to_test_map.json -j casatasks 2>&1 | tee casatasks_test.log
28-Oct-2026 07:15:50 Already on 'master'
28-Oct-2026 07:15:50 Your branch is up to date with 'origin/master'.
28-Oct-2026 07:15:50 LICENSE
28-Oct-2026 07:15:50 README.md
28-Oct-2026 07:15:50 __init__.py
28-Oct-2026 07:15:50 casatestutils
28-Oct-2026 07:15:50 pyproject.toml
28-Oct-2026 07:15:50 runtest.py
28-Oct-2026 07:15:50 setup.py
28-Oct-2026 07:15:50 testrunner
28-Oct-2026 07:15:50 tests
28-Oct-2026 07:15:50 version
28-Oct-2026 07:15:50 xmlrunner_to_junit.py
28-Oct-2026 07:15:50 Namespace(list=False, verbose=False, dry_run=False, classes=None, file=None, mapfile=<_io.TextIOWrapper name='/home/casatest/casa6/casatestutils/casatestutils/component_to_test_map.json' mode='r' encoding='utf-8'>, branch=None, merge_target=None, pkg=None, work_dir=None, ncores=2, test_paths='/home/casatest/casa6/casatasks/tests/tasks', test_list=None, test_config=None, test_group='casatasks', pmode=None, bamboo=False, cachedir=None, ignore_list='test_casampi,test_task_msview,test_task_imview,test_task_plotms', run_skipped=False, only_skipped=False)
28-Oct-2026 07:15:50
28-Oct-2026 07:15:50 Operating system: Linux
28-Oct-2026 07:15:50
28-Oct-2026 07:15:50 Testing Components['casatasks']
28-Oct-2026 07:15:50
28-Oct-2026 07:15:50 Arguments Sent Direct To Pytest :  []
28-Oct-2026 07:15:50
28-Oct-2026 07:15:50 Tests to Ignore:  ['test_casampi', 'test_task_msview', 'test_task_imview', 'test_task_plotms']
28-Oct-2026 07:15:50 Running 123 Test(s)
28-Oct-2026 07:15:50 Cleaning: /home/casatest/casa6/casatestutils/nosedir/
28-Oct-2026 07:15:50 Tests: ['/home/casatest/casa6/casatasks/tests/tasks/test_task_accor.py', '/home/casatest/casa6/casatasks/tests/tasks/test_task_appendantab.py', '/home/casatest/casa6/casatasks/tests/tasks/test_task_applycal.py', '/home/casatest/casa6/casatasks/tests/tasks/test_task_asdmsummary.py', '/home/casatest/casa6/casatasks/tests/tasks/test_task_bandpass.py', '/home/casatest/casa6/casatasks/tests/tasks/test_task_blcal.py', '/home/casatest/casa6/casatasks/tests/tasks/test_task_calstat.py', '/home/casatest/casa6/casatasks/tests/tasks/test_task_clearcal.py', '/home/casatest/casa6/casatasks/tests/tasks/test_task_clearstat.py', '/home/casatest/casa6/casatasks/tests/tasks/test_task_concat.py', '/home/casatest/casa6/casatasks/tests/tasks/test_task_conjugatevis.py', '/home/casatest/casa6/casatasks/tests/tasks/test_task_cvel.py', '/home/casatest/casa6/casatasks/tests/tasks/test_task_cvel2.py', '/home/casatest/casa6/casatasks/tests/tasks/test_task_deconvolve.py', '/home/casatest/casa6/casatasks/tests/tasks/test_task_defintent.py', '/home/casatest/casa6/casatasks/tests/tasks/test_task_delmod.py', '/home/casatest/casa6/casatasks/tests/tasks/test_task_exportantab.py', '/home/casatest/casa6/casatasks/tests/tasks/test_task_exportasdm.py', '/home/casatest/casa6/casatasks/tests/tasks/test_task_exportfits.py', '/home/casatest/casa6/casatasks/tests/tasks/test_task_exportuvfits.py', '/home/casatest/casa6/casatasks/tests/tasks/test_task_feather.py', '/home/casatest/casa6/casatasks/tests/tasks/test_task_fixplanets.py', '/home/casatest/casa6/casatasks/tests/tasks/test_task_fixvis.py', '/home/casatest/casa6/casatasks/tests/tasks/test_task_flagcmd.py', '/home/casatest/casa6/casatasks/tests/tasks/test_task_flagdata.py', '/home/casatest/casa6/casatasks/tests/tasks/test_task_flagmanager.py', '/home/casatest/casa6/casatasks/tests/tasks/test_task_fluxscale.py', '/home/casatest/casa6/casatasks/tests/tasks/test_task_fringefit.py', '/home/casatest/casa6/casatasks/tests/tasks/test_task_ft.py', '/home/casatest/casa6/casatasks/tests/tasks/test_task_gaincal.py', '/home/casatest/casa6/casatasks/tests/tasks/test_task_gencal.py', '/home/casatest/casa6/casatasks/tests/tasks/test_task_getantposalma.py', '/home/casatest/casa6/casatasks/tests/tasks/test_task_getcalmodvla.py', '/home/casatest/casa6/casatasks/tests/tasks/test_task_getephemtable.py', '/home/casatest/casa6/casatasks/tests/tasks/test_task_getjyperkalma.py', '/home/casatest/casa6/casatasks/tests/tasks/test_task_hanningsmooth.py', '/home/casatest/casa6/casatasks/tests/tasks/test_task_imbaseline.py', '/home/casatest/casa6/casatasks/tests/tasks/test_task_imcollapse.py', '/home/casatest/casa6/casatasks/tests/tasks/test_task_imcontsub.py', '/home/casatest/casa6/casatasks/tests/tasks/test_task_imdev.py', '/home/casatest/casa6/casatasks/tests/tasks/test_task_imfit.py', '/home/casatest/casa6/casatasks/tests/tasks/test_task_imhead.py', '/home/casatest/casa6/casatasks/tests/tasks/test_task_imhistory.py', '/home/casatest/casa6/casatasks/tests/tasks/test_task_immath.py', '/home/casatest/casa6/casatasks/tests/tasks/test_task_immoments.py', '/home/casatest/casa6/casatasks/tests/tasks/test_task_impbcor.py', '/home/casatest/casa6/casatasks/tests/tasks/test_task_importasap.py', '/home/casatest/casa6/casatasks/tests/tasks/test_task_importasdm.py', '/home/casatest/casa6/casatasks/tests/tasks/test_task_importatca.py', '/home/casatest/casa6/casatasks/tests/tasks/test_task_importfitsidi.py', '/home/casatest/casa6/casatasks/tests/tasks/test_task_importmiriad.py', '/home/casatest/casa6/casatasks/tests/tasks/test_task_importnro.py', '/home/casatest/casa6/casatasks/tests/tasks/test_task_importuvfits.py', '/home/casatest/casa6/casatasks/tests/tasks/test_task_importvla.py', '/home/casatest/casa6/casatasks/tests/tasks/test_task_impv.py', '/home/casatest/casa6/casatasks/tests/tasks/test_task_imrebin.py', '/home/casatest/casa6/casatasks/tests/tasks/test_task_imreframe.py', '/home/casatest/casa6/casatasks/tests/tasks/test_task_imregrid.py', '/home/casatest/casa6/casatasks/tests/tasks/test_task_imsmooth.py', '/home/casatest/casa6/casatasks/tests/tasks/test_task_imstat.py', '/home/casatest/casa6/casatasks/tests/tasks/test_task_imsubimage.py', '/home/casatest/casa6/casatasks/tests/tasks/test_task_imtrans.py', '/home/casatest/casa6/casatasks/tests/tasks/test_task_imval.py', '/home/casatest/casa6/casatasks/tests/tasks/test_task_initweights.py', '/home/casatest/casa6/casatasks/tests/tasks/test_task_listcal.py', '/home/casatest/casa6/casatasks/tests/tasks/test_task_listfits.py', '/home/casatest/casa6/casatasks/tests/tasks/test_task_listhistory.py', '/home/casatest/casa6/casatasks/tests/tasks/test_task_listobs.py', '/home/casatest/casa6/casatasks/tests/tasks/test_task_listpartition.py', '/home/casatest/casa6/casatasks/tests/tasks/test_task_listsdm.py', '/home/casatest/casa6/casatasks/tests/tasks/test_task_listvis.py', '/home/casatest/casa6/casatasks/tests/tasks/test_task_makemask.py', '/home/casatest/casa6/casatasks/tests/tasks/test_task_mstransform.py', '/home/casatest/casa6/casatasks/tests/tasks/test_task_mstransform_mms.py', '/home/casatest/casa6/casatasks/tests/tasks/test_task_msuvbinflag.py', '/home/casatest/casa6/casatasks/tests/tasks/test_task_nrobeamaverage.py', '/home/casatest/casa6/casatasks/tests/tasks/test_task_partition.py', '/home/casatest/casa6/casatasks/tests/tasks/test_task_pccor.py', '/home/casatest/casa6/casatasks/tests/tasks/test_task_phaseshift.py', '/home/casatest/casa6/casatasks/tests/tasks/test_task_plotants.py', '/home/casatest/casa6/casatasks/tests/tasks/test_task_plotbandpass.py', '/home/casatest/casa6/casatasks/tests/tasks/test_task_plotprofilemap.py', '/home/casatest/casa6/casatasks/tests/tasks/test_task_plotweather.py', '/home/casatest/casa6/casatasks/tests/tasks/test_task_polcal.py', '/home/casatest/casa6/casatasks/tests/tasks/test_task_polfromgain.py', '/home/casatest/casa6/casatasks/tests/tasks/test_task_predictcomp.py', '/home/casatest/casa6/casatasks/tests/tasks/test_task_rerefant.py', '/home/casatest/casa6/casatasks/tests/tasks/test_task_rmfit.py', '/home/casatest/casa6/casatasks/tests/tasks/test_task_rmtables.py', '/home/casatest/casa6/casatasks/tests/tasks/test_task_sdatmcor.py', '/home/casatest/casa6/casatasks/tests/tasks/test_task_sdbaseline.py', '/home/casatest/casa6/casatasks/tests/tasks/test_task_sdcal.py', '/home/casatest/casa6/casatasks/tests/tasks/test_task_sdfit.py', '/home/casatest/casa6/casatasks/tests/tasks/test_task_sdfixscan.py', '/home/casatest/casa6/casatasks/tests/tasks/test_task_sdgaincal.py', '/home/casatest/casa6/casatasks/tests/tasks/test_task_sdintimaging.py', '/home/casatest/casa6/casatasks/tests/tasks/test_task_sdpolaverage.py', '/home/casatest/casa6/casatasks/tests/tasks/test_task_sdsidebandsplit.py', '/home/casatest/casa6/casatasks/tests/tasks/test_task_sdsmooth.py', '/home/casatest/casa6/casatasks/tests/tasks/test_task_sdtimeaverage.py', '/home/casatest/casa6/casatasks/tests/tasks/test_task_setjy.py', '/home/casatest/casa6/casatasks/tests/tasks/test_task_simanalyze.py', '/home/casatest/casa6/casatasks/tests/tasks/test_task_simobserve.py', '/home/casatest/casa6/casatasks/tests/tasks/test_task_slsearch.py', '/home/casatest/casa6/casatasks/tests/tasks/test_task_smoothcal.py', '/home/casatest/casa6/casatasks/tests/tasks/test_task_specfit.py', '/home/casatest/casa6/casatasks/tests/tasks/test_task_specflux.py', '/home/casatest/casa6/casatasks/tests/tasks/test_task_specsmooth.py', '/home/casatest/casa6/casatasks/tests/tasks/test_task_splattotable.py', '/home/casatest/casa6/casatasks/tests/tasks/test_task_split.py', '/home/casatest/casa6/casatasks/tests/tasks/test_task_spxfit.py', '/home/casatest/casa6/casatasks/tests/tasks/test_task_statwt.py', '/home/casatest/casa6/casatasks/tests/tasks/test_task_tclean.py', '/home/casatest/casa6/casatasks/tests/tasks/test_task_testconcat.py', '/home/casatest/casa6/casatasks/tests/tasks/test_task_tsdimaging.py', '/home/casatest/casa6/casatasks/tests/tasks/test_task_uvcontsub.py', '/home/casatest/casa6/casatasks/tests/tasks/test_task_uvcontsub_old.py', '/home/casatest/casa6/casatasks/tests/tasks/test_task_uvmodelfit.py', '/home/casatest/casa6/casatasks/tests/tasks/test_task_virtualconcat.py', '/home/casatest/casa6/casatasks/tests/tasks/test_task_vishead.py', '/home/casatest/casa6/casatasks/tests/tasks/test_task_visstat.py', '/home/casatest/casa6/casatasks/tests/tasks/test_task_wvrgcal.py', '/home/casatest/casa6/casatasks/tests/tasks/test_task_zenithdelaycal.py']============================= test session starts ==============================
28-Oct-2026 07:15:50 platform linux -- Python 3.12.9, pytest-9.2.0, pluggy-1.7.0 -- /home/casatest/venv/bin/python3.12
28-Oct-2026 07:15:50 cachedir: .pytest_cache
28-Oct-2026 07:15:50 rootdir: /home/casatest/casa6/casatestutils/nosedir/test_task_impbcor
28-Oct-2026 07:15:50 configfile: pytest.ini
28-Oct-2026 07:15:52 collecting ... collected 9 items
28-Oct-2026 07:15:52 INTERNALERROR> Traceback (most recent call last):
28-Oct-2026 07:15:52 INTERNALERROR>   File "/home/casatest/venv/lib/python3.12/site-packages/_pytest/main.py", line 333, in wrap_session
28-Oct-2026 07:15:52 INTERNALERROR>     session.exitstatus = doit(config, session) or 0
28-Oct-2026 07:15:52 INTERNALERROR>                          ^^^^^^^^^^^^^^^^^^^^^
28-Oct-2026 07:15:52 INTERNALERROR>   File "/home/casatest/venv/lib/python3.12/site-packages/_pytest/main.py", line 387, in _main
28-Oct-2026 07:15:52 INTERNALERROR>     config.hook.pytest_runtestloop(session=session)
28-Oct-2026 07:15:52 INTERNALERROR>   File "/home/casatest/venv/lib/python3.12/site-packages/pluggy/_caller.py", line 197, in __call__
28-Oct-2026 07:15:52 INTERNALERROR>     return self._hookexec(
28-Oct-2026 07:15:52 INTERNALERROR>            ^^^^^^^^^^^^^^^
28-Oct-2026 07:15:52 INTERNALERROR>   File "/home/casatest/venv/lib/python3.12/site-packages/pluggy/_manager.py", line 183, in _hookexec
28-Oct-2026 07:15:52 INTERNALERROR>     return self._inner_hookexec(hook_name, methods, kwargs, firstresult)
28-Oct-2026 07:15:52 INTERNALERROR>            ^^^^^^^^^^^^^^^^^^^^^^^^^^^^^^^^^^^^^^^^^^^^^^^^^^^^^^^^^^^^^
28-Oct-2026 07:15:52 INTERNALERROR>   File "/home/casatest/venv/lib/python3.12/site-packages/pluggy/_execution.py", line 195, in _multicall
28-Oct-2026 07:15:52 INTERNALERROR>     raise exception
28-Oct-2026 07:15:52 INTERNALERROR>   File "/home/casatest/venv/lib/python3.12/site-packages/pluggy/_execution.py", line 167, in _multicall
28-Oct-2026 07:15:52 INTERNALERROR>     teardown.throw(exception)
28-Oct-2026 07:15:52 INTERNALERROR>   File "/home/casatest/venv/lib/python3.12/site-packages/_pytest/logging.py", line 829, in pytest_runtestloop
28-Oct-2026 07:15:52 INTERNALERROR>     return (yield)  # Run all the tests.
28-Oct-2026 07:15:52 INTERNALERROR>             ^^^^^
28-Oct-2026 07:15:52 INTERNALERROR>   File "/home/casatest/venv/lib/python3.12/site-packages/pluggy/_execution.py", line 167, in _multicall
28-Oct-2026 07:15:52 INTERNALERROR>     teardown.throw(exception)
28-Oct-2026 07:15:52 INTERNALERROR>   File "/home/casatest/venv/lib/python3.12/site-packages/_pytest/terminal.py", line 723, in pytest_runtestloop
28-Oct-2026 07:15:52 INTERNALERROR>     result = yield
28-Oct-2026 07:15:52 INTERNALERROR>              ^^^^^
28-Oct-2026 07:15:52 INTERNALERROR>   File "/home/casatest/venv/lib/python3.12/site-packages/pluggy/_execution.py", line 147, in _multicall
28-Oct-2026 07:15:52 INTERNALERROR>     res = hook_impl.function(*args)
28-Oct-2026 07:15:52 INTERNALERROR>           ^^^^^^^^^^^^^^^^^^^^^^^^^
28-Oct-2026 07:15:52 INTERNALERROR>   File "/home/casatest/venv/lib/python3.12/site-packages/_pytest/main.py", line 411, in pytest_runtestloop
28-Oct-2026 07:15:52 INTERNALERROR>     item.config.hook.pytest_runtest_protocol(item=item, nextitem=nextitem)
28-Oct-2026 07:15:52 INTERNALERROR>   File "/home/casatest/venv/lib/python3.12/site-packages/pluggy/_caller.py", line 197, in __call__
28-Oct-2026 07:15:52 INTERNALERROR>     return self._hookexec(
28-Oct-2026 07:15:52 INTERNALERROR>            ^^^^^^^^^^^^^^^
28-Oct-2026 07:15:52 INTERNALERROR>   File "/home/casatest/venv/lib/python3.12/site-packages/pluggy/_manager.py", line 183, in _hookexec
28-Oct-2026 07:15:52 INTERNALERROR>     return self._inner_hookexec(hook_name, methods, kwargs, firstresult)
28-Oct-2026 07:15:52 INTERNALERROR>            ^^^^^^^^^^^^^^^^^^^^^^^^^^^^^^^^^^^^^^^^^^^^^^^^^^^^^^^^^^^^^
28-Oct-2026 07:15:52 INTERNALERROR>   File "/home/casatest/venv/lib/python3.12/site-packages/pluggy/_execution.py", line 195, in _multicall
28-Oct-2026 07:15:52 INTERNALERROR>     raise exception
28-Oct-2026 07:15:52 INTERNALERROR>   File "/home/casatest/venv/lib/python3.12/site-packages/pluggy/_execution.py", line 167, in _multicall
28-Oct-2026 07:15:52 INTERNALERROR>     teardown.throw(exception)
28-Oct-2026 07:15:52 INTERNALERROR>   File "/home/casatest/venv/lib/python3.12/site-packages/_pytest/warnings.py", line 75, in pytest_runtest_protocol
28-Oct-2026 07:15:52 INTERNALERROR>     return (yield)
28-Oct-2026 07:15:52 INTERNALERROR>             ^^^^^
28-Oct-2026 07:15:52 INTERNALERROR>   File "/home/casatest/venv/lib/python3.12/site-packages/pluggy/_execution.py", line 167, in _multicall
28-Oct-2026 07:15:52 INTERNALERROR>     teardown.throw(exception)
28-Oct-2026 07:15:52 INTERNALERROR>   File "/home/casatest/venv/lib/python3.12/site-packages/_pytest/assertion/__init__.py", line 212, in pytest_runtest_protocol
28-Oct-2026 07:15:52 INTERNALERROR>     return (yield)
28-Oct-2026 07:15:52 INTERNALERROR>             ^^^^^
28-Oct-2026 07:15:52 INTERNALERROR>   File "/home/casatest/venv/lib/python3.12/site-packages/pluggy/_execution.py", line 167, in _multicall
28-Oct-2026 07:15:52 INTERNALERROR>     teardown.throw(exception)
28-Oct-2026 07:15:52 INTERNALERROR>   File "/home/casatest/venv/lib/python3.12/site-packages/_pytest/unittest.py", line 610, in pytest_runtest_protocol
28-Oct-2026 07:15:52 INTERNALERROR>     return (yield)
28-Oct-2026 07:15:52 INTERNALERROR>             ^^^^^
28-Oct-2026 07:15:52 INTERNALERROR>   File "/home/casatest/venv/lib/python3.12/site-packages/pluggy/_execution.py", line 167, in _multicall
28-Oct-2026 07:15:52 INTERNALERROR>     teardown.throw(exception)
28-Oct-2026 07:15:52 INTERNALERROR>   File "/home/casatest/venv/lib/python3.12/site-packages/_pytest/faulthandler.py", line 102, in pytest_runtest_protocol
28-Oct-2026 07:15:52 INTERNALERROR>     return (yield)
28-Oct-2026 07:15:52 INTERNALERROR>             ^^^^^
28-Oct-2026 07:15:52 INTERNALERROR>   File "/home/casatest/venv/lib/python3.12/site-packages/pluggy/_execution.py", line 147, in _multicall
28-Oct-2026 07:15:52 INTERNALERROR>     res = hook_impl.function(*args)
28-Oct-2026 07:15:52 INTERNALERROR>           ^^^^^^^^^^^^^^^^^^^^^^^^^
28-Oct-2026 07:15:52 INTERNALERROR>   File "/home/casatest/casa6/casatestutils/nosedir/test_task_impbcor/conftest.py", line 24, in pytest_runtest_protocol
28-Oct-2026 07:15:52 INTERNALERROR>     self.funcn = item._nodeid
28-Oct-2026 07:15:52 INTERNALERROR>                  ^^^^^^^^^^^^
28-Oct-2026 07:15:52 INTERNALERROR> AttributeError: 'TestCaseFunction' object has no attribute '_nodeid'. Did you mean: 'nodeid'?
28-Oct-2026 07:15:52
28-Oct-2026 07:15:52 ============================== 1 warning in 2.12s ==============================
28-Oct-2026 07:15:52 Traceback (most recent call last):
28-Oct-2026 07:15:52   File "/home/casatest/casa6/casatestutils/runtest.py", line 1526, in <module>
28-Oct-2026 07:15:52     run(
28-Oct-2026 07:15:52   File "/home/casatest/casa6/casatestutils/runtest.py", line 1170, in run
28-Oct-2026 07:15:52     setup_and_run(cmd, workdir, workpath, dirname, DRY_RUN, pytest_args )
28-Oct-2026 07:15:52   File "/home/casatest/casa6/casatestutils/runtest.py", line 1016, in setup_and_run
28-Oct-2026 07:15:52     update_xml(xmlfile, result, name=os.getcwd().split("/")[-1])
28-Oct-2026 07:15:52   File "/home/casatest/casa6/casatestutils/runtest.py", line 581, in update_xml
28-Oct-2026 07:15:52     testclass = element.attrib["classname"].split(".")[1]
28-Oct-2026 07:15:52                 ~~~~~~~~~~~~~~~~~~~~~~~~~~~~~~~~~~~~~~^^^
28-Oct-2026 07:15:52 IndexError: list index out of range
28-Oct-2026 07:15:52
28-Oct-2026 07:15:52
28-Oct-2026 07:15:52 Setting Working Directory: /home/casatest/casa6/casatestutils/nosedir/test_task_impbcor/
28-Oct-2026 07:15:52 Test Directory: /home/casatest/casa6/casatestutils/nosedir/test_task_impbcor
28-Oct-2026 07:15:52
28-Oct-2026 07:15:52 Running Command: pytest --junitxml=/home/casatest/casa6/casatestutils/nosedir/xml/test_task_impbcor/nose.xml -s --disable-pytest-warnings --verbose -ra --tb=short /home/casatest/casa6/casatestutils/nosedir/test_task_impbcor/
28-Oct-2026 07:15:54 total 292784
28-Oct-2026 07:15:54 -rw-r--r-- 1 casaci 15001   1951039 Oct 28 07:13 casatasks-6.8.0.2-py3-none-any.whl
28-Oct-2026 07:15:54 -rw-r--r-- 1 casaci root      15704 Oct 28 07:15 casatasks_test.log
28-Oct-2026 07:15:54 -rw-r--r-- 1 casaci 15001    161031 Oct 28 07:13 casatestutils-6.8.0.2-py3-none-any.whl
28-Oct-2026 07:15:54 -rw-r--r-- 1 casaci 15001 297661657 Oct 28 07:13 casatools-6.8.0.2-cp312-cp312-manylinux_2_28_x86_64.whl
28-Oct-2026 07:15:54 -rw-r--r-- 1 casaci root        870 Oct 28 07:15 requirements.txt
28-Oct-2026 07:15:54 -rw-r--r-- 1 casaci root       4352 Oct 28 07:15 test_task_impbcor.xml
28-Oct-2026 07:15:54 Finished task 'Test wheel' with result: Success
28-Oct-2026 07:15:54 Starting task 'Inject is_641' of type 'com.atlassian.bamboo.plugins.bamboo-variable-inject-plugin:inject'
28-Oct-2026 07:15:54 Injected variable bamboo.inject.is_641=False in LOCAL scope
28-Oct-2026 07:15:54 Finished task 'Inject is_641' with result: Success
28-Oct-2026 07:15:54
Substituting variable: ${bamboo.planRepository.branchName} with master
28-Oct-2026 07:15:54 Starting task 'Tar work directory' of type 'com.atlassian.bamboo.plugins.scripttask:task.builder.script'
28-Oct-2026 07:15:54
Beginning to execute external process for build 'CASASPECS - Master Test GPU 3.12 - Test Tasks Many Linux 2.28 Rocky 8.10 Py3.12 #190 (CASASPECS-MASTERTESTGPUPY312-TTM228PY312-190)'
... running command line:
/export/cvpost134-nvme/casa/bamboohome/temp/CASASPECS-MASTERTESTGPUPY312-TTM228PY312-190-ScriptBuildTask-17923019547461567416.sh
... in: /export/cvpost134-nvme/casa/bamboohome/xml-data/build-dir/CASASPECS-MASTERTESTGPUPY312-TTM228PY312
28-Oct-2026 07:15:54 Package working directory
28-Oct-2026 07:15:54 tar: work: Cannot stat: No such file or directory
28-Oct-2026 07:15:54 tar: Exiting with failure status due to previous errors
28-Oct-2026 07:15:54 total 292788
28-Oct-2026 07:15:54 -rw-r--r-- 1 casaci 15001   1951039 Oct 28 07:13 casatasks-6.8.0.2-py3-none-any.whl
28-Oct-2026 07:15:54 -rw-r--r-- 1 casaci root      15704 Oct 28 07:15 casatasks_test.log
28-Oct-2026 07:15:54 -rw-r--r-- 1 casaci 15001    161031 Oct 28 07:13 casatestutils-6.8.0.2-py3-none-any.whl
28-Oct-2026 07:15:54 -rw-r--r-- 1 casaci 15001 297661657 Oct 28 07:13 casatools-6.8.0.2-cp312-cp312-manylinux_2_28_x86_64.whl
28-Oct-2026 07:15:54 -rw-r--r-- 1 casaci root        870 Oct 28 07:15 requirements.txt
28-Oct-2026 07:15:54 -rw-r--r-- 1 casaci root       4352 Oct 28 07:15 test_task_impbcor.xml
28-Oct-2026 07:15:54 -rw-r--r-- 1 casaci root         45 Oct 28 07:15 work-manylinux_228_casatasks-3.12.tar.gz
28-Oct-2026 07:15:54 Done packaging working directory
28-Oct-2026 07:15:54 Finished task 'Tar work directory' with result: Success
28-Oct-2026 07:15:54 Starting task 'Parse tests' of type 'com.atlassian.bamboo.plugins.testresultparser:task.testresultparser.junit'
28-Oct-2026 07:15:54 Parsing test results under /export/cvpost134-nvme/casa/bamboohome/xml-data/build-dir/CASASPECS-MASTERTESTGPUPY312-TTM228PY312...
28-Oct-2026 07:15:54 Failing task since 1 failing test cases were found.
28-Oct-2026 07:15:54 Finished task 'Parse tests' with result: Failed
28-Oct-2026 07:15:54 Starting task 'Cleanup' of type 'com.atlassian.bamboo.plugins.scripttask:task.builder.script'
28-Oct-2026 07:15:54
Beginning to execute external process for build 'CASASPECS - Master Test GPU 3.12 - Test Tasks Many Linux 2.28 Rocky 8.10 Py3.12 #190 (CASASPECS-MASTERTESTGPUPY312-TTM228PY312-190)'
... running command line:
/export/cvpost134-nvme/casa/bamboohome/temp/CASASPECS-MASTERTESTGPUPY312-TTM228PY312-190-ScriptBuildTask-6985172085854834010.sh
... in: /export/cvpost134-nvme/casa/bamboohome/xml-data/build-dir/CASASPECS-MASTERTESTGPUPY312-TTM228PY312
28-Oct-2026 07:15:54 Starting cleanup
28-Oct-2026 07:16:04 wheel-container-test
28-Oct-2026 07:16:09 wheel-container-test
28-Oct-2026 07:16:09 Cleanup complete
28-Oct-2026 07:16:09 Finished task 'Cleanup' with result: Success
28-Oct-2026 07:16:09 Running post build plugin 'Docker Container Cleanup'
28-Oct-2026 07:16:09 Running post build plugin 'NCover Results Collector'
28-Oct-2026 07:16:09 Running post build plugin 'Build Results Label Collector'
28-Oct-2026 07:16:09 Running post build plugin 'Clover Results Collector'
28-Oct-2026 07:16:09 Running post build plugin 'npm Cache Cleanup'
28-Oct-2026 07:16:09 Running post build plugin 'Artifact Copier'
28-Oct-2026 07:16:09 Publishing an artifact: XML Directories
28-Oct-2026 07:16:09 Finished publishing of artifact Non required job artifact Http Compression On : [XML Directories], patterns: [**/*.xml] anchored at: [wheeldirectory/] in 56.98 ms
28-Oct-2026 07:16:09 Publishing an artifact: requirements.txt
28-Oct-2026 07:16:09 Finished publishing of artifact Non required job artifact Http Compression On : [requirements.txt], patterns: [requirements.txt] anchored at: [wheeldirectory/] in 16.90 ms
28-Oct-2026 07:16:09 Finalising the build...
28-Oct-2026 07:16:09 Stopping timer.
28-Oct-2026 07:16:09 Build CASASPECS-MASTERTESTGPUPY312-TTM228PY312-190 completed.
28-Oct-2026 03:16:09 Running on server: post build plugin 'Build Hanging Detection Configuration'
28-Oct-2026 03:16:09 Running on server: post build plugin 'NCover Results Collector'
28-Oct-2026 03:16:09 Running on server: post build plugin 'Build Labeller'
28-Oct-2026 03:16:09 Running on server: post build plugin 'Clover Delta Calculator'
28-Oct-2026 03:16:09 Running on server: post build plugin 'Maven Dependencies Postprocessor'
28-Oct-2026 03:16:09 All post build plugins have finished
28-Oct-2026 03:16:09 Generating build results summary...
28-Oct-2026 03:16:09 Saving build results to disk...
28-Oct-2026 03:16:09 Store variable context...
28-Oct-2026 03:16:09 Finished building CASASPECS-MASTERTESTGPUPY312-TTM228PY312-190.